Diagnosed failure

Parameters/TestRpc.TestCallWithChainCertAndRootCA/SSL_UnixSocket: /data0/somelongdirectorytoavoidrpathissues/src/kudu/src/kudu/rpc/rpc-test.cc:303: Failure
Failed
Bad status: Runtime error: could not verify certificate chain (error with cert: subject=CN = localhost, ST = sadfjas, C = AS, emailAddress = sdflkdsajf, O = lskdfjlsad, OU = sldfkja, issuer=C = AS, ST = ASDfkjdhf, L = lskdjf, O = saldfja, OU = skdjf, CN = localhost, emailAddress = sadjflkadsj): : certificate has expired
Google Test trace:
/data0/somelongdirectorytoavoidrpathissues/src/kudu/src/kudu/rpc/rpc-test.cc:300: Connecting to unix:/tmp/dist-test-taskXpO7cl/test-tmp/rpc-test-130a5669dc104aa0b9466b322fd42ad8.sock
I20260925 10:08:23.429781 18282 test_util.cc:175] -----------------------------------------------
I20260925 10:08:23.429956 18282 test_util.cc:176] Had fatal failures, leaving test files at /tmp/dist-test-taskXpO7cl/test-tmp/rpc-test.2.Parameters_TestRpc.TestCallWithChainCertAndRootCA_SSL_UnixSocket.1790330899997836-18282-0

Full log

Note: This is test shard 3 of 8.
[==========] Running 21 tests from 2 test suites.
[----------] Global test environment set-up.
[----------] 1 test from TestRpc
[ RUN      ] TestRpc.TestNegotiationTimeout
WARNING: Logging before InitGoogleLogging() is written to STDERR
I20260925 10:08:20.187395 18282 rpc-test-base.h:595] status: Timed out: connection negotiation to 0.0.0.0:41181 for RPC Sleep timed out after 0.100s (ON_OUTBOUND_QUEUE), seconds elapsed: 0.101063
W20260925 10:08:23.109028 18292 negotiation.cc:337] Failed RPC negotiation. Trace:
0925 10:08:20.087138 (+     0us) reactor.cc:625] Submitting negotiation task for client connection to 0.0.0.0:41181 (local address 127.0.0.1:51676)
0925 10:08:20.087904 (+   766us) negotiation.cc:107] Waiting for socket to connect
0925 10:08:20.087954 (+    50us) client_negotiation.cc:174] Beginning negotiation
0925 10:08:20.100952 (+ 12998us) client_negotiation.cc:252] Sending NEGOTIATE NegotiatePB request
0925 10:08:23.107909 (+3006957us) negotiation.cc:327] Negotiation complete: Timed out: Client connection negotiation failed: client connection to 0.0.0.0:41181: received 0 of 4 requested bytes
Metrics: {"client-negotiator.queue_time_us":239}
[       OK ] TestRpc.TestNegotiationTimeout (3061 ms)
[----------] 1 test from TestRpc (3062 ms total)

[----------] 20 tests from Parameters/TestRpc
[ RUN      ] Parameters/TestRpc.TestAcceptorPoolStartStop/SSL_UnixSocket
I20260925 10:08:23.147534 18308 acceptor_pool.cc:254] collecting diagnostics on the listening RPC socket unix:/tmp/dist-test-taskXpO7cl/test-tmp/rpc-test-2a478163f07f4f33ab954ad72bc3a1ac.sock every 8 connection(s)
I20260925 10:08:23.149037 18309 acceptor_pool.cc:254] collecting diagnostics on the listening RPC socket unix:/tmp/dist-test-taskXpO7cl/test-tmp/rpc-test-2a478163f07f4f33ab954ad72bc3a1ac.sock every 8 connection(s)
I20260925 10:08:23.189493 18319 acceptor_pool.cc:254] collecting diagnostics on the listening RPC socket unix:/tmp/dist-test-taskXpO7cl/test-tmp/rpc-test-2a478163f07f4f33ab954ad72bc3a1ac.sock every 8 connection(s)
I20260925 10:08:23.190959 18320 acceptor_pool.cc:254] collecting diagnostics on the listening RPC socket unix:/tmp/dist-test-taskXpO7cl/test-tmp/rpc-test-2a478163f07f4f33ab954ad72bc3a1ac.sock every 8 connection(s)
I20260925 10:08:23.213229 18330 acceptor_pool.cc:254] collecting diagnostics on the listening RPC socket unix:/tmp/dist-test-taskXpO7cl/test-tmp/rpc-test-2a478163f07f4f33ab954ad72bc3a1ac.sock every 8 connection(s)
I20260925 10:08:23.214206 18331 acceptor_pool.cc:254] collecting diagnostics on the listening RPC socket unix:/tmp/dist-test-taskXpO7cl/test-tmp/rpc-test-2a478163f07f4f33ab954ad72bc3a1ac.sock every 8 connection(s)
I20260925 10:08:23.249169 18341 acceptor_pool.cc:254] collecting diagnostics on the listening RPC socket unix:/tmp/dist-test-taskXpO7cl/test-tmp/rpc-test-2a478163f07f4f33ab954ad72bc3a1ac.sock every 8 connection(s)
I20260925 10:08:23.249833 18342 acceptor_pool.cc:254] collecting diagnostics on the listening RPC socket unix:/tmp/dist-test-taskXpO7cl/test-tmp/rpc-test-2a478163f07f4f33ab954ad72bc3a1ac.sock every 8 connection(s)
I20260925 10:08:23.284354 18352 acceptor_pool.cc:254] collecting diagnostics on the listening RPC socket unix:/tmp/dist-test-taskXpO7cl/test-tmp/rpc-test-2a478163f07f4f33ab954ad72bc3a1ac.sock every 8 connection(s)
I20260925 10:08:23.285053 18353 acceptor_pool.cc:254] collecting diagnostics on the listening RPC socket unix:/tmp/dist-test-taskXpO7cl/test-tmp/rpc-test-2a478163f07f4f33ab954ad72bc3a1ac.sock every 8 connection(s)
[       OK ] Parameters/TestRpc.TestAcceptorPoolStartStop/SSL_UnixSocket (175 ms)
[ RUN      ] Parameters/TestRpc.TestCall/SSL_UnixSocket
I20260925 10:08:23.323728 18365 acceptor_pool.cc:254] collecting diagnostics on the listening RPC socket unix:/tmp/dist-test-taskXpO7cl/test-tmp/rpc-test-e49541d992ac447a8e5609c9ed43dc7b.sock every 8 connection(s)
I20260925 10:08:23.326651 18366 acceptor_pool.cc:254] collecting diagnostics on the listening RPC socket unix:/tmp/dist-test-taskXpO7cl/test-tmp/rpc-test-e49541d992ac447a8e5609c9ed43dc7b.sock every 8 connection(s)
I20260925 10:08:23.331995 18282 rpc-test.cc:234] Connecting to unix:/tmp/dist-test-taskXpO7cl/test-tmp/rpc-test-e49541d992ac447a8e5609c9ed43dc7b.sock
[       OK ] Parameters/TestRpc.TestCall/SSL_UnixSocket (101 ms)
[ RUN      ] Parameters/TestRpc.TestCallWithChainCertAndRootCA/SSL_UnixSocket
I20260925 10:08:23.408756 18390 acceptor_pool.cc:254] collecting diagnostics on the listening RPC socket unix:/tmp/dist-test-taskXpO7cl/test-tmp/rpc-test-130a5669dc104aa0b9466b322fd42ad8.sock every 8 connection(s)
I20260925 10:08:23.409498 18391 acceptor_pool.cc:254] collecting diagnostics on the listening RPC socket unix:/tmp/dist-test-taskXpO7cl/test-tmp/rpc-test-130a5669dc104aa0b9466b322fd42ad8.sock every 8 connection(s)
/data0/somelongdirectorytoavoidrpathissues/src/kudu/src/kudu/rpc/rpc-test.cc:303: Failure
Failed
Bad status: Runtime error: could not verify certificate chain (error with cert: subject=CN = localhost, ST = sadfjas, C = AS, emailAddress = sdflkdsajf, O = lskdfjlsad, OU = sldfkja, issuer=C = AS, ST = ASDfkjdhf, L = lskdjf, O = saldfja, OU = skdjf, CN = localhost, emailAddress = sadjflkadsj): : certificate has expired
Google Test trace:
/data0/somelongdirectorytoavoidrpathissues/src/kudu/src/kudu/rpc/rpc-test.cc:300: Connecting to unix:/tmp/dist-test-taskXpO7cl/test-tmp/rpc-test-130a5669dc104aa0b9466b322fd42ad8.sock
I20260925 10:08:23.429781 18282 test_util.cc:175] -----------------------------------------------
I20260925 10:08:23.429956 18282 test_util.cc:176] Had fatal failures, leaving test files at /tmp/dist-test-taskXpO7cl/test-tmp/rpc-test.2.Parameters_TestRpc.TestCallWithChainCertAndRootCA_SSL_UnixSocket.1790330899997836-18282-0
[  FAILED  ] Parameters/TestRpc.TestCallWithChainCertAndRootCA/SSL_UnixSocket, where GetParam() = (true, true) (39 ms)
[ RUN      ] Parameters/TestRpc.TestCallWithBadPasswordProtectedKey/SSL_UnixSocket
[       OK ] Parameters/TestRpc.TestCallWithBadPasswordProtectedKey/SSL_UnixSocket (29 ms)
[ RUN      ] Parameters/TestRpc.TestInvalidMethodCall/SSL_UnixSocket
I20260925 10:08:23.489250 18427 acceptor_pool.cc:254] collecting diagnostics on the listening RPC socket unix:/tmp/dist-test-taskXpO7cl/test-tmp/rpc-test-23c3a52772fe4aa6af14eef47c9a39fa.sock every 8 connection(s)
I20260925 10:08:23.490012 18428 acceptor_pool.cc:254] collecting diagnostics on the listening RPC socket unix:/tmp/dist-test-taskXpO7cl/test-tmp/rpc-test-23c3a52772fe4aa6af14eef47c9a39fa.sock every 8 connection(s)
I20260925 10:08:23.493625 18282 rpc-test.cc:406] Connecting to unix:/tmp/dist-test-taskXpO7cl/test-tmp/rpc-test-23c3a52772fe4aa6af14eef47c9a39fa.sock
W20260925 10:08:23.524645 18424 connection.cc:196] Error closing socket: Network error: TlsSocket::Close: Broken pipe
[       OK ] Parameters/TestRpc.TestInvalidMethodCall/SSL_UnixSocket (69 ms)
[ RUN      ] Parameters/TestRpc.TestHighFDs/SSL_UnixSocket
I20260925 10:08:23.740849 18452 acceptor_pool.cc:254] collecting diagnostics on the listening RPC socket unix:/tmp/dist-test-taskXpO7cl/test-tmp/rpc-test-27beb80441314ccd93409b6845cc23bc.sock every 8 connection(s)
I20260925 10:08:23.741516 18453 acceptor_pool.cc:254] collecting diagnostics on the listening RPC socket unix:/tmp/dist-test-taskXpO7cl/test-tmp/rpc-test-27beb80441314ccd93409b6845cc23bc.sock every 8 connection(s)
W20260925 10:08:23.775408 18449 connection.cc:196] Error closing socket: Network error: TlsSocket::Close: Broken pipe
[       OK ] Parameters/TestRpc.TestHighFDs/SSL_UnixSocket (257 ms)
[ RUN      ] Parameters/TestRpc.TestConnectionAlwaysKeepalive/SSL_UnixSocket
I20260925 10:08:23.819164 18475 acceptor_pool.cc:254] collecting diagnostics on the listening RPC socket unix:/tmp/dist-test-taskXpO7cl/test-tmp/rpc-test-3df512d89fef4dfe9855eddbff7e6f02.sock every 8 connection(s)
I20260925 10:08:23.819865 18476 acceptor_pool.cc:254] collecting diagnostics on the listening RPC socket unix:/tmp/dist-test-taskXpO7cl/test-tmp/rpc-test-3df512d89fef4dfe9855eddbff7e6f02.sock every 8 connection(s)
I20260925 10:08:23.822749 18282 rpc-test.cc:532] Connecting to unix:/tmp/dist-test-taskXpO7cl/test-tmp/rpc-test-3df512d89fef4dfe9855eddbff7e6f02.sock
[       OK ] Parameters/TestRpc.TestConnectionAlwaysKeepalive/SSL_UnixSocket (3073 ms)
[ RUN      ] Parameters/TestRpc.TestReopenOutboundConnections/SSL_UnixSocket
I20260925 10:08:26.880312 18498 acceptor_pool.cc:254] collecting diagnostics on the listening RPC socket unix:/tmp/dist-test-taskXpO7cl/test-tmp/rpc-test-e97bd0b279d5496fbda901c049a2c80b.sock every 8 connection(s)
I20260925 10:08:26.881034 18499 acceptor_pool.cc:254] collecting diagnostics on the listening RPC socket unix:/tmp/dist-test-taskXpO7cl/test-tmp/rpc-test-e97bd0b279d5496fbda901c049a2c80b.sock every 8 connection(s)
I20260925 10:08:26.884121 18282 rpc-test.cc:658] Connecting to unix:/tmp/dist-test-taskXpO7cl/test-tmp/rpc-test-e97bd0b279d5496fbda901c049a2c80b.sock
W20260925 10:08:26.912042 18497 connection.cc:196] Error closing socket: Network error: TlsSocket::Close: Broken pipe
W20260925 10:08:26.921665 18497 connection.cc:196] Error closing socket: Network error: TlsSocket::Close: Broken pipe
W20260925 10:08:26.931094 18497 connection.cc:196] Error closing socket: Network error: TlsSocket::Close: Broken pipe
W20260925 10:08:26.940668 18497 connection.cc:196] Error closing socket: Network error: TlsSocket::Close: Broken pipe
W20260925 10:08:26.949697 18497 connection.cc:196] Error closing socket: Network error: TlsSocket::Close: Broken pipe
W20260925 10:08:26.959136 18497 connection.cc:196] Error closing socket: Network error: TlsSocket::Close: Broken pipe
W20260925 10:08:26.969561 18497 connection.cc:196] Error closing socket: Network error: TlsSocket::Close: Broken pipe
W20260925 10:08:26.978910 18497 connection.cc:196] Error closing socket: Network error: TlsSocket::Close: Broken pipe
W20260925 10:08:26.989732 18497 connection.cc:196] Error closing socket: Network error: TlsSocket::Close: Broken pipe
W20260925 10:08:26.999663 18497 connection.cc:196] Error closing socket: Network error: TlsSocket::Close: Broken pipe
W20260925 10:08:27.009109 18497 connection.cc:196] Error closing socket: Network error: TlsSocket::Close: Broken pipe
W20260925 10:08:27.018921 18497 connection.cc:196] Error closing socket: Network error: TlsSocket::Close: Broken pipe
W20260925 10:08:27.029824 18497 connection.cc:196] Error closing socket: Network error: TlsSocket::Close: Broken pipe
W20260925 10:08:27.039876 18497 connection.cc:196] Error closing socket: Network error: TlsSocket::Close: Broken pipe
W20260925 10:08:27.039856 18498 acceptor_pool.cc:285] unable to collect diagnostics on RPC socket unix:/tmp/dist-test-taskXpO7cl/test-tmp/rpc-test-e97bd0b279d5496fbda901c049a2c80b.sock: Not implemented: netlink diagnostics is currently supported only on IPv4 TCP sockets
W20260925 10:08:27.051491 18497 connection.cc:196] Error closing socket: Network error: TlsSocket::Close: Broken pipe
W20260925 10:08:27.061203 18497 connection.cc:196] Error closing socket: Network error: TlsSocket::Close: Broken pipe
W20260925 10:08:27.071064 18497 connection.cc:196] Error closing socket: Network error: TlsSocket::Close: Broken pipe
W20260925 10:08:27.080483 18497 connection.cc:196] Error closing socket: Network error: TlsSocket::Close: Broken pipe
W20260925 10:08:27.089964 18497 connection.cc:196] Error closing socket: Network error: TlsSocket::Close: Broken pipe
W20260925 10:08:27.099447 18497 connection.cc:196] Error closing socket: Network error: TlsSocket::Close: Broken pipe
W20260925 10:08:27.109975 18497 connection.cc:196] Error closing socket: Network error: TlsSocket::Close: Broken pipe
W20260925 10:08:27.119517 18497 connection.cc:196] Error closing socket: Network error: TlsSocket::Close: Broken pipe
W20260925 10:08:27.128382 18497 connection.cc:196] Error closing socket: Network error: TlsSocket::Close: Broken pipe
W20260925 10:08:27.137395 18497 connection.cc:196] Error closing socket: Network error: TlsSocket::Close: Broken pipe
W20260925 10:08:27.145999 18497 connection.cc:196] Error closing socket: Network error: TlsSocket::Close: Broken pipe
W20260925 10:08:27.154623 18497 connection.cc:196] Error closing socket: Network error: TlsSocket::Close: Broken pipe
W20260925 10:08:27.163223 18497 connection.cc:196] Error closing socket: Network error: TlsSocket::Close: Broken pipe
W20260925 10:08:27.172068 18497 connection.cc:196] Error closing socket: Network error: TlsSocket::Close: Broken pipe
W20260925 10:08:27.181239 18497 connection.cc:196] Error closing socket: Network error: TlsSocket::Close: Broken pipe
W20260925 10:08:27.190666 18497 connection.cc:196] Error closing socket: Network error: TlsSocket::Close: Broken pipe
W20260925 10:08:27.200235 18497 connection.cc:196] Error closing socket: Network error: TlsSocket::Close: Broken pipe
[       OK ] Parameters/TestRpc.TestReopenOutboundConnections/SSL_UnixSocket (353 ms)
[ RUN      ] Parameters/TestRpc.TestConnectionNetworkPlane/SSL_UnixSocket
I20260925 10:08:27.227479 18521 acceptor_pool.cc:254] collecting diagnostics on the listening RPC socket unix:/tmp/dist-test-taskXpO7cl/test-tmp/rpc-test-15a14bbea82e4347aa2997046d2ff696.sock every 8 connection(s)
I20260925 10:08:27.228116 18522 acceptor_pool.cc:254] collecting diagnostics on the listening RPC socket unix:/tmp/dist-test-taskXpO7cl/test-tmp/rpc-test-15a14bbea82e4347aa2997046d2ff696.sock every 8 connection(s)
I20260925 10:08:27.231103 18282 rpc-test.cc:772] Connecting to unix:/tmp/dist-test-taskXpO7cl/test-tmp/rpc-test-15a14bbea82e4347aa2997046d2ff696.sock
W20260925 10:08:27.267858 18520 connection.cc:196] Error closing socket: Network error: TlsSocket::Close: Broken pipe
[       OK ] Parameters/TestRpc.TestConnectionNetworkPlane/SSL_UnixSocket (58 ms)
[ RUN      ] Parameters/TestRpc.TestTCPKeepalive/SSL_UnixSocket
I20260925 10:08:27.297261 18546 acceptor_pool.cc:254] collecting diagnostics on the listening RPC socket unix:/tmp/dist-test-taskXpO7cl/test-tmp/rpc-test-1f52d31c695b44f6a4b1d220050693cf.sock every 8 connection(s)
I20260925 10:08:27.297986 18547 acceptor_pool.cc:254] collecting diagnostics on the listening RPC socket unix:/tmp/dist-test-taskXpO7cl/test-tmp/rpc-test-1f52d31c695b44f6a4b1d220050693cf.sock every 8 connection(s)
I20260925 10:08:27.325059 18550 rpc-test-base.h:222] got call: sleep_micros: 8000000 deferred: true
I20260925 10:08:35.329068 18550 rpcz_store.cc:275] Call kudu.rpc.GenericCalculatorService.Sleep from unix:<unnamed> (request call id 0) took 8004 ms. Trace:
I20260925 10:08:35.329484 18550 rpcz_store.cc:276] 0925 10:08:27.324881 (+     0us) service_pool.cc:170] Inserting onto call queue
0925 10:08:27.325004 (+   123us) service_pool.cc:227] Handling call
0925 10:08:35.328893 (+8003889us) inbound_call.cc:173] Queueing success response
Metrics: {}
W20260925 10:08:35.334128 18543 connection.cc:196] Error closing socket: Network error: TlsSocket::Close: Broken pipe
[       OK ] Parameters/TestRpc.TestTCPKeepalive/SSL_UnixSocket (8069 ms)
[ RUN      ] Parameters/TestRpc.TestMaxSmallSidecars/SSL_UnixSocket
I20260925 10:08:35.371093 18572 acceptor_pool.cc:254] collecting diagnostics on the listening RPC socket unix:/tmp/dist-test-taskXpO7cl/test-tmp/rpc-test-e41e053d67264e68b783be5757abae76.sock every 8 connection(s)
I20260925 10:08:35.371915 18573 acceptor_pool.cc:254] collecting diagnostics on the listening RPC socket unix:/tmp/dist-test-taskXpO7cl/test-tmp/rpc-test-e41e053d67264e68b783be5757abae76.sock every 8 connection(s)
[       OK ] Parameters/TestRpc.TestMaxSmallSidecars/SSL_UnixSocket (197 ms)
[ RUN      ] Parameters/TestRpc.TestCallTimeout/SSL_UnixSocket
I20260925 10:08:35.564960 18597 acceptor_pool.cc:254] collecting diagnostics on the listening RPC socket unix:/tmp/dist-test-taskXpO7cl/test-tmp/rpc-test-5ee07c62deae4e739c23e421400fc4ea.sock every 8 connection(s)
I20260925 10:08:35.565651 18598 acceptor_pool.cc:254] collecting diagnostics on the listening RPC socket unix:/tmp/dist-test-taskXpO7cl/test-tmp/rpc-test-5ee07c62deae4e739c23e421400fc4ea.sock every 8 connection(s)
I20260925 10:08:35.593598 18282 rpc-test-base.h:595] status: Timed out: connection negotiation to unix:/tmp/dist-test-taskXpO7cl/test-tmp/rpc-test-5ee07c62deae4e739c23e421400fc4ea.sock for RPC Sleep timed out after 0.000s (ON_OUTBOUND_QUEUE), seconds elapsed: 0.00239957
I20260925 10:08:35.600932 18601 rpc-test-base.h:222] got call: sleep_micros: 700000
I20260925 10:08:35.794512 18282 rpc-test-base.h:595] status: Timed out: Sleep RPC to unix:/tmp/dist-test-taskXpO7cl/test-tmp/rpc-test-5ee07c62deae4e739c23e421400fc4ea.sock timed out after 0.200s (SENT), seconds elapsed: 0.200486
I20260925 10:08:35.795866 18600 rpc-test-base.h:222] got call: sleep_micros: 2000000
W20260925 10:08:36.301566 18601 rpcz_store.cc:267] Call kudu.rpc.GenericCalculatorService.Sleep from unix:<unnamed> (request call id 1) took 700 ms (client timeout 200 ms). Trace:
W20260925 10:08:36.301925 18601 rpcz_store.cc:269] 0925 10:08:35.600682 (+     0us) service_pool.cc:170] Inserting onto call queue
0925 10:08:35.600808 (+   126us) service_pool.cc:227] Handling call
0925 10:08:36.301502 (+700694us) inbound_call.cc:173] Queueing success response
Metrics: {}
I20260925 10:08:37.296366 18282 rpc-test-base.h:595] status: Timed out: Sleep RPC to unix:/tmp/dist-test-taskXpO7cl/test-tmp/rpc-test-5ee07c62deae4e739c23e421400fc4ea.sock timed out after 1.500s (SENT), seconds elapsed: 1.50152
W20260925 10:08:37.796394 18600 rpcz_store.cc:267] Call kudu.rpc.GenericCalculatorService.Sleep from unix:<unnamed> (request call id 2) took 2000 ms (client timeout 1500 ms). Trace:
W20260925 10:08:37.796700 18600 rpcz_store.cc:269] 0925 10:08:35.795700 (+     0us) service_pool.cc:170] Inserting onto call queue
0925 10:08:35.795804 (+   104us) service_pool.cc:227] Handling call
0925 10:08:37.796311 (+2000507us) inbound_call.cc:173] Queueing success response
Metrics: {}
W20260925 10:08:37.797272 18594 connection.cc:441] server connection from unix:<unnamed> torn down before Call kudu.rpc.GenericCalculatorService.Sleep from unix:<unnamed> (request call id 2) could send its response
[       OK ] Parameters/TestRpc.TestCallTimeout/SSL_UnixSocket (2262 ms)
[ RUN      ] Parameters/TestRpc.TestServerShutsDown/SSL_UnixSocket
I20260925 10:08:37.804044 18282 rpc-test.cc:1125] Connecting to 0.0.0.0:43345
W20260925 10:08:37.813088 18614 negotiation.cc:337] Failed RPC negotiation. Trace:
0925 10:08:37.811639 (+     0us) reactor.cc:625] Submitting negotiation task for client connection to 0.0.0.0:43345 (local address 127.0.0.1:46386)
0925 10:08:37.812066 (+   427us) negotiation.cc:107] Waiting for socket to connect
0925 10:08:37.812097 (+    31us) client_negotiation.cc:174] Beginning negotiation
0925 10:08:37.812316 (+   219us) client_negotiation.cc:252] Sending NEGOTIATE NegotiatePB request
0925 10:08:37.812585 (+   269us) negotiation.cc:327] Negotiation complete: Network error: Client connection negotiation failed: client connection to 0.0.0.0:43345: BlockingWrite error: write error: Broken pipe (error 32)
Metrics: {"client-negotiator.queue_time_us":101}
[       OK ] Parameters/TestRpc.TestServerShutsDown/SSL_UnixSocket (12 ms)
[ RUN      ] Parameters/TestRpc.TimedOutOnResponseMetric/SSL_UnixSocket
I20260925 10:08:37.846274 18631 acceptor_pool.cc:254] collecting diagnostics on the listening RPC socket unix:/tmp/dist-test-taskXpO7cl/test-tmp/rpc-test-712bb48e998544b78be8b15cf7dc1f25.sock every 8 connection(s)
I20260925 10:08:37.846956 18632 acceptor_pool.cc:254] collecting diagnostics on the listening RPC socket unix:/tmp/dist-test-taskXpO7cl/test-tmp/rpc-test-712bb48e998544b78be8b15cf7dc1f25.sock every 8 connection(s)
W20260925 10:08:38.100581 18635 rpcz_store.cc:267] Call kudu.rpc_test.CalculatorService.Sleep from unix:<unnamed> (request call id 3) took 50 ms (client timeout 25 ms). Trace:
W20260925 10:08:38.100864 18635 rpcz_store.cc:269] 0925 10:08:38.050019 (+     0us) service_pool.cc:170] Inserting onto call queue
0925 10:08:38.050147 (+   128us) service_pool.cc:227] Handling call
0925 10:08:38.100508 (+ 50361us) inbound_call.cc:173] Queueing success response
Related trace 'test_child':
Metrics: {"test_sleep_us":50000,"child_traces":[["test_child",{"related_trace_metric":1}]]}
W20260925 10:08:38.159833 18635 rpcz_store.cc:267] Call kudu.rpc_test.CalculatorService.Sleep from unix:<unnamed> (request call id 4) took 50 ms (client timeout 50 ms). Trace:
W20260925 10:08:38.160149 18635 rpcz_store.cc:269] 0925 10:08:38.109279 (+     0us) service_pool.cc:170] Inserting onto call queue
0925 10:08:38.109418 (+   139us) service_pool.cc:227] Handling call
0925 10:08:38.159772 (+ 50354us) inbound_call.cc:173] Queueing success response
Related trace 'test_child':
Metrics: {"test_sleep_us":50000,"child_traces":[["test_child",{"related_trace_metric":1}]]}
W20260925 10:08:38.162089 18628 connection.cc:441] server connection from unix:<unnamed> torn down before Call kudu.rpc_test.CalculatorService.Sleep from unix:<unnamed> (request call id 4) could send its response
[       OK ] Parameters/TestRpc.TimedOutOnResponseMetric/SSL_UnixSocket (352 ms)
[ RUN      ] Parameters/TestRpc.AcceptorDispatchingTimesMetric/SSL_UnixSocket
I20260925 10:08:38.178647 18656 acceptor_pool.cc:254] collecting diagnostics on the listening RPC socket 0.0.0.0:38391 every 8 connection(s)
I20260925 10:08:38.179275 18657 acceptor_pool.cc:254] collecting diagnostics on the listening RPC socket 0.0.0.0:38391 every 8 connection(s)
W20260925 10:08:38.185540 18652 negotiation.cc:337] Failed RPC negotiation. Trace:
0925 10:08:38.183518 (+     0us) reactor.cc:625] Submitting negotiation task for server connection from 127.0.0.1:57048 (local address 127.0.0.1:38391)
0925 10:08:38.184012 (+   494us) server_negotiation.cc:206] Beginning negotiation
0925 10:08:38.184043 (+    31us) server_negotiation.cc:399] Waiting for connection header
0925 10:08:38.184390 (+   347us) negotiation.cc:327] Negotiation complete: Network error: Server connection negotiation failed: server connection from 127.0.0.1:57048: BlockingRecv error: recv got EOF from 127.0.0.1:57048 (error 108)
Metrics: {"server-negotiator.queue_time_us":111}
[       OK ] Parameters/TestRpc.AcceptorDispatchingTimesMetric/SSL_UnixSocket (20 ms)
[ RUN      ] Parameters/TestRpc.TestRpcCallbackDestroysMessenger/SSL_UnixSocket
[       OK ] Parameters/TestRpc.TestRpcCallbackDestroysMessenger/SSL_UnixSocket (48 ms)
[ RUN      ] Parameters/TestRpc.TestApplicationFeatureFlag/SSL_UnixSocket
I20260925 10:08:38.265751 18681 acceptor_pool.cc:254] collecting diagnostics on the listening RPC socket unix:/tmp/dist-test-taskXpO7cl/test-tmp/rpc-test-16789f7e6dfa4d73a3720fd42da0e0ba.sock every 8 connection(s)
I20260925 10:08:38.266440 18682 acceptor_pool.cc:254] collecting diagnostics on the listening RPC socket unix:/tmp/dist-test-taskXpO7cl/test-tmp/rpc-test-16789f7e6dfa4d73a3720fd42da0e0ba.sock every 8 connection(s)
W20260925 10:08:38.316447 18678 messenger.cc:357] Unable to handle RPC call: Not implemented: call requires unsupported application feature flags: 99
[       OK ] Parameters/TestRpc.TestApplicationFeatureFlag/SSL_UnixSocket (86 ms)
[ RUN      ] Parameters/TestRpc.TestCancellation/SSL_UnixSocket
I20260925 10:08:38.342265 18706 acceptor_pool.cc:254] collecting diagnostics on the listening RPC socket unix:/tmp/dist-test-taskXpO7cl/test-tmp/rpc-test-35e531ad5bdb447c879dbdd87c027d80.sock every 8 connection(s)
I20260925 10:08:38.342924 18707 acceptor_pool.cc:254] collecting diagnostics on the listening RPC socket unix:/tmp/dist-test-taskXpO7cl/test-tmp/rpc-test-35e531ad5bdb447c879dbdd87c027d80.sock every 8 connection(s)
I20260925 10:08:38.345878 18282 rpc-test.cc:1648] Connecting to unix:/tmp/dist-test-taskXpO7cl/test-tmp/rpc-test-35e531ad5bdb447c879dbdd87c027d80.sock
I20260925 10:08:38.450616 18282 rpc-test-base.h:595] status: Aborted: Sleep RPC to unix:/tmp/dist-test-taskXpO7cl/test-tmp/rpc-test-35e531ad5bdb447c879dbdd87c027d80.sock is cancelled in state READY, seconds elapsed: 0.000334762
I20260925 10:08:38.634684 18282 rpc-test-base.h:595] status: Aborted: Sleep RPC to unix:/tmp/dist-test-taskXpO7cl/test-tmp/rpc-test-35e531ad5bdb447c879dbdd87c027d80.sock is cancelled in state SENT, seconds elapsed: 0.000883284
I20260925 10:08:38.634965 18709 rpc-test-base.h:222] got call: sleep_micros: 510000
I20260925 10:08:38.809064 18282 rpc-test-base.h:595] status: Aborted: Sleep RPC to unix:/tmp/dist-test-taskXpO7cl/test-tmp/rpc-test-35e531ad5bdb447c879dbdd87c027d80.sock is cancelled in state SENT, seconds elapsed: 0.000911298
I20260925 10:08:38.809255 18708 rpc-test-base.h:222] got call: sleep_micros: 510000
I20260925 10:08:38.973933 18282 rpc-test-base.h:595] status: Aborted: Sleep RPC to unix:/tmp/dist-test-taskXpO7cl/test-tmp/rpc-test-35e531ad5bdb447c879dbdd87c027d80.sock is cancelled in state SENT, seconds elapsed: 0.000636293
W20260925 10:08:38.984809 18710 rpcz_store.cc:267] Call kudu.rpc.GenericCalculatorService.Sleep from unix:<unnamed> (request call id 11) took 10 ms (client timeout 10 ms). Trace:
W20260925 10:08:38.985116 18710 rpcz_store.cc:269] 0925 10:08:38.974081 (+     0us) service_pool.cc:170] Inserting onto call queue
0925 10:08:38.984533 (+ 10452us) service_pool.cc:214] Skipping call since client already timed out
0925 10:08:38.984641 (+   108us) inbound_call.cc:173] Queueing failure response
Metrics: {}
I20260925 10:08:38.985620 18710 rpc-test-base.h:222] got call: sleep_micros: 1500000
W20260925 10:08:39.145574 18709 rpcz_store.cc:267] Call kudu.rpc.GenericCalculatorService.Sleep from unix:<unnamed> (request call id 3) took 510 ms (client timeout 10 ms). Trace:
W20260925 10:08:39.145887 18709 rpcz_store.cc:269] 0925 10:08:38.634756 (+     0us) service_pool.cc:170] Inserting onto call queue
0925 10:08:38.634911 (+   155us) service_pool.cc:227] Handling call
0925 10:08:39.145517 (+510606us) inbound_call.cc:173] Queueing success response
Metrics: {}
W20260925 10:08:39.319881 18708 rpcz_store.cc:267] Call kudu.rpc.GenericCalculatorService.Sleep from unix:<unnamed> (request call id 7) took 510 ms (client timeout 10 ms). Trace:
W20260925 10:08:39.320212 18708 rpcz_store.cc:269] 0925 10:08:38.809093 (+     0us) service_pool.cc:170] Inserting onto call queue
0925 10:08:38.809202 (+   109us) service_pool.cc:227] Handling call
0925 10:08:39.319820 (+510618us) inbound_call.cc:173] Queueing success response
Metrics: {}
I20260925 10:08:39.975287 18282 rpc-test-base.h:595] status: Timed out: Sleep RPC to unix:/tmp/dist-test-taskXpO7cl/test-tmp/rpc-test-35e531ad5bdb447c879dbdd87c027d80.sock timed out after 1.000s (SENT), seconds elapsed: 1.00105
I20260925 10:08:39.976563 18708 rpc-test-base.h:222] got call: sleep_micros: 1500000
W20260925 10:08:40.486399 18710 rpcz_store.cc:267] Call kudu.rpc.GenericCalculatorService.Sleep from unix:<unnamed> (request call id 12) took 1511 ms (client timeout 1000 ms). Trace:
W20260925 10:08:40.486820 18710 rpcz_store.cc:269] 0925 10:08:38.974923 (+     0us) service_pool.cc:170] Inserting onto call queue
0925 10:08:38.985592 (+ 10669us) service_pool.cc:227] Handling call
0925 10:08:40.486233 (+1500641us) inbound_call.cc:173] Queueing success response
Metrics: {}
I20260925 10:08:40.977470 18282 rpc-test-base.h:595] status: Timed out: Sleep RPC to unix:/tmp/dist-test-taskXpO7cl/test-tmp/rpc-test-35e531ad5bdb447c879dbdd87c027d80.sock timed out after 1.000s (SENT), seconds elapsed: 1.00169
W20260925 10:08:40.979144 18703 messenger.cc:357] Unable to handle RPC call: Not implemented: call requires unsupported application feature flags: 99, 1
W20260925 10:08:40.980567 18703 messenger.cc:357] Unable to handle RPC call: Not implemented: call requires unsupported application feature flags: 99, 1
W20260925 10:08:41.182396 18703 connection.cc:196] Error closing socket: Network error: TlsSocket::Close: Broken pipe
W20260925 10:08:41.477188 18708 rpcz_store.cc:267] Call kudu.rpc.GenericCalculatorService.Sleep from unix:<unnamed> (request call id 13) took 1500 ms (client timeout 1000 ms). Trace:
W20260925 10:08:41.477527 18708 rpcz_store.cc:269] 0925 10:08:39.976404 (+     0us) service_pool.cc:170] Inserting onto call queue
0925 10:08:39.976515 (+   111us) service_pool.cc:227] Handling call
0925 10:08:41.477051 (+1500536us) inbound_call.cc:173] Queueing success response
Metrics: {}
W20260925 10:08:41.478091 18703 connection.cc:441] server connection from unix:<unnamed> torn down before Call kudu.rpc.GenericCalculatorService.Sleep from unix:<unnamed> (request call id 13) could send its response
[       OK ] Parameters/TestRpc.TestCancellation/SSL_UnixSocket (3161 ms)
[ RUN      ] Parameters/TestRpc.TestCancellationMultiThreads/SSL_UnixSocket
I20260925 10:08:41.511543 18732 acceptor_pool.cc:254] collecting diagnostics on the listening RPC socket unix:/tmp/dist-test-taskXpO7cl/test-tmp/rpc-test-f7b5d5cd8c9e492ba7c6511475e8c59d.sock every 8 connection(s)
I20260925 10:08:41.512370 18733 acceptor_pool.cc:254] collecting diagnostics on the listening RPC socket unix:/tmp/dist-test-taskXpO7cl/test-tmp/rpc-test-f7b5d5cd8c9e492ba7c6511475e8c59d.sock every 8 connection(s)
I20260925 10:08:41.515290 18282 rpc-test.cc:1808] Connecting to unix:/tmp/dist-test-taskXpO7cl/test-tmp/rpc-test-f7b5d5cd8c9e492ba7c6511475e8c59d.sock
I20260925 10:08:41.652879 18746 test_util.cc:268] Using random seed: -425881061
I20260925 10:08:41.653844 18747 test_util.cc:268] Using random seed: -425880008
I20260925 10:08:41.655064 18748 test_util.cc:268] Using random seed: -425878862
I20260925 10:08:41.656239 18749 test_util.cc:268] Using random seed: -425877624
I20260925 10:08:41.657826 18750 test_util.cc:268] Using random seed: -425876154
I20260925 10:08:41.659356 18751 test_util.cc:268] Using random seed: -425874779
I20260925 10:08:41.661712 18752 test_util.cc:268] Using random seed: -425872266
I20260925 10:08:41.663221 18753 test_util.cc:268] Using random seed: -425870765
I20260925 10:08:41.664554 18754 test_util.cc:268] Using random seed: -425869429
I20260925 10:08:41.667501 18755 test_util.cc:268] Using random seed: -425866572
I20260925 10:08:41.668919 18756 test_util.cc:268] Using random seed: -425865036
I20260925 10:08:41.670321 18757 test_util.cc:268] Using random seed: -425863667
I20260925 10:08:41.671819 18758 test_util.cc:268] Using random seed: -425862139
I20260925 10:08:41.675314 18759 test_util.cc:268] Using random seed: -425858757
I20260925 10:08:41.678442 18760 test_util.cc:268] Using random seed: -425855598
I20260925 10:08:41.684487 18761 test_util.cc:268] Using random seed: -425849547
I20260925 10:08:41.686332 18762 test_util.cc:268] Using random seed: -425847696
I20260925 10:08:41.696195 18763 test_util.cc:268] Using random seed: -425837812
I20260925 10:08:41.698716 18764 test_util.cc:268] Using random seed: -425835304
I20260925 10:08:41.712399 18765 test_util.cc:268] Using random seed: -425821647
I20260925 10:08:41.714064 18766 test_util.cc:268] Using random seed: -425820069
I20260925 10:08:41.715997 18767 test_util.cc:268] Using random seed: -425818101
I20260925 10:08:41.718972 18768 test_util.cc:268] Using random seed: -425815076
I20260925 10:08:41.720708 18769 test_util.cc:268] Using random seed: -425813294
I20260925 10:08:41.723335 18770 test_util.cc:268] Using random seed: -425810707
I20260925 10:08:41.725554 18771 test_util.cc:268] Using random seed: -425808464
I20260925 10:08:41.727202 18772 test_util.cc:268] Using random seed: -425806786
I20260925 10:08:41.729362 18773 test_util.cc:268] Using random seed: -425805131
I20260925 10:08:41.731384 18774 test_util.cc:268] Using random seed: -425802759
I20260925 10:08:41.733018 18775 test_util.cc:268] Using random seed: -425800974
W20260925 10:09:00.532236 18729 connection.cc:196] Error closing socket: Network error: TlsSocket::Close: Broken pipe
[       OK ] Parameters/TestRpc.TestCancellationMultiThreads/SSL_UnixSocket (19062 ms)
[ RUN      ] Parameters/TestRpc.TestCallId/SSL_UnixSocket
I20260925 10:09:00.582744 18789 acceptor_pool.cc:254] collecting diagnostics on the listening RPC socket unix:/tmp/dist-test-taskXpO7cl/test-tmp/rpc-test-833ce7bc721f44e5a6bf9214ee0a1d63.sock every 8 connection(s)
I20260925 10:09:00.583590 18790 acceptor_pool.cc:254] collecting diagnostics on the listening RPC socket unix:/tmp/dist-test-taskXpO7cl/test-tmp/rpc-test-833ce7bc721f44e5a6bf9214ee0a1d63.sock every 8 connection(s)
W20260925 10:09:00.619793 18786 connection.cc:196] Error closing socket: Network error: TlsSocket::Close: Broken pipe
[       OK ] Parameters/TestRpc.TestCallId/SSL_UnixSocket (78 ms)
[----------] 20 tests from Parameters/TestRpc (37514 ms total)

[----------] Global test environment tear-down
[==========] 21 tests from 2 test suites ran. (40577 ms total)
[  PASSED  ] 20 tests.
[  FAILED  ] 1 test, listed below:
[  FAILED  ] Parameters/TestRpc.TestCallWithChainCertAndRootCA/SSL_UnixSocket, where GetParam() = (true, true)

 1 FAILED TEST
I20260925 10:09:00.644199 18282 logging.cc:424] LogThrottler /data0/somelongdirectorytoavoidrpathissues/src/kudu/src/kudu/rpc/acceptor_pool.cc:285: suppressed but not reported on 3 messages since previous log ~33 seconds ago