Diagnosed failure

Parameters/TestRpc.TestCallWithChainCertAndChainCA/SSL_TCP: /data0/somelongdirectorytoavoidrpathissues/src/kudu/src/kudu/rpc/rpc-test.cc:270: Failure
Failed
Bad status: Runtime error: could not verify certificate chain (error with cert: subject=CN = localhost, ST = sadfjas, C = AS, emailAddress = sdflkdsajf, O = lskdfjlsad, OU = sldfkja, issuer=C = AS, ST = ASDfkjdhf, L = lskdjf, O = saldfja, OU = skdjf, CN = localhost, emailAddress = sadjflkadsj): : certificate has expired
Google Test trace:
/data0/somelongdirectorytoavoidrpathissues/src/kudu/src/kudu/rpc/rpc-test.cc:267: Connecting to 0.0.0.0:37037
I20260925 22:40:02.093523  1269 test_util.cc:175] -----------------------------------------------
I20260925 22:40:02.093596  1269 test_util.cc:176] Had fatal failures, leaving test files at /tmp/dist-test-taskkQznWG/test-tmp/rpc-test.5.Parameters_TestRpc.TestCallWithChainCertAndChainCA_SSL_TCP.1790376001973276-1269-0

Full log

Note: This is test shard 6 of 8.
[==========] Running 21 tests from 2 test suites.
[----------] Global test environment set-up.
[----------] 20 tests from Parameters/TestRpc
[ RUN      ] Parameters/TestRpc.TestMessengerCreateDestroy/SSL_TCP
WARNING: Logging before InitGoogleLogging() is written to STDERR
I20260925 22:40:02.033524  1269 rpc-test.cc:169] started messenger TestCreateDestroy
[       OK ] Parameters/TestRpc.TestMessengerCreateDestroy/SSL_TCP (55 ms)
[ RUN      ] Parameters/TestRpc.TestNegotiationDeadlock/SSL_TCP
I20260925 22:40:02.067401  1289 acceptor_pool.cc:254] collecting diagnostics on the listening RPC socket 0.0.0.0:44133 every 8 connection(s)
I20260925 22:40:02.067422  1290 acceptor_pool.cc:254] collecting diagnostics on the listening RPC socket 0.0.0.0:44133 every 8 connection(s)
[       OK ] Parameters/TestRpc.TestNegotiationDeadlock/SSL_TCP (44 ms)
[ RUN      ] Parameters/TestRpc.TestCallWithChainCertAndChainCA/SSL_TCP
I20260925 22:40:02.088268  1305 acceptor_pool.cc:254] collecting diagnostics on the listening RPC socket 0.0.0.0:37037 every 8 connection(s)
I20260925 22:40:02.088285  1306 acceptor_pool.cc:254] collecting diagnostics on the listening RPC socket 0.0.0.0:37037 every 8 connection(s)
/data0/somelongdirectorytoavoidrpathissues/src/kudu/src/kudu/rpc/rpc-test.cc:270: Failure
Failed
Bad status: Runtime error: could not verify certificate chain (error with cert: subject=CN = localhost, ST = sadfjas, C = AS, emailAddress = sdflkdsajf, O = lskdfjlsad, OU = sldfkja, issuer=C = AS, ST = ASDfkjdhf, L = lskdjf, O = saldfja, OU = skdjf, CN = localhost, emailAddress = sadjflkadsj): : certificate has expired
Google Test trace:
/data0/somelongdirectorytoavoidrpathissues/src/kudu/src/kudu/rpc/rpc-test.cc:267: Connecting to 0.0.0.0:37037
I20260925 22:40:02.093523  1269 test_util.cc:175] -----------------------------------------------
I20260925 22:40:02.093596  1269 test_util.cc:176] Had fatal failures, leaving test files at /tmp/dist-test-taskkQznWG/test-tmp/rpc-test.5.Parameters_TestRpc.TestCallWithChainCertAndChainCA_SSL_TCP.1790376001973276-1269-0
[  FAILED  ] Parameters/TestRpc.TestCallWithChainCertAndChainCA/SSL_TCP, where GetParam() = (true, false) (13 ms)
[ RUN      ] Parameters/TestRpc.TestCallWithPasswordProtectedKey/SSL_TCP
I20260925 22:40:02.108034  1330 acceptor_pool.cc:254] collecting diagnostics on the listening RPC socket 0.0.0.0:45015 every 8 connection(s)
I20260925 22:40:02.108055  1331 acceptor_pool.cc:254] collecting diagnostics on the listening RPC socket 0.0.0.0:45015 every 8 connection(s)
[       OK ] Parameters/TestRpc.TestCallWithPasswordProtectedKey/SSL_TCP (31 ms)
[ RUN      ] Parameters/TestRpc.TestCallToBadServer/SSL_TCP
I20260925 22:40:02.141770  1269 rpc-test.cc:394] Status: Network error: Client connection negotiation failed: client connection to 0.0.0.0:0: connect: Connection refused (error 111)
I20260925 22:40:02.142349  1269 rpc-test.cc:394] Status: Network error: Client connection negotiation failed: client connection to 0.0.0.0:0: connect: Connection refused (error 111)
I20260925 22:40:02.142871  1269 rpc-test.cc:394] Status: Network error: Client connection negotiation failed: client connection to 0.0.0.0:0: connect: Connection refused (error 111)
I20260925 22:40:02.143411  1269 rpc-test.cc:394] Status: Network error: Client connection negotiation failed: client connection to 0.0.0.0:0: connect: Connection refused (error 111)
I20260925 22:40:02.143949  1269 rpc-test.cc:394] Status: Network error: Client connection negotiation failed: client connection to 0.0.0.0:0: connect: Connection refused (error 111)
[       OK ] Parameters/TestRpc.TestCallToBadServer/SSL_TCP (19 ms)
[ RUN      ] Parameters/TestRpc.TestWrongService/SSL_TCP
I20260925 22:40:02.158305  1365 acceptor_pool.cc:254] collecting diagnostics on the listening RPC socket 0.0.0.0:41933 every 8 connection(s)
I20260925 22:40:02.158317  1366 acceptor_pool.cc:254] collecting diagnostics on the listening RPC socket 0.0.0.0:41933 every 8 connection(s)
I20260925 22:40:02.168633  1362 messenger.cc:345] service WrongServiceName not registered on TestServer
[       OK ] Parameters/TestRpc.TestWrongService/SSL_TCP (26 ms)
[ RUN      ] Parameters/TestRpc.TestConnectionKeepalive/SSL_TCP
I20260925 22:40:02.191819  1388 acceptor_pool.cc:254] collecting diagnostics on the listening RPC socket 0.0.0.0:37907 every 8 connection(s)
I20260925 22:40:02.191839  1389 acceptor_pool.cc:254] collecting diagnostics on the listening RPC socket 0.0.0.0:37907 every 8 connection(s)
I20260925 22:40:02.192121  1269 rpc-test.cc:488] Connecting to 0.0.0.0:37907
[       OK ] Parameters/TestRpc.TestConnectionKeepalive/SSL_TCP (1048 ms)
[ RUN      ] Parameters/TestRpc.TestClientConnectionMetrics/SSL_TCP
I20260925 22:40:03.234923  1413 acceptor_pool.cc:254] collecting diagnostics on the listening RPC socket 0.0.0.0:33131 every 8 connection(s)
I20260925 22:40:03.234941  1414 acceptor_pool.cc:254] collecting diagnostics on the listening RPC socket 0.0.0.0:33131 every 8 connection(s)
I20260925 22:40:03.235216  1269 rpc-test.cc:569] Connecting to 0.0.0.0:33131
[       OK ] Parameters/TestRpc.TestClientConnectionMetrics/SSL_TCP (11219 ms)
[ RUN      ] Parameters/TestRpc.TestCredentialsPolicy/SSL_TCP
I20260925 22:40:14.451552  1436 acceptor_pool.cc:254] collecting diagnostics on the listening RPC socket 0.0.0.0:33861 every 8 connection(s)
I20260925 22:40:14.451658  1437 acceptor_pool.cc:254] collecting diagnostics on the listening RPC socket 0.0.0.0:33861 every 8 connection(s)
I20260925 22:40:14.451884  1269 rpc-test.cc:700] Connecting to 0.0.0.0:33861
[       OK ] Parameters/TestRpc.TestCredentialsPolicy/SSL_TCP (65 ms)
[ RUN      ] Parameters/TestRpc.TestCallLongerThanKeepalive/SSL_TCP
I20260925 22:40:14.520116  1461 acceptor_pool.cc:254] collecting diagnostics on the listening RPC socket 0.0.0.0:41695 every 8 connection(s)
I20260925 22:40:14.520131  1462 acceptor_pool.cc:254] collecting diagnostics on the listening RPC socket 0.0.0.0:41695 every 8 connection(s)
I20260925 22:40:14.529735  1465 rpc-test-base.h:222] got call: sleep_micros: 3000000 deferred: true
I20260925 22:40:17.530767  1465 rpcz_store.cc:275] Call kudu.rpc.GenericCalculatorService.Sleep from 127.0.0.1:46836 (request call id 0) took 3001 ms. Trace:
I20260925 22:40:17.530910  1465 rpcz_store.cc:276] 0925 22:40:14.529655 (+     0us) service_pool.cc:170] Inserting onto call queue
0925 22:40:14.529701 (+    46us) service_pool.cc:227] Handling call
0925 22:40:17.530741 (+3001040us) inbound_call.cc:173] Queueing success response
Metrics: {}
[       OK ] Parameters/TestRpc.TestCallLongerThanKeepalive/SSL_TCP (3029 ms)
[ RUN      ] Parameters/TestRpc.TestRpcSidecar/SSL_TCP
I20260925 22:40:17.568327  1486 acceptor_pool.cc:254] collecting diagnostics on the listening RPC socket 0.0.0.0:38615 every 8 connection(s)
I20260925 22:40:17.568338  1487 acceptor_pool.cc:254] collecting diagnostics on the listening RPC socket 0.0.0.0:38615 every 8 connection(s)
[       OK ] Parameters/TestRpc.TestRpcSidecar/SSL_TCP (105 ms)
[ RUN      ] Parameters/TestRpc.TestRpcSidecarLimits/SSL_TCP
I20260925 22:40:19.569351  1511 acceptor_pool.cc:254] collecting diagnostics on the listening RPC socket 0.0.0.0:42059 every 8 connection(s)
I20260925 22:40:19.569372  1512 acceptor_pool.cc:254] collecting diagnostics on the listening RPC socket 0.0.0.0:42059 every 8 connection(s)
W20260925 22:40:19.585353  1269 serialization.cc:72] Serialized kudu.rpc_test.PushStringsRequestPB (2147483654 bytes) is larger than the maximum configured RPC message size (52428800 bytes). Sending anyway, but peer may reject the data.
W20260925 22:40:19.589893  1509 connection.cc:535] server connection from 127.0.0.1:34702 recv error: Network error: RPC frame had a length of 2147483714, but we only support messages up to 52428800 bytes long.
W20260925 22:40:19.589994  1509 connection.cc:158] shutting down server connection from 127.0.0.1:34702 with pending inbound data: 4/2147483714 bytes received; last active 0 ns ago: status Network error: RPC frame had a length of 2147483714, but we only support messages up to 52428800 bytes long.
W20260925 22:40:19.590334  1524 connection.cc:196] Error closing socket: Network error: TlsSocket::Close: Connection reset by peer
I20260925 22:40:19.599836  1537 acceptor_pool.cc:254] collecting diagnostics on the listening RPC socket 0.0.0.0:43613 every 8 connection(s)
I20260925 22:40:19.599901  1536 acceptor_pool.cc:254] collecting diagnostics on the listening RPC socket 0.0.0.0:43613 every 8 connection(s)
W20260925 22:40:24.004495  1534 connection.cc:577] server connection from 127.0.0.1:56100: received bad data: 'Corruption: Invalid packet: message had a length of 2147483710, but we only support messages up to 2147483647 bytes
'
[       OK ] Parameters/TestRpc.TestRpcSidecarLimits/SSL_TCP (6367 ms)
[ RUN      ] Parameters/TestRpc.TestCallTimeoutDoesntAffectNegotiation/SSL_TCP
I20260925 22:40:24.032928  1562 acceptor_pool.cc:254] collecting diagnostics on the listening RPC socket 0.0.0.0:43791 every 8 connection(s)
I20260925 22:40:24.032928  1561 acceptor_pool.cc:254] collecting diagnostics on the listening RPC socket 0.0.0.0:43791 every 8 connection(s)
W20260925 22:40:24.043201  1557 negotiation.cc:266] Injecting 500ms delay in negotiation
I20260925 22:40:24.093612  1269 rpc-test-base.h:595] status: Timed out: connection negotiation to 0.0.0.0:43791 for RPC Sleep timed out after 0.050s (ON_OUTBOUND_QUEUE), seconds elapsed: 0.0511279
[       OK ] Parameters/TestRpc.TestCallTimeoutDoesntAffectNegotiation/SSL_TCP (542 ms)
[ RUN      ] Parameters/TestRpc.TestRpcHandlerLatencyMetric/SSL_TCP
I20260925 22:40:24.565990  1586 acceptor_pool.cc:254] collecting diagnostics on the listening RPC socket 0.0.0.0:33169 every 8 connection(s)
I20260925 22:40:24.566049  1587 acceptor_pool.cc:254] collecting diagnostics on the listening RPC socket 0.0.0.0:33169 every 8 connection(s)
I20260925 22:40:24.611726  1269 rpc-test.cc:1236] Sleep() min lat: 20444
I20260925 22:40:24.611806  1269 rpc-test.cc:1237] Sleep() mean lat: 20444
I20260925 22:40:24.611836  1269 rpc-test.cc:1238] Sleep() max lat: 20444
I20260925 22:40:24.611850  1269 rpc-test.cc:1239] Sleep() #calls: 1
[       OK ] Parameters/TestRpc.TestRpcHandlerLatencyMetric/SSL_TCP (64 ms)
[ RUN      ] Parameters/TestRpc.TimedOutOnResponseMetricServiceQueue/SSL_TCP
I20260925 22:40:24.629089  1613 acceptor_pool.cc:254] collecting diagnostics on the listening RPC socket 0.0.0.0:37505 every 8 connection(s)
I20260925 22:40:24.629099  1612 acceptor_pool.cc:254] collecting diagnostics on the listening RPC socket 0.0.0.0:37505 every 8 connection(s)
W20260925 22:40:24.685293  1614 rpcz_store.cc:267] Call kudu.rpc_test.CalculatorService.Sleep from 127.0.0.1:57086 (request call id 2) took 20 ms (client timeout 20 ms). Trace:
W20260925 22:40:24.685395  1614 rpcz_store.cc:269] 0925 22:40:24.664910 (+     0us) service_pool.cc:170] Inserting onto call queue
0925 22:40:24.685239 (+ 20329us) service_pool.cc:214] Skipping call since client already timed out
0925 22:40:24.685275 (+    36us) inbound_call.cc:173] Queueing failure response
Metrics: {}
[       OK ] Parameters/TestRpc.TimedOutOnResponseMetricServiceQueue/SSL_TCP (73 ms)
[ RUN      ] Parameters/TestRpc.RpcPendingConnectionsMetric/SSL_TCP
I20260925 22:40:24.689805  1635 acceptor_pool.cc:254] collecting diagnostics on the listening RPC socket 0.0.0.0:40003 every 8 connection(s)
I20260925 22:40:24.689889  1636 acceptor_pool.cc:254] collecting diagnostics on the listening RPC socket 0.0.0.0:40003 every 8 connection(s)
W20260925 22:40:24.691345  1631 negotiation.cc:337] Failed RPC negotiation. Trace:
0925 22:40:24.690889 (+     0us) reactor.cc:625] Submitting negotiation task for server connection from 127.0.0.1:38888 (local address 127.0.0.1:40003)
0925 22:40:24.690996 (+   107us) server_negotiation.cc:206] Beginning negotiation
0925 22:40:24.690999 (+     3us) server_negotiation.cc:399] Waiting for connection header
0925 22:40:24.691084 (+    85us) negotiation.cc:327] Negotiation complete: Network error: Server connection negotiation failed: server connection from 127.0.0.1:38888: BlockingRecv error: recv got EOF from 127.0.0.1:38888 (error 108)
Metrics: {"server-negotiator.queue_time_us":36}
[       OK ] Parameters/TestRpc.RpcPendingConnectionsMetric/SSL_TCP (15 ms)
[ RUN      ] Parameters/TestRpc.TestRpcContextClientDeadline/SSL_TCP
I20260925 22:40:24.719451  1651 acceptor_pool.cc:254] collecting diagnostics on the listening RPC socket 0.0.0.0:34569 every 8 connection(s)
I20260925 22:40:24.719470  1652 acceptor_pool.cc:254] collecting diagnostics on the listening RPC socket 0.0.0.0:34569 every 8 connection(s)
[       OK ] Parameters/TestRpc.TestRpcContextClientDeadline/SSL_TCP (56 ms)
[ RUN      ] Parameters/TestRpc.TestApplicationFeatureFlagUnsupportedServer/SSL_TCP
I20260925 22:40:24.774492  1676 acceptor_pool.cc:254] collecting diagnostics on the listening RPC socket 0.0.0.0:38317 every 8 connection(s)
I20260925 22:40:24.774505  1677 acceptor_pool.cc:254] collecting diagnostics on the listening RPC socket 0.0.0.0:38317 every 8 connection(s)
[       OK ] Parameters/TestRpc.TestApplicationFeatureFlagUnsupportedServer/SSL_TCP (61 ms)
[ RUN      ] Parameters/TestRpc.TestCancellationAsync/SSL_TCP
I20260925 22:40:24.846241  1701 acceptor_pool.cc:254] collecting diagnostics on the listening RPC socket 0.0.0.0:41049 every 8 connection(s)
I20260925 22:40:24.846251  1702 acceptor_pool.cc:254] collecting diagnostics on the listening RPC socket 0.0.0.0:41049 every 8 connection(s)
I20260925 22:40:24.846505  1269 rpc-test.cc:1716] Connecting to 0.0.0.0:41049
I20260925 22:40:24.852465  1269 test_util.cc:268] Using random seed: 1727645679
I20260925 22:40:24.872797  1705 rpc-test-base.h:240] got call: sleep_micros: 500 pattern: 4294967295 num_repetitions: 2097152 sidecar_idx: 0
I20260925 22:40:24.895123  1704 rpc-test-base.h:240] got call: sleep_micros: 500 pattern: 4294967295 num_repetitions: 2097152 sidecar_idx: 0
I20260925 22:40:24.913506  1705 rpc-test-base.h:240] got call: sleep_micros: 500 pattern: 4294967295 num_repetitions: 2097152 sidecar_idx: 0
I20260925 22:40:24.930524  1704 rpc-test-base.h:240] got call: sleep_micros: 500 pattern: 4294967295 num_repetitions: 2097152 sidecar_idx: 0
I20260925 22:40:24.951215  1705 rpc-test-base.h:240] got call: sleep_micros: 500 pattern: 4294967295 num_repetitions: 2097152 sidecar_idx: 0
I20260925 22:40:24.975087  1705 rpc-test-base.h:240] got call: sleep_micros: 500 pattern: 4294967295 num_repetitions: 2097152 sidecar_idx: 0
I20260925 22:40:24.998672  1705 rpc-test-base.h:240] got call: sleep_micros: 500 pattern: 4294967295 num_repetitions: 2097152 sidecar_idx: 0
I20260925 22:40:25.021523  1705 rpc-test-base.h:240] got call: sleep_micros: 500 pattern: 4294967295 num_repetitions: 2097152 sidecar_idx: 0
W20260925 22:40:25.039788  1698 connection.cc:441] server connection from 127.0.0.1:36654 torn down before Call kudu.rpc.GenericCalculatorService.SleepWithSidecar from 127.0.0.1:36654 (request call id 9) could send its response
[       OK ] Parameters/TestRpc.TestCancellationAsync/SSL_TCP (220 ms)
[ RUN      ] Parameters/TestRpc.TestPerformanceBySocketType/SSL_TCP
I20260925 22:40:25.067018  1727 acceptor_pool.cc:254] collecting diagnostics on the listening RPC socket 0.0.0.0:37163 every 8 connection(s)
I20260925 22:40:25.067018  1726 acceptor_pool.cc:254] collecting diagnostics on the listening RPC socket 0.0.0.0:37163 every 8 connection(s)
I20260925 22:40:25.067310  1269 rpc-test.cc:1846] Connecting to 0.0.0.0:37163
I20260925 22:40:27.358253  1269 rpc-test.cc:1859] Sending 1024MB via ssl-enabled tcp socket: real 2.285s	user 2.585s	sys 1.427s
I20260925 22:40:29.512887  1269 rpc-test.cc:1859] Sending 1024MB via ssl-enabled tcp socket: real 2.154s	user 2.406s	sys 1.406s
I20260925 22:40:32.864372  1269 rpc-test.cc:1859] Sending 1024MB via ssl-enabled tcp socket: real 3.351s	user 3.567s	sys 2.311s
I20260925 22:40:35.133670  1269 rpc-test.cc:1859] Sending 1024MB via ssl-enabled tcp socket: real 2.269s	user 2.542s	sys 1.432s
I20260925 22:40:37.451973  1269 rpc-test.cc:1859] Sending 1024MB via ssl-enabled tcp socket: real 2.318s	user 2.574s	sys 1.459s
[       OK ] Parameters/TestRpc.TestPerformanceBySocketType/SSL_TCP (12418 ms)
[----------] 20 tests from Parameters/TestRpc (35479 ms total)

[----------] 1 test from Parameters/TestRpcSocketTxRxQueue
[ RUN      ] Parameters/TestRpcSocketTxRxQueue.OverCapacity/0
W20260925 22:40:37.735754  1788 negotiation.cc:337] Failed RPC negotiation. Trace:
0925 22:40:37.471513 (+     0us) reactor.cc:625] Submitting negotiation task for client connection to 0.0.0.0:40691 (local address 127.0.0.1:35386)
0925 22:40:37.471613 (+   100us) negotiation.cc:107] Waiting for socket to connect
0925 22:40:37.471624 (+    11us) client_negotiation.cc:174] Beginning negotiation
0925 22:40:37.471695 (+    71us) client_negotiation.cc:252] Sending NEGOTIATE NegotiatePB request
0925 22:40:37.735591 (+263896us) negotiation.cc:327] Negotiation complete: Network error: Client connection negotiation failed: client connection to 0.0.0.0:40691: BlockingRecv error: recv error from unknown peer: Transport endpoint is not connected (error 107)
Metrics: {"client-negotiator.queue_time_us":26}
W20260925 22:40:37.735912  1779 negotiation.cc:337] Failed RPC negotiation. Trace:
0925 22:40:37.470240 (+     0us) reactor.cc:625] Submitting negotiation task for client connection to 0.0.0.0:40691 (local address 127.0.0.1:35382)
0925 22:40:37.470345 (+   105us) negotiation.cc:107] Waiting for socket to connect
0925 22:40:37.470357 (+    12us) client_negotiation.cc:174] Beginning negotiation
0925 22:40:37.470427 (+    70us) client_negotiation.cc:252] Sending NEGOTIATE NegotiatePB request
0925 22:40:37.735854 (+265427us) negotiation.cc:327] Negotiation complete: Network error: Client connection negotiation failed: client connection to 0.0.0.0:40691: BlockingRecv error: recv error from unknown peer: Transport endpoint is not connected (error 107)
Metrics: {"client-negotiator.queue_time_us":41}
W20260925 22:40:37.735770  1743 negotiation.cc:337] Failed RPC negotiation. Trace:
0925 22:40:37.464428 (+     0us) reactor.cc:625] Submitting negotiation task for client connection to 0.0.0.0:40691 (local address 127.0.0.1:35364)
0925 22:40:37.464857 (+   429us) negotiation.cc:107] Waiting for socket to connect
0925 22:40:37.464897 (+    40us) client_negotiation.cc:174] Beginning negotiation
0925 22:40:37.465212 (+   315us) client_negotiation.cc:252] Sending NEGOTIATE NegotiatePB request
0925 22:40:37.735449 (+270237us) negotiation.cc:327] Negotiation complete: Network error: Client connection negotiation failed: client connection to 0.0.0.0:40691: BlockingRecv error: recv error from unknown peer: Transport endpoint is not connected (error 107)
Metrics: {"client-negotiator.queue_time_us":88}
W20260925 22:40:37.736502  1770 negotiation.cc:337] Failed RPC negotiation. Trace:
0925 22:40:37.468919 (+     0us) reactor.cc:625] Submitting negotiation task for client connection to 0.0.0.0:40691 (local address 127.0.0.1:35380)
0925 22:40:37.469027 (+   108us) negotiation.cc:107] Waiting for socket to connect
0925 22:40:37.469039 (+    12us) client_negotiation.cc:174] Beginning negotiation
0925 22:40:37.469115 (+    76us) client_negotiation.cc:252] Sending NEGOTIATE NegotiatePB request
0925 22:40:37.735449 (+266334us) negotiation.cc:327] Negotiation complete: Network error: Client connection negotiation failed: client connection to 0.0.0.0:40691: BlockingRecv error: recv error from unknown peer: Transport endpoint is not connected (error 107)
Metrics: {"client-negotiator.queue_time_us":44}
W20260925 22:40:37.737596  1752 negotiation.cc:337] Failed RPC negotiation. Trace:
0925 22:40:37.465830 (+     0us) reactor.cc:625] Submitting negotiation task for client connection to 0.0.0.0:40691 (local address 127.0.0.1:35368)
0925 22:40:37.465953 (+   123us) negotiation.cc:107] Waiting for socket to connect
0925 22:40:37.465963 (+    10us) client_negotiation.cc:174] Beginning negotiation
0925 22:40:37.466046 (+    83us) client_negotiation.cc:252] Sending NEGOTIATE NegotiatePB request
0925 22:40:37.735498 (+269452us) negotiation.cc:327] Negotiation complete: Network error: Client connection negotiation failed: client connection to 0.0.0.0:40691: BlockingRecv error: recv error from unknown peer: Transport endpoint is not connected (error 107)
Metrics: {"client-negotiator.queue_time_us":38}
W20260925 22:40:37.738829  1761 negotiation.cc:337] Failed RPC negotiation. Trace:
0925 22:40:37.467534 (+     0us) reactor.cc:625] Submitting negotiation task for client connection to 0.0.0.0:40691 (local address 127.0.0.1:35378)
0925 22:40:37.467645 (+   111us) negotiation.cc:107] Waiting for socket to connect
0925 22:40:37.467658 (+    13us) client_negotiation.cc:174] Beginning negotiation
0925 22:40:37.467732 (+    74us) client_negotiation.cc:252] Sending NEGOTIATE NegotiatePB request
0925 22:40:37.735456 (+267724us) negotiation.cc:327] Negotiation complete: Network error: Client connection negotiation failed: client connection to 0.0.0.0:40691: BlockingRecv error: recv error from unknown peer: Transport endpoint is not connected (error 107)
Metrics: {"client-negotiator.queue_time_us":43}
[       OK ] Parameters/TestRpcSocketTxRxQueue.OverCapacity/0 (1032 ms)
[----------] 1 test from Parameters/TestRpcSocketTxRxQueue (1032 ms total)

[----------] Global test environment tear-down
[==========] 21 tests from 2 test suites ran. (36511 ms total)
[  PASSED  ] 20 tests.
[  FAILED  ] 1 test, listed below:
[  FAILED  ] Parameters/TestRpc.TestCallWithChainCertAndChainCA/SSL_TCP, where GetParam() = (true, false)

 1 FAILED TEST