Parameters/TestRpc.TestCallWithChainCertAndRootCA/SSL_TCP: /data0/somelongdirectorytoavoidrpathissues/src/kudu/src/kudu/rpc/rpc-test.cc:303: Failure
Failed
Bad status: Runtime error: could not verify certificate chain (error with cert: subject=CN = localhost, ST = sadfjas, C = AS, emailAddress = sdflkdsajf, O = lskdfjlsad, OU = sldfkja, issuer=C = AS, ST = ASDfkjdhf, L = lskdjf, O = saldfja, OU = skdjf, CN = localhost, emailAddress = sadjflkadsj): : certificate has expired
Google Test trace:
/data0/somelongdirectorytoavoidrpathissues/src/kudu/src/kudu/rpc/rpc-test.cc:300: Connecting to 0.0.0.0:42769
I20260928 14:36:51.144564 17582 test_util.cc:175] -----------------------------------------------
I20260928 14:36:51.144752 17582 test_util.cc:176] Had fatal failures, leaving test files at /tmp/dist-test-task_WUWPU/test-tmp/rpc-test.1.Parameters_TestRpc.TestCallWithChainCertAndRootCA_SSL_TCP.1790606209718305-17582-0
Note: This is test shard 2 of 8.
[==========] Running 21 tests from 2 test suites.
[----------] Global test environment set-up.
[----------] 1 test from TestRpc
[ RUN ] TestRpc.TestMethodsByName
[ OK ] TestRpc.TestMethodsByName (6 ms)
[----------] 1 test from TestRpc (6 ms total)
[----------] 20 tests from Parameters/TestRpc
[ RUN ] Parameters/TestRpc.TestAcceptorPoolStartStop/SSL_TCP
WARNING: Logging before InitGoogleLogging() is written to STDERR
I20260928 14:36:49.827153 17597 acceptor_pool.cc:254] collecting diagnostics on the listening RPC socket 0.0.0.0:46635 every 8 connection(s)
I20260928 14:36:49.828567 17598 acceptor_pool.cc:254] collecting diagnostics on the listening RPC socket 0.0.0.0:46635 every 8 connection(s)
W20260928 14:36:50.829180 17582 thread.cc:536] Waited for 1000ms trying to join with acceptor (tid 17598)
I20260928 14:36:50.895910 17609 acceptor_pool.cc:254] collecting diagnostics on the listening RPC socket 0.0.0.0:46761 every 8 connection(s)
I20260928 14:36:50.897354 17610 acceptor_pool.cc:254] collecting diagnostics on the listening RPC socket 0.0.0.0:46761 every 8 connection(s)
I20260928 14:36:50.914499 17620 acceptor_pool.cc:254] collecting diagnostics on the listening RPC socket 0.0.0.0:39509 every 8 connection(s)
I20260928 14:36:50.915800 17621 acceptor_pool.cc:254] collecting diagnostics on the listening RPC socket 0.0.0.0:39509 every 8 connection(s)
I20260928 14:36:50.930653 17631 acceptor_pool.cc:254] collecting diagnostics on the listening RPC socket 0.0.0.0:36497 every 8 connection(s)
I20260928 14:36:50.931334 17632 acceptor_pool.cc:254] collecting diagnostics on the listening RPC socket 0.0.0.0:36497 every 8 connection(s)
I20260928 14:36:50.951467 17642 acceptor_pool.cc:254] collecting diagnostics on the listening RPC socket 0.0.0.0:46819 every 8 connection(s)
I20260928 14:36:50.952137 17643 acceptor_pool.cc:254] collecting diagnostics on the listening RPC socket 0.0.0.0:46819 every 8 connection(s)
[ OK ] Parameters/TestRpc.TestAcceptorPoolStartStop/SSL_TCP (1178 ms)
[ RUN ] Parameters/TestRpc.TestCall/SSL_TCP
I20260928 14:36:50.991282 17655 acceptor_pool.cc:254] collecting diagnostics on the listening RPC socket 0.0.0.0:43097 every 8 connection(s)
I20260928 14:36:50.993410 17656 acceptor_pool.cc:254] collecting diagnostics on the listening RPC socket 0.0.0.0:43097 every 8 connection(s)
I20260928 14:36:50.998375 17582 rpc-test.cc:234] Connecting to 0.0.0.0:43097
[ OK ] Parameters/TestRpc.TestCall/SSL_TCP (150 ms)
[ RUN ] Parameters/TestRpc.TestCallWithChainCertAndRootCA/SSL_TCP
I20260928 14:36:51.124099 17680 acceptor_pool.cc:254] collecting diagnostics on the listening RPC socket 0.0.0.0:42769 every 8 connection(s)
I20260928 14:36:51.124855 17681 acceptor_pool.cc:254] collecting diagnostics on the listening RPC socket 0.0.0.0:42769 every 8 connection(s)
/data0/somelongdirectorytoavoidrpathissues/src/kudu/src/kudu/rpc/rpc-test.cc:303: Failure
Failed
Bad status: Runtime error: could not verify certificate chain (error with cert: subject=CN = localhost, ST = sadfjas, C = AS, emailAddress = sdflkdsajf, O = lskdfjlsad, OU = sldfkja, issuer=C = AS, ST = ASDfkjdhf, L = lskdjf, O = saldfja, OU = skdjf, CN = localhost, emailAddress = sadjflkadsj): : certificate has expired
Google Test trace:
/data0/somelongdirectorytoavoidrpathissues/src/kudu/src/kudu/rpc/rpc-test.cc:300: Connecting to 0.0.0.0:42769
I20260928 14:36:51.144564 17582 test_util.cc:175] -----------------------------------------------
I20260928 14:36:51.144752 17582 test_util.cc:176] Had fatal failures, leaving test files at /tmp/dist-test-task_WUWPU/test-tmp/rpc-test.1.Parameters_TestRpc.TestCallWithChainCertAndRootCA_SSL_TCP.1790606209718305-17582-0
[ FAILED ] Parameters/TestRpc.TestCallWithChainCertAndRootCA/SSL_TCP, where GetParam() = (true, false) (37 ms)
[ RUN ] Parameters/TestRpc.TestCallWithBadPasswordProtectedKey/SSL_TCP
[ OK ] Parameters/TestRpc.TestCallWithBadPasswordProtectedKey/SSL_TCP (34 ms)
[ RUN ] Parameters/TestRpc.TestInvalidMethodCall/SSL_TCP
I20260928 14:36:51.216465 17717 acceptor_pool.cc:254] collecting diagnostics on the listening RPC socket 0.0.0.0:43707 every 8 connection(s)
I20260928 14:36:51.217177 17718 acceptor_pool.cc:254] collecting diagnostics on the listening RPC socket 0.0.0.0:43707 every 8 connection(s)
I20260928 14:36:51.220557 17582 rpc-test.cc:406] Connecting to 0.0.0.0:43707
[ OK ] Parameters/TestRpc.TestInvalidMethodCall/SSL_TCP (97 ms)
[ RUN ] Parameters/TestRpc.TestHighFDs/SSL_TCP
I20260928 14:36:51.498360 17742 acceptor_pool.cc:254] collecting diagnostics on the listening RPC socket 0.0.0.0:36547 every 8 connection(s)
I20260928 14:36:51.499037 17743 acceptor_pool.cc:254] collecting diagnostics on the listening RPC socket 0.0.0.0:36547 every 8 connection(s)
[ OK ] Parameters/TestRpc.TestHighFDs/SSL_TCP (273 ms)
[ RUN ] Parameters/TestRpc.TestConnectionAlwaysKeepalive/SSL_TCP
I20260928 14:36:51.585328 17765 acceptor_pool.cc:254] collecting diagnostics on the listening RPC socket 0.0.0.0:37603 every 8 connection(s)
I20260928 14:36:51.586022 17766 acceptor_pool.cc:254] collecting diagnostics on the listening RPC socket 0.0.0.0:37603 every 8 connection(s)
I20260928 14:36:51.589159 17582 rpc-test.cc:532] Connecting to 0.0.0.0:37603
[ OK ] Parameters/TestRpc.TestConnectionAlwaysKeepalive/SSL_TCP (3099 ms)
[ RUN ] Parameters/TestRpc.TestReopenOutboundConnections/SSL_TCP
I20260928 14:36:54.674885 17788 acceptor_pool.cc:254] collecting diagnostics on the listening RPC socket 0.0.0.0:43923 every 8 connection(s)
I20260928 14:36:54.675562 17789 acceptor_pool.cc:254] collecting diagnostics on the listening RPC socket 0.0.0.0:43923 every 8 connection(s)
I20260928 14:36:54.678583 17582 rpc-test.cc:658] Connecting to 0.0.0.0:43923
[ OK ] Parameters/TestRpc.TestReopenOutboundConnections/SSL_TCP (375 ms)
[ RUN ] Parameters/TestRpc.TestConnectionNetworkPlane/SSL_TCP
I20260928 14:36:55.050354 17811 acceptor_pool.cc:254] collecting diagnostics on the listening RPC socket 0.0.0.0:41725 every 8 connection(s)
I20260928 14:36:55.051066 17812 acceptor_pool.cc:254] collecting diagnostics on the listening RPC socket 0.0.0.0:41725 every 8 connection(s)
I20260928 14:36:55.054153 17582 rpc-test.cc:772] Connecting to 0.0.0.0:41725
[ OK ] Parameters/TestRpc.TestConnectionNetworkPlane/SSL_TCP (74 ms)
[ RUN ] Parameters/TestRpc.TestTCPKeepalive/SSL_TCP
I20260928 14:36:55.124043 17836 acceptor_pool.cc:254] collecting diagnostics on the listening RPC socket 0.0.0.0:45235 every 8 connection(s)
I20260928 14:36:55.124753 17837 acceptor_pool.cc:254] collecting diagnostics on the listening RPC socket 0.0.0.0:45235 every 8 connection(s)
I20260928 14:36:55.153441 17840 rpc-test-base.h:222] got call: sleep_micros: 8000000 deferred: true
I20260928 14:37:03.157480 17840 rpcz_store.cc:275] Call kudu.rpc.GenericCalculatorService.Sleep from 127.0.0.1:35082 (request call id 0) took 8004 ms. Trace:
I20260928 14:37:03.157898 17840 rpcz_store.cc:276] 0928 14:36:55.153137 (+ 0us) service_pool.cc:170] Inserting onto call queue
0928 14:36:55.153244 (+ 107us) service_pool.cc:227] Handling call
0928 14:37:03.157300 (+8004056us) inbound_call.cc:173] Queueing success response
Metrics: {}
[ OK ] Parameters/TestRpc.TestTCPKeepalive/SSL_TCP (8072 ms)
[ RUN ] Parameters/TestRpc.TestMaxSmallSidecars/SSL_TCP
I20260928 14:37:03.206943 17862 acceptor_pool.cc:254] collecting diagnostics on the listening RPC socket 0.0.0.0:45003 every 8 connection(s)
I20260928 14:37:03.207667 17863 acceptor_pool.cc:254] collecting diagnostics on the listening RPC socket 0.0.0.0:45003 every 8 connection(s)
[ OK ] Parameters/TestRpc.TestMaxSmallSidecars/SSL_TCP (207 ms)
[ RUN ] Parameters/TestRpc.TestCallTimeout/SSL_TCP
I20260928 14:37:03.399003 17887 acceptor_pool.cc:254] collecting diagnostics on the listening RPC socket 0.0.0.0:37471 every 8 connection(s)
I20260928 14:37:03.399675 17888 acceptor_pool.cc:254] collecting diagnostics on the listening RPC socket 0.0.0.0:37471 every 8 connection(s)
I20260928 14:37:03.421954 17582 rpc-test-base.h:595] status: Timed out: connection negotiation to 0.0.0.0:37471 for RPC Sleep timed out after 0.000s (ON_OUTBOUND_QUEUE), seconds elapsed: 0.00262481
I20260928 14:37:03.429716 17891 rpc-test-base.h:222] got call: sleep_micros: 700000
I20260928 14:37:03.623490 17582 rpc-test-base.h:595] status: Timed out: Sleep RPC to 0.0.0.0:37471 timed out after 0.200s (SENT), seconds elapsed: 0.201174
I20260928 14:37:03.624990 17890 rpc-test-base.h:222] got call: sleep_micros: 2000000
W20260928 14:37:04.130431 17891 rpcz_store.cc:267] Call kudu.rpc.GenericCalculatorService.Sleep from 127.0.0.1:37562 (request call id 1) took 700 ms (client timeout 200 ms). Trace:
W20260928 14:37:04.130789 17891 rpcz_store.cc:269] 0928 14:37:03.429538 (+ 0us) service_pool.cc:170] Inserting onto call queue
0928 14:37:03.429655 (+ 117us) service_pool.cc:227] Handling call
0928 14:37:04.130362 (+700707us) inbound_call.cc:173] Queueing success response
Metrics: {}
I20260928 14:37:05.124536 17582 rpc-test-base.h:595] status: Timed out: Sleep RPC to 0.0.0.0:37471 timed out after 1.500s (SENT), seconds elapsed: 1.50068
W20260928 14:37:05.625535 17890 rpcz_store.cc:267] Call kudu.rpc.GenericCalculatorService.Sleep from 127.0.0.1:37562 (request call id 2) took 2000 ms (client timeout 1500 ms). Trace:
W20260928 14:37:05.625855 17890 rpcz_store.cc:269] 0928 14:37:03.624723 (+ 0us) service_pool.cc:170] Inserting onto call queue
0928 14:37:03.624829 (+ 106us) service_pool.cc:227] Handling call
0928 14:37:05.625476 (+2000647us) inbound_call.cc:173] Queueing success response
Metrics: {}
W20260928 14:37:05.626379 17885 connection.cc:441] server connection from 127.0.0.1:37562 torn down before Call kudu.rpc.GenericCalculatorService.Sleep from 127.0.0.1:37562 (request call id 2) could send its response
[ OK ] Parameters/TestRpc.TestCallTimeout/SSL_TCP (2253 ms)
[ RUN ] Parameters/TestRpc.TestServerShutsDown/SSL_TCP
I20260928 14:37:05.634286 17582 rpc-test.cc:1125] Connecting to 0.0.0.0:43143
W20260928 14:37:05.643942 17904 negotiation.cc:337] Failed RPC negotiation. Trace:
0928 14:37:05.642357 (+ 0us) reactor.cc:625] Submitting negotiation task for client connection to 0.0.0.0:43143 (local address 127.0.0.1:48658)
0928 14:37:05.642838 (+ 481us) negotiation.cc:107] Waiting for socket to connect
0928 14:37:05.642869 (+ 31us) client_negotiation.cc:174] Beginning negotiation
0928 14:37:05.643096 (+ 227us) client_negotiation.cc:252] Sending NEGOTIATE NegotiatePB request
0928 14:37:05.643338 (+ 242us) negotiation.cc:327] Negotiation complete: Network error: Client connection negotiation failed: client connection to 0.0.0.0:43143: BlockingWrite error: write error: Broken pipe (error 32)
Metrics: {"client-negotiator.queue_time_us":129}
[ OK ] Parameters/TestRpc.TestServerShutsDown/SSL_TCP (14 ms)
[ RUN ] Parameters/TestRpc.TimedOutOnResponseMetric/SSL_TCP
I20260928 14:37:05.676118 17921 acceptor_pool.cc:254] collecting diagnostics on the listening RPC socket 0.0.0.0:34563 every 8 connection(s)
I20260928 14:37:05.676827 17922 acceptor_pool.cc:254] collecting diagnostics on the listening RPC socket 0.0.0.0:34563 every 8 connection(s)
W20260928 14:37:05.917280 17925 rpcz_store.cc:267] Call kudu.rpc_test.CalculatorService.Sleep from 127.0.0.1:42108 (request call id 3) took 50 ms (client timeout 25 ms). Trace:
W20260928 14:37:05.917582 17925 rpcz_store.cc:269] 0928 14:37:05.866677 (+ 0us) service_pool.cc:170] Inserting onto call queue
0928 14:37:05.866784 (+ 107us) service_pool.cc:227] Handling call
0928 14:37:05.917193 (+ 50409us) inbound_call.cc:173] Queueing success response
Related trace 'test_child':
Metrics: {"test_sleep_us":50000,"child_traces":[["test_child",{"related_trace_metric":1}]]}
W20260928 14:37:05.977069 17925 rpcz_store.cc:267] Call kudu.rpc_test.CalculatorService.Sleep from 127.0.0.1:42108 (request call id 4) took 50 ms (client timeout 50 ms). Trace:
W20260928 14:37:05.977401 17925 rpcz_store.cc:269] 0928 14:37:05.926548 (+ 0us) service_pool.cc:170] Inserting onto call queue
0928 14:37:05.926667 (+ 119us) service_pool.cc:227] Handling call
0928 14:37:05.977011 (+ 50344us) inbound_call.cc:173] Queueing success response
Related trace 'test_child':
Metrics: {"test_sleep_us":50000,"child_traces":[["test_child",{"related_trace_metric":1}]]}
[ OK ] Parameters/TestRpc.TimedOutOnResponseMetric/SSL_TCP (338 ms)
[ RUN ] Parameters/TestRpc.AcceptorDispatchingTimesMetric/SSL_TCP
I20260928 14:37:05.996973 17946 acceptor_pool.cc:254] collecting diagnostics on the listening RPC socket 0.0.0.0:46693 every 8 connection(s)
I20260928 14:37:05.997675 17947 acceptor_pool.cc:254] collecting diagnostics on the listening RPC socket 0.0.0.0:46693 every 8 connection(s)
W20260928 14:37:06.002483 17942 negotiation.cc:337] Failed RPC negotiation. Trace:
0928 14:37:06.001340 (+ 0us) reactor.cc:625] Submitting negotiation task for server connection from 127.0.0.1:36488 (local address 127.0.0.1:46693)
0928 14:37:06.001752 (+ 412us) server_negotiation.cc:206] Beginning negotiation
0928 14:37:06.001777 (+ 25us) server_negotiation.cc:399] Waiting for connection header
0928 14:37:06.002011 (+ 234us) negotiation.cc:327] Negotiation complete: Network error: Server connection negotiation failed: server connection from 127.0.0.1:36488: BlockingRecv error: recv got EOF from 127.0.0.1:36488 (error 108)
Metrics: {"server-negotiator.queue_time_us":113}
[ OK ] Parameters/TestRpc.AcceptorDispatchingTimesMetric/SSL_TCP (22 ms)
[ RUN ] Parameters/TestRpc.TestRpcCallbackDestroysMessenger/SSL_TCP
[ OK ] Parameters/TestRpc.TestRpcCallbackDestroysMessenger/SSL_TCP (29 ms)
[ RUN ] Parameters/TestRpc.TestApplicationFeatureFlag/SSL_TCP
I20260928 14:37:06.057919 17971 acceptor_pool.cc:254] collecting diagnostics on the listening RPC socket 0.0.0.0:35055 every 8 connection(s)
I20260928 14:37:06.058629 17972 acceptor_pool.cc:254] collecting diagnostics on the listening RPC socket 0.0.0.0:35055 every 8 connection(s)
W20260928 14:37:06.106786 17968 messenger.cc:357] Unable to handle RPC call: Not implemented: call requires unsupported application feature flags: 99
[ OK ] Parameters/TestRpc.TestApplicationFeatureFlag/SSL_TCP (77 ms)
[ RUN ] Parameters/TestRpc.TestCancellation/SSL_TCP
I20260928 14:37:06.136888 17996 acceptor_pool.cc:254] collecting diagnostics on the listening RPC socket 0.0.0.0:41195 every 8 connection(s)
I20260928 14:37:06.137624 17997 acceptor_pool.cc:254] collecting diagnostics on the listening RPC socket 0.0.0.0:41195 every 8 connection(s)
I20260928 14:37:06.141039 17582 rpc-test.cc:1648] Connecting to 0.0.0.0:41195
I20260928 14:37:06.243273 17582 rpc-test-base.h:595] status: Aborted: Sleep RPC to 0.0.0.0:41195 is cancelled in state READY, seconds elapsed: 0.000412906
I20260928 14:37:06.384645 17582 rpc-test-base.h:595] status: Aborted: Sleep RPC to 0.0.0.0:41195 is cancelled in state SENT, seconds elapsed: 0.000947534
I20260928 14:37:06.424964 17999 rpc-test-base.h:222] got call: sleep_micros: 510000
I20260928 14:37:06.567411 17582 rpc-test-base.h:595] status: Aborted: Sleep RPC to 0.0.0.0:41195 is cancelled in state SENT, seconds elapsed: 0.000996169
I20260928 14:37:06.606352 17998 rpc-test-base.h:222] got call: sleep_micros: 510000
I20260928 14:37:06.729703 17582 rpc-test-base.h:595] status: Aborted: Sleep RPC to 0.0.0.0:41195 is cancelled in state SENT, seconds elapsed: 0.000874108
W20260928 14:37:06.767478 18000 rpcz_store.cc:267] Call kudu.rpc.GenericCalculatorService.Sleep from 127.0.0.1:49168 (request call id 11) took 14 ms (client timeout 10 ms). Trace:
W20260928 14:37:06.767818 18000 rpcz_store.cc:269] 0928 14:37:06.752467 (+ 0us) service_pool.cc:170] Inserting onto call queue
0928 14:37:06.767190 (+ 14723us) service_pool.cc:214] Skipping call since client already timed out
0928 14:37:06.767299 (+ 109us) inbound_call.cc:173] Queueing failure response
Metrics: {}
I20260928 14:37:06.768340 18000 rpc-test-base.h:222] got call: sleep_micros: 1500000
W20260928 14:37:06.935638 17999 rpcz_store.cc:267] Call kudu.rpc.GenericCalculatorService.Sleep from 127.0.0.1:49168 (request call id 3) took 510 ms (client timeout 10 ms). Trace:
W20260928 14:37:06.935964 17999 rpcz_store.cc:269] 0928 14:37:06.424774 (+ 0us) service_pool.cc:170] Inserting onto call queue
0928 14:37:06.424906 (+ 132us) service_pool.cc:227] Handling call
0928 14:37:06.935580 (+510674us) inbound_call.cc:173] Queueing success response
Metrics: {}
W20260928 14:37:07.117066 17998 rpcz_store.cc:267] Call kudu.rpc.GenericCalculatorService.Sleep from 127.0.0.1:49168 (request call id 7) took 511 ms (client timeout 10 ms). Trace:
W20260928 14:37:07.117390 17998 rpcz_store.cc:269] 0928 14:37:06.606124 (+ 0us) service_pool.cc:170] Inserting onto call queue
0928 14:37:06.606268 (+ 144us) service_pool.cc:227] Handling call
0928 14:37:07.117008 (+510740us) inbound_call.cc:173] Queueing success response
Metrics: {}
I20260928 14:37:07.731653 17582 rpc-test-base.h:595] status: Timed out: Sleep RPC to 0.0.0.0:41195 timed out after 1.000s (SENT), seconds elapsed: 1.00159
I20260928 14:37:07.732962 17998 rpc-test-base.h:222] got call: sleep_micros: 1500000
W20260928 14:37:08.268857 18000 rpcz_store.cc:267] Call kudu.rpc.GenericCalculatorService.Sleep from 127.0.0.1:49168 (request call id 12) took 1516 ms (client timeout 1000 ms). Trace:
W20260928 14:37:08.269196 18000 rpcz_store.cc:269] 0928 14:37:06.752808 (+ 0us) service_pool.cc:170] Inserting onto call queue
0928 14:37:06.768305 (+ 15497us) service_pool.cc:227] Handling call
0928 14:37:08.268804 (+1500499us) inbound_call.cc:173] Queueing success response
Metrics: {}
I20260928 14:37:08.733377 17582 rpc-test-base.h:595] status: Timed out: Sleep RPC to 0.0.0.0:41195 timed out after 1.000s (SENT), seconds elapsed: 1.00139
W20260928 14:37:08.734810 17995 messenger.cc:357] Unable to handle RPC call: Not implemented: call requires unsupported application feature flags: 99, 1
W20260928 14:37:08.736269 17995 messenger.cc:357] Unable to handle RPC call: Not implemented: call requires unsupported application feature flags: 99, 1
W20260928 14:37:09.233464 17998 rpcz_store.cc:267] Call kudu.rpc.GenericCalculatorService.Sleep from 127.0.0.1:49168 (request call id 13) took 1500 ms (client timeout 1000 ms). Trace:
W20260928 14:37:09.233774 17998 rpcz_store.cc:269] 0928 14:37:07.732801 (+ 0us) service_pool.cc:170] Inserting onto call queue
0928 14:37:07.732913 (+ 112us) service_pool.cc:227] Handling call
0928 14:37:09.233402 (+1500489us) inbound_call.cc:173] Queueing success response
Metrics: {}
W20260928 14:37:09.234310 17995 connection.cc:441] server connection from 127.0.0.1:49168 torn down before Call kudu.rpc.GenericCalculatorService.Sleep from 127.0.0.1:49168 (request call id 13) could send its response
[ OK ] Parameters/TestRpc.TestCancellation/SSL_TCP (3125 ms)
[ RUN ] Parameters/TestRpc.TestCancellationMultiThreads/SSL_TCP
I20260928 14:37:09.275115 18021 acceptor_pool.cc:254] collecting diagnostics on the listening RPC socket 0.0.0.0:33173 every 8 connection(s)
I20260928 14:37:09.275796 18022 acceptor_pool.cc:254] collecting diagnostics on the listening RPC socket 0.0.0.0:33173 every 8 connection(s)
I20260928 14:37:09.278891 17582 rpc-test.cc:1808] Connecting to 0.0.0.0:33173
I20260928 14:37:09.425446 18035 test_util.cc:268] Using random seed: 3984578
I20260928 14:37:09.426441 18036 test_util.cc:268] Using random seed: 3985646
I20260928 14:37:09.427744 18037 test_util.cc:268] Using random seed: 3986951
I20260928 14:37:09.428992 18038 test_util.cc:268] Using random seed: 3988181
I20260928 14:37:09.432106 18039 test_util.cc:268] Using random seed: 3991129
I20260928 14:37:09.433547 18040 test_util.cc:268] Using random seed: 3992609
I20260928 14:37:09.435241 18041 test_util.cc:268] Using random seed: 3994319
I20260928 14:37:09.437587 18042 test_util.cc:268] Using random seed: 3996656
I20260928 14:37:09.439124 18043 test_util.cc:268] Using random seed: 3998149
I20260928 14:37:09.440927 18044 test_util.cc:268] Using random seed: 3999999
I20260928 14:37:09.442319 18045 test_util.cc:268] Using random seed: 4001396
I20260928 14:37:09.444255 18046 test_util.cc:268] Using random seed: 4003339
I20260928 14:37:09.446352 18047 test_util.cc:268] Using random seed: 4005418
I20260928 14:37:09.448304 18048 test_util.cc:268] Using random seed: 4007287
I20260928 14:37:09.450555 18049 test_util.cc:268] Using random seed: 4009598
I20260928 14:37:09.452262 18050 test_util.cc:268] Using random seed: 4011336
I20260928 14:37:09.456529 18051 test_util.cc:268] Using random seed: 4015554
I20260928 14:37:09.459976 18052 test_util.cc:268] Using random seed: 4018937
I20260928 14:37:09.462586 18053 test_util.cc:268] Using random seed: 4021643
I20260928 14:37:09.464568 18054 test_util.cc:268] Using random seed: 4023637
I20260928 14:37:09.467512 18055 test_util.cc:268] Using random seed: 4026591
I20260928 14:37:09.470414 18056 test_util.cc:268] Using random seed: 4029376
I20260928 14:37:09.471941 18057 test_util.cc:268] Using random seed: 4030953
I20260928 14:37:09.475695 18058 test_util.cc:268] Using random seed: 4034759
I20260928 14:37:09.477197 18059 test_util.cc:268] Using random seed: 4036274
I20260928 14:37:09.478675 18060 test_util.cc:268] Using random seed: 4037737
I20260928 14:37:09.480189 18061 test_util.cc:268] Using random seed: 4039122
I20260928 14:37:09.481647 18062 test_util.cc:268] Using random seed: 4040700
I20260928 14:37:09.483042 18063 test_util.cc:268] Using random seed: 4042096
I20260928 14:37:09.484634 18064 test_util.cc:268] Using random seed: 4043703
[ OK ] Parameters/TestRpc.TestCancellationMultiThreads/SSL_TCP (17592 ms)
[ RUN ] Parameters/TestRpc.TestCallId/SSL_TCP
I20260928 14:37:26.862495 18078 acceptor_pool.cc:254] collecting diagnostics on the listening RPC socket 0.0.0.0:44059 every 8 connection(s)
I20260928 14:37:26.863234 18079 acceptor_pool.cc:254] collecting diagnostics on the listening RPC socket 0.0.0.0:44059 every 8 connection(s)
[ OK ] Parameters/TestRpc.TestCallId/SSL_TCP (94 ms)
[----------] 20 tests from Parameters/TestRpc (37149 ms total)
[----------] Global test environment tear-down
[==========] 21 tests from 2 test suites ran. (37157 ms total)
[ PASSED ] 20 tests.
[ FAILED ] 1 test, listed below:
[ FAILED ] Parameters/TestRpc.TestCallWithChainCertAndRootCA/SSL_TCP, where GetParam() = (true, false)
1 FAILED TEST