Diagnosed failure

Parameters/TestRpc.TestCallWithChainCertAndChainCA/SSL_TCP: /data0/somelongdirectorytoavoidrpathissues/src/kudu/src/kudu/rpc/rpc-test.cc:270: Failure
Failed
Bad status: Runtime error: could not verify certificate chain (error with cert: subject=CN = localhost, ST = sadfjas, C = AS, emailAddress = sdflkdsajf, O = lskdfjlsad, OU = sldfkja, issuer=C = AS, ST = ASDfkjdhf, L = lskdjf, O = saldfja, OU = skdjf, CN = localhost, emailAddress = sadjflkadsj): : certificate has expired
Google Test trace:
/data0/somelongdirectorytoavoidrpathissues/src/kudu/src/kudu/rpc/rpc-test.cc:267: Connecting to 0.0.0.0:38347
I20260923 19:28:53.336956  1291 test_util.cc:175] -----------------------------------------------
I20260923 19:28:53.337056  1291 test_util.cc:176] Had fatal failures, leaving test files at /tmp/dist-test-taskAZWDE8/test-tmp/rpc-test.5.Parameters_TestRpc.TestCallWithChainCertAndChainCA_SSL_TCP.1790191733217393-1291-0

Full log

Note: This is test shard 6 of 8.
[==========] Running 21 tests from 2 test suites.
[----------] Global test environment set-up.
[----------] 20 tests from Parameters/TestRpc
[ RUN      ] Parameters/TestRpc.TestMessengerCreateDestroy/SSL_TCP
WARNING: Logging before InitGoogleLogging() is written to STDERR
I20260923 19:28:53.269794  1291 rpc-test.cc:169] started messenger TestCreateDestroy
[       OK ] Parameters/TestRpc.TestMessengerCreateDestroy/SSL_TCP (34 ms)
[ RUN      ] Parameters/TestRpc.TestNegotiationDeadlock/SSL_TCP
I20260923 19:28:53.294593  1311 acceptor_pool.cc:254] collecting diagnostics on the listening RPC socket 0.0.0.0:33903 every 8 connection(s)
I20260923 19:28:53.294875  1312 acceptor_pool.cc:254] collecting diagnostics on the listening RPC socket 0.0.0.0:33903 every 8 connection(s)
[       OK ] Parameters/TestRpc.TestNegotiationDeadlock/SSL_TCP (41 ms)
[ RUN      ] Parameters/TestRpc.TestCallWithChainCertAndChainCA/SSL_TCP
I20260923 19:28:53.324295  1327 acceptor_pool.cc:254] collecting diagnostics on the listening RPC socket 0.0.0.0:38347 every 8 connection(s)
I20260923 19:28:53.324656  1328 acceptor_pool.cc:254] collecting diagnostics on the listening RPC socket 0.0.0.0:38347 every 8 connection(s)
/data0/somelongdirectorytoavoidrpathissues/src/kudu/src/kudu/rpc/rpc-test.cc:270: Failure
Failed
Bad status: Runtime error: could not verify certificate chain (error with cert: subject=CN = localhost, ST = sadfjas, C = AS, emailAddress = sdflkdsajf, O = lskdfjlsad, OU = sldfkja, issuer=C = AS, ST = ASDfkjdhf, L = lskdjf, O = saldfja, OU = skdjf, CN = localhost, emailAddress = sadjflkadsj): : certificate has expired
Google Test trace:
/data0/somelongdirectorytoavoidrpathissues/src/kudu/src/kudu/rpc/rpc-test.cc:267: Connecting to 0.0.0.0:38347
I20260923 19:28:53.336956  1291 test_util.cc:175] -----------------------------------------------
I20260923 19:28:53.337056  1291 test_util.cc:176] Had fatal failures, leaving test files at /tmp/dist-test-taskAZWDE8/test-tmp/rpc-test.5.Parameters_TestRpc.TestCallWithChainCertAndChainCA_SSL_TCP.1790191733217393-1291-0
[  FAILED  ] Parameters/TestRpc.TestCallWithChainCertAndChainCA/SSL_TCP, where GetParam() = (true, false) (22 ms)
[ RUN      ] Parameters/TestRpc.TestCallWithPasswordProtectedKey/SSL_TCP
I20260923 19:28:53.352449  1352 acceptor_pool.cc:254] collecting diagnostics on the listening RPC socket 0.0.0.0:42605 every 8 connection(s)
I20260923 19:28:53.352711  1353 acceptor_pool.cc:254] collecting diagnostics on the listening RPC socket 0.0.0.0:42605 every 8 connection(s)
[       OK ] Parameters/TestRpc.TestCallWithPasswordProtectedKey/SSL_TCP (51 ms)
[ RUN      ] Parameters/TestRpc.TestCallToBadServer/SSL_TCP
I20260923 19:28:53.403625  1291 rpc-test.cc:394] Status: Network error: Client connection negotiation failed: client connection to 0.0.0.0:0: connect: Connection refused (error 111)
I20260923 19:28:53.404270  1291 rpc-test.cc:394] Status: Network error: Client connection negotiation failed: client connection to 0.0.0.0:0: connect: Connection refused (error 111)
I20260923 19:28:53.404789  1291 rpc-test.cc:394] Status: Network error: Client connection negotiation failed: client connection to 0.0.0.0:0: connect: Connection refused (error 111)
I20260923 19:28:53.405274  1291 rpc-test.cc:394] Status: Network error: Client connection negotiation failed: client connection to 0.0.0.0:0: connect: Connection refused (error 111)
I20260923 19:28:53.405800  1291 rpc-test.cc:394] Status: Network error: Client connection negotiation failed: client connection to 0.0.0.0:0: connect: Connection refused (error 111)
[       OK ] Parameters/TestRpc.TestCallToBadServer/SSL_TCP (18 ms)
[ RUN      ] Parameters/TestRpc.TestWrongService/SSL_TCP
I20260923 19:28:53.430366  1387 acceptor_pool.cc:254] collecting diagnostics on the listening RPC socket 0.0.0.0:46243 every 8 connection(s)
I20260923 19:28:53.430672  1388 acceptor_pool.cc:254] collecting diagnostics on the listening RPC socket 0.0.0.0:46243 every 8 connection(s)
I20260923 19:28:53.466421  1386 messenger.cc:345] service WrongServiceName not registered on TestServer
[       OK ] Parameters/TestRpc.TestWrongService/SSL_TCP (64 ms)
[ RUN      ] Parameters/TestRpc.TestConnectionKeepalive/SSL_TCP
I20260923 19:28:53.480301  1410 acceptor_pool.cc:254] collecting diagnostics on the listening RPC socket 0.0.0.0:41655 every 8 connection(s)
I20260923 19:28:53.480559  1411 acceptor_pool.cc:254] collecting diagnostics on the listening RPC socket 0.0.0.0:41655 every 8 connection(s)
I20260923 19:28:53.481514  1291 rpc-test.cc:488] Connecting to 0.0.0.0:41655
[       OK ] Parameters/TestRpc.TestConnectionKeepalive/SSL_TCP (1036 ms)
[ RUN      ] Parameters/TestRpc.TestClientConnectionMetrics/SSL_TCP
I20260923 19:28:54.533736  1435 acceptor_pool.cc:254] collecting diagnostics on the listening RPC socket 0.0.0.0:40825 every 8 connection(s)
I20260923 19:28:54.534025  1436 acceptor_pool.cc:254] collecting diagnostics on the listening RPC socket 0.0.0.0:40825 every 8 connection(s)
I20260923 19:28:54.535137  1291 rpc-test.cc:569] Connecting to 0.0.0.0:40825
[       OK ] Parameters/TestRpc.TestClientConnectionMetrics/SSL_TCP (20392 ms)
[ RUN      ] Parameters/TestRpc.TestCredentialsPolicy/SSL_TCP
I20260923 19:29:14.929042  1458 acceptor_pool.cc:254] collecting diagnostics on the listening RPC socket 0.0.0.0:37355 every 8 connection(s)
I20260923 19:29:14.929271  1459 acceptor_pool.cc:254] collecting diagnostics on the listening RPC socket 0.0.0.0:37355 every 8 connection(s)
I20260923 19:29:14.930256  1291 rpc-test.cc:700] Connecting to 0.0.0.0:37355
[       OK ] Parameters/TestRpc.TestCredentialsPolicy/SSL_TCP (70 ms)
[ RUN      ] Parameters/TestRpc.TestCallLongerThanKeepalive/SSL_TCP
I20260923 19:29:15.014864  1483 acceptor_pool.cc:254] collecting diagnostics on the listening RPC socket 0.0.0.0:38725 every 8 connection(s)
I20260923 19:29:15.015112  1484 acceptor_pool.cc:254] collecting diagnostics on the listening RPC socket 0.0.0.0:38725 every 8 connection(s)
I20260923 19:29:15.031781  1487 rpc-test-base.h:222] got call: sleep_micros: 3000000 deferred: true
I20260923 19:29:18.033500  1487 rpcz_store.cc:275] Call kudu.rpc.GenericCalculatorService.Sleep from 127.0.0.1:40532 (request call id 0) took 3001 ms. Trace:
I20260923 19:29:18.033667  1487 rpcz_store.cc:276] 0923 19:29:15.031676 (+     0us) service_pool.cc:170] Inserting onto call queue
0923 19:29:15.031738 (+    62us) service_pool.cc:227] Handling call
0923 19:29:18.033458 (+3001720us) inbound_call.cc:173] Queueing success response
Metrics: {}
[       OK ] Parameters/TestRpc.TestCallLongerThanKeepalive/SSL_TCP (3068 ms)
[ RUN      ] Parameters/TestRpc.TestRpcSidecar/SSL_TCP
I20260923 19:29:18.064106  1508 acceptor_pool.cc:254] collecting diagnostics on the listening RPC socket 0.0.0.0:42875 every 8 connection(s)
I20260923 19:29:18.064347  1509 acceptor_pool.cc:254] collecting diagnostics on the listening RPC socket 0.0.0.0:42875 every 8 connection(s)
[       OK ] Parameters/TestRpc.TestRpcSidecar/SSL_TCP (131 ms)
[ RUN      ] Parameters/TestRpc.TestRpcSidecarLimits/SSL_TCP
I20260923 19:29:20.321527  1533 acceptor_pool.cc:254] collecting diagnostics on the listening RPC socket 0.0.0.0:45193 every 8 connection(s)
I20260923 19:29:20.321784  1534 acceptor_pool.cc:254] collecting diagnostics on the listening RPC socket 0.0.0.0:45193 every 8 connection(s)
W20260923 19:29:20.342778  1291 serialization.cc:72] Serialized kudu.rpc_test.PushStringsRequestPB (2147483654 bytes) is larger than the maximum configured RPC message size (52428800 bytes). Sending anyway, but peer may reject the data.
W20260923 19:29:20.349949  1532 connection.cc:535] server connection from 127.0.0.1:42034 recv error: Network error: RPC frame had a length of 2147483714, but we only support messages up to 52428800 bytes long.
W20260923 19:29:20.350127  1532 connection.cc:158] shutting down server connection from 127.0.0.1:42034 with pending inbound data: 4/2147483714 bytes received; last active 0 ns ago: status Network error: RPC frame had a length of 2147483714, but we only support messages up to 52428800 bytes long.
W20260923 19:29:20.350716  1546 connection.cc:196] Error closing socket: Network error: TlsSocket::Close: Connection reset by peer
I20260923 19:29:20.378337  1558 acceptor_pool.cc:254] collecting diagnostics on the listening RPC socket 0.0.0.0:33251 every 8 connection(s)
I20260923 19:29:20.378494  1559 acceptor_pool.cc:254] collecting diagnostics on the listening RPC socket 0.0.0.0:33251 every 8 connection(s)
W20260923 19:29:25.762473  1557 connection.cc:577] server connection from 127.0.0.1:42520: received bad data: 'Corruption: Invalid packet: message had a length of 2147483710, but we only support messages up to 2147483647 bytes
'
[       OK ] Parameters/TestRpc.TestRpcSidecarLimits/SSL_TCP (8073 ms)
[ RUN      ] Parameters/TestRpc.TestCallTimeoutDoesntAffectNegotiation/SSL_TCP
I20260923 19:29:26.269129  1583 acceptor_pool.cc:254] collecting diagnostics on the listening RPC socket 0.0.0.0:43949 every 8 connection(s)
I20260923 19:29:26.269459  1584 acceptor_pool.cc:254] collecting diagnostics on the listening RPC socket 0.0.0.0:43949 every 8 connection(s)
W20260923 19:29:26.310631  1579 negotiation.cc:266] Injecting 500ms delay in negotiation
I20260923 19:29:26.361023  1291 rpc-test-base.h:595] status: Timed out: connection negotiation to 0.0.0.0:43949 for RPC Sleep timed out after 0.050s (ON_OUTBOUND_QUEUE), seconds elapsed: 0.0511306
[       OK ] Parameters/TestRpc.TestCallTimeoutDoesntAffectNegotiation/SSL_TCP (576 ms)
[ RUN      ] Parameters/TestRpc.TestRpcHandlerLatencyMetric/SSL_TCP
I20260923 19:29:26.836071  1608 acceptor_pool.cc:254] collecting diagnostics on the listening RPC socket 0.0.0.0:35079 every 8 connection(s)
I20260923 19:29:26.836356  1609 acceptor_pool.cc:254] collecting diagnostics on the listening RPC socket 0.0.0.0:35079 every 8 connection(s)
I20260923 19:29:26.892540  1291 rpc-test.cc:1236] Sleep() min lat: 20690
I20260923 19:29:26.892635  1291 rpc-test.cc:1237] Sleep() mean lat: 20690
I20260923 19:29:26.892678  1291 rpc-test.cc:1238] Sleep() max lat: 20690
I20260923 19:29:26.892701  1291 rpc-test.cc:1239] Sleep() #calls: 1
[       OK ] Parameters/TestRpc.TestRpcHandlerLatencyMetric/SSL_TCP (76 ms)
[ RUN      ] Parameters/TestRpc.TimedOutOnResponseMetricServiceQueue/SSL_TCP
I20260923 19:29:26.915360  1634 acceptor_pool.cc:254] collecting diagnostics on the listening RPC socket 0.0.0.0:42813 every 8 connection(s)
I20260923 19:29:26.915514  1635 acceptor_pool.cc:254] collecting diagnostics on the listening RPC socket 0.0.0.0:42813 every 8 connection(s)
W20260923 19:29:26.974684  1636 rpcz_store.cc:267] Call kudu.rpc_test.CalculatorService.Sleep from 127.0.0.1:58786 (request call id 2) took 20 ms (client timeout 20 ms). Trace:
W20260923 19:29:26.974848  1636 rpcz_store.cc:269] 0923 19:29:26.954241 (+     0us) service_pool.cc:170] Inserting onto call queue
0923 19:29:26.974589 (+ 20348us) service_pool.cc:214] Skipping call since client already timed out
0923 19:29:26.974661 (+    72us) inbound_call.cc:173] Queueing failure response
Metrics: {}
[       OK ] Parameters/TestRpc.TimedOutOnResponseMetricServiceQueue/SSL_TCP (81 ms)
[ RUN      ] Parameters/TestRpc.RpcPendingConnectionsMetric/SSL_TCP
I20260923 19:29:26.984983  1657 acceptor_pool.cc:254] collecting diagnostics on the listening RPC socket 0.0.0.0:43163 every 8 connection(s)
I20260923 19:29:26.985195  1658 acceptor_pool.cc:254] collecting diagnostics on the listening RPC socket 0.0.0.0:43163 every 8 connection(s)
W20260923 19:29:26.997027  1653 negotiation.cc:337] Failed RPC negotiation. Trace:
0923 19:29:26.996156 (+     0us) reactor.cc:625] Submitting negotiation task for server connection from 127.0.0.1:51344 (local address 127.0.0.1:43163)
0923 19:29:26.996395 (+   239us) server_negotiation.cc:206] Beginning negotiation
0923 19:29:26.996401 (+     6us) server_negotiation.cc:399] Waiting for connection header
0923 19:29:26.996603 (+   202us) negotiation.cc:327] Negotiation complete: Network error: Server connection negotiation failed: server connection from 127.0.0.1:51344: BlockingRecv error: recv got EOF from 127.0.0.1:51344 (error 108)
Metrics: {"server-negotiator.queue_time_us":60}
[       OK ] Parameters/TestRpc.RpcPendingConnectionsMetric/SSL_TCP (29 ms)
[ RUN      ] Parameters/TestRpc.TestRpcContextClientDeadline/SSL_TCP
I20260923 19:29:27.023239  1673 acceptor_pool.cc:254] collecting diagnostics on the listening RPC socket 0.0.0.0:43039 every 8 connection(s)
I20260923 19:29:27.023475  1674 acceptor_pool.cc:254] collecting diagnostics on the listening RPC socket 0.0.0.0:43039 every 8 connection(s)
[       OK ] Parameters/TestRpc.TestRpcContextClientDeadline/SSL_TCP (81 ms)
[ RUN      ] Parameters/TestRpc.TestApplicationFeatureFlagUnsupportedServer/SSL_TCP
I20260923 19:29:27.105096  1698 acceptor_pool.cc:254] collecting diagnostics on the listening RPC socket 0.0.0.0:45295 every 8 connection(s)
I20260923 19:29:27.105304  1699 acceptor_pool.cc:254] collecting diagnostics on the listening RPC socket 0.0.0.0:45295 every 8 connection(s)
[       OK ] Parameters/TestRpc.TestApplicationFeatureFlagUnsupportedServer/SSL_TCP (41 ms)
[ RUN      ] Parameters/TestRpc.TestCancellationAsync/SSL_TCP
I20260923 19:29:27.156670  1723 acceptor_pool.cc:254] collecting diagnostics on the listening RPC socket 0.0.0.0:39919 every 8 connection(s)
I20260923 19:29:27.156926  1724 acceptor_pool.cc:254] collecting diagnostics on the listening RPC socket 0.0.0.0:39919 every 8 connection(s)
I20260923 19:29:27.157997  1291 rpc-test.cc:1716] Connecting to 0.0.0.0:39919
I20260923 19:29:27.171795  1291 test_util.cc:268] Using random seed: -2141408589
I20260923 19:29:27.219465  1727 rpc-test-base.h:240] got call: sleep_micros: 500 pattern: 4294967295 num_repetitions: 2097152 sidecar_idx: 0
I20260923 19:29:27.251124  1726 rpc-test-base.h:240] got call: sleep_micros: 500 pattern: 4294967295 num_repetitions: 2097152 sidecar_idx: 0
I20260923 19:29:27.282260  1727 rpc-test-base.h:240] got call: sleep_micros: 500 pattern: 4294967295 num_repetitions: 2097152 sidecar_idx: 0
I20260923 19:29:27.313889  1726 rpc-test-base.h:240] got call: sleep_micros: 500 pattern: 4294967295 num_repetitions: 2097152 sidecar_idx: 0
I20260923 19:29:27.345134  1727 rpc-test-base.h:240] got call: sleep_micros: 500 pattern: 4294967295 num_repetitions: 2097152 sidecar_idx: 0
I20260923 19:29:27.377379  1727 rpc-test-base.h:240] got call: sleep_micros: 500 pattern: 4294967295 num_repetitions: 2097152 sidecar_idx: 0
W20260923 19:29:27.410288  1722 connection.cc:196] Error closing socket: Network error: TlsSocket::Close: Broken pipe
W20260923 19:29:27.412400  1722 connection.cc:441] server connection from 127.0.0.1:36632 torn down before Call kudu.rpc.GenericCalculatorService.SleepWithSidecar from 127.0.0.1:36632 (request call id 8) could send its response
[       OK ] Parameters/TestRpc.TestCancellationAsync/SSL_TCP (282 ms)
[ RUN      ] Parameters/TestRpc.TestPerformanceBySocketType/SSL_TCP
I20260923 19:29:27.446053  1748 acceptor_pool.cc:254] collecting diagnostics on the listening RPC socket 0.0.0.0:40891 every 8 connection(s)
I20260923 19:29:27.446278  1749 acceptor_pool.cc:254] collecting diagnostics on the listening RPC socket 0.0.0.0:40891 every 8 connection(s)
I20260923 19:29:27.447156  1291 rpc-test.cc:1846] Connecting to 0.0.0.0:40891
I20260923 19:29:30.490193  1291 rpc-test.cc:1859] Sending 1024MB via ssl-enabled tcp socket: real 3.024s	user 2.765s	sys 2.277s
I20260923 19:29:33.458873  1291 rpc-test.cc:1859] Sending 1024MB via ssl-enabled tcp socket: real 2.968s	user 2.700s	sys 2.224s
I20260923 19:29:36.433498  1291 rpc-test.cc:1859] Sending 1024MB via ssl-enabled tcp socket: real 2.974s	user 2.878s	sys 2.087s
I20260923 19:29:39.533933  1291 rpc-test.cc:1859] Sending 1024MB via ssl-enabled tcp socket: real 3.100s	user 2.822s	sys 2.321s
I20260923 19:29:42.399569  1291 rpc-test.cc:1859] Sending 1024MB via ssl-enabled tcp socket: real 2.865s	user 2.529s	sys 2.187s
[       OK ] Parameters/TestRpc.TestPerformanceBySocketType/SSL_TCP (14991 ms)
[----------] 20 tests from Parameters/TestRpc (49168 ms total)

[----------] 1 test from Parameters/TestRpcSocketTxRxQueue
[ RUN      ] Parameters/TestRpcSocketTxRxQueue.OverCapacity/0
W20260923 19:29:42.709414  1765 negotiation.cc:337] Failed RPC negotiation. Trace:
0923 19:29:42.418055 (+     0us) reactor.cc:625] Submitting negotiation task for client connection to 0.0.0.0:41583 (local address 127.0.0.1:48520)
0923 19:29:42.418259 (+   204us) negotiation.cc:107] Waiting for socket to connect
0923 19:29:42.418280 (+    21us) client_negotiation.cc:174] Beginning negotiation
0923 19:29:42.418404 (+   124us) client_negotiation.cc:252] Sending NEGOTIATE NegotiatePB request
0923 19:29:42.708864 (+290460us) negotiation.cc:327] Negotiation complete: Network error: Client connection negotiation failed: client connection to 0.0.0.0:41583: BlockingRecv error: recv error from unknown peer: Transport endpoint is not connected (error 107)
Metrics: {"client-negotiator.queue_time_us":59}
W20260923 19:29:42.709501  1792 negotiation.cc:337] Failed RPC negotiation. Trace:
0923 19:29:42.426046 (+     0us) reactor.cc:625] Submitting negotiation task for client connection to 0.0.0.0:41583 (local address 127.0.0.1:48546)
0923 19:29:42.426252 (+   206us) negotiation.cc:107] Waiting for socket to connect
0923 19:29:42.426274 (+    22us) client_negotiation.cc:174] Beginning negotiation
0923 19:29:42.426380 (+   106us) client_negotiation.cc:252] Sending NEGOTIATE NegotiatePB request
0923 19:29:42.708864 (+282484us) negotiation.cc:327] Negotiation complete: Network error: Client connection negotiation failed: client connection to 0.0.0.0:41583: BlockingRecv error: recv error from unknown peer: Transport endpoint is not connected (error 107)
Metrics: {"client-negotiator.queue_time_us":51}
W20260923 19:29:42.709559  1774 negotiation.cc:337] Failed RPC negotiation. Trace:
0923 19:29:42.420589 (+     0us) reactor.cc:625] Submitting negotiation task for client connection to 0.0.0.0:41583 (local address 127.0.0.1:48530)
0923 19:29:42.420810 (+   221us) negotiation.cc:107] Waiting for socket to connect
0923 19:29:42.420830 (+    20us) client_negotiation.cc:174] Beginning negotiation
0923 19:29:42.420940 (+   110us) client_negotiation.cc:252] Sending NEGOTIATE NegotiatePB request
0923 19:29:42.709036 (+288096us) negotiation.cc:327] Negotiation complete: Network error: Client connection negotiation failed: client connection to 0.0.0.0:41583: BlockingRecv error: recv error from unknown peer: Transport endpoint is not connected (error 107)
Metrics: {"client-negotiator.queue_time_us":63}
W20260923 19:29:42.710089  1801 negotiation.cc:337] Failed RPC negotiation. Trace:
0923 19:29:42.428670 (+     0us) reactor.cc:625] Submitting negotiation task for client connection to 0.0.0.0:41583 (local address 127.0.0.1:48548)
0923 19:29:42.428866 (+   196us) negotiation.cc:107] Waiting for socket to connect
0923 19:29:42.428888 (+    22us) client_negotiation.cc:174] Beginning negotiation
0923 19:29:42.428986 (+    98us) client_negotiation.cc:252] Sending NEGOTIATE NegotiatePB request
0923 19:29:42.709375 (+280389us) negotiation.cc:327] Negotiation complete: Network error: Client connection negotiation failed: client connection to 0.0.0.0:41583: BlockingRecv error: recv error from unknown peer: Transport endpoint is not connected (error 107)
Metrics: {"client-negotiator.queue_time_us":50}
W20260923 19:29:42.710400  1810 negotiation.cc:337] Failed RPC negotiation. Trace:
0923 19:29:42.431539 (+     0us) reactor.cc:625] Submitting negotiation task for client connection to 0.0.0.0:41583 (local address 127.0.0.1:48564)
0923 19:29:42.431790 (+   251us) negotiation.cc:107] Waiting for socket to connect
0923 19:29:42.431808 (+    18us) client_negotiation.cc:174] Beginning negotiation
0923 19:29:42.431922 (+   114us) client_negotiation.cc:252] Sending NEGOTIATE NegotiatePB request
0923 19:29:42.709658 (+277736us) negotiation.cc:327] Negotiation complete: Network error: Client connection negotiation failed: client connection to 0.0.0.0:41583: BlockingRecv error: recv error from unknown peer: Transport endpoint is not connected (error 107)
Metrics: {"client-negotiator.queue_time_us":54}
W20260923 19:29:42.710489  1783 negotiation.cc:337] Failed RPC negotiation. Trace:
0923 19:29:42.423348 (+     0us) reactor.cc:625] Submitting negotiation task for client connection to 0.0.0.0:41583 (local address 127.0.0.1:48542)
0923 19:29:42.423559 (+   211us) negotiation.cc:107] Waiting for socket to connect
0923 19:29:42.423582 (+    23us) client_negotiation.cc:174] Beginning negotiation
0923 19:29:42.423690 (+   108us) client_negotiation.cc:252] Sending NEGOTIATE NegotiatePB request
0923 19:29:42.708952 (+285262us) negotiation.cc:327] Negotiation complete: Network error: Client connection negotiation failed: client connection to 0.0.0.0:41583: BlockingRecv error: recv error from unknown peer: Transport endpoint is not connected (error 107)
Metrics: {"client-negotiator.queue_time_us":56}
[       OK ] Parameters/TestRpcSocketTxRxQueue.OverCapacity/0 (1071 ms)
[----------] 1 test from Parameters/TestRpcSocketTxRxQueue (1072 ms total)

[----------] Global test environment tear-down
[==========] 21 tests from 2 test suites ran. (50240 ms total)
[  PASSED  ] 20 tests.
[  FAILED  ] 1 test, listed below:
[  FAILED  ] Parameters/TestRpc.TestCallWithChainCertAndChainCA/SSL_TCP, where GetParam() = (true, false)

 1 FAILED TEST