Diagnosed failure

Parameters/TestRpc.TestCallWithChainCertAndChainCA/SSL_TCP: /data0/somelongdirectorytoavoidrpathissues/src/kudu/src/kudu/rpc/rpc-test.cc:270: Failure
Failed
Bad status: Runtime error: could not verify certificate chain (error with cert: subject=CN = localhost, ST = sadfjas, C = AS, emailAddress = sdflkdsajf, O = lskdfjlsad, OU = sldfkja, issuer=C = AS, ST = ASDfkjdhf, L = lskdjf, O = saldfja, OU = skdjf, CN = localhost, emailAddress = sadjflkadsj): : certificate has expired
Google Test trace:
/data0/somelongdirectorytoavoidrpathissues/src/kudu/src/kudu/rpc/rpc-test.cc:267: Connecting to 0.0.0.0:42193
I20260925 19:30:32.504776   390 test_util.cc:175] -----------------------------------------------
I20260925 19:30:32.504971   390 test_util.cc:176] Had fatal failures, leaving test files at /tmp/dist-test-task1M6Csz/test-tmp/rpc-test.5.Parameters_TestRpc.TestCallWithChainCertAndChainCA_SSL_TCP.1790364631132330-390-0

Full log

Note: This is test shard 6 of 8.
[==========] Running 21 tests from 2 test suites.
[----------] Global test environment set-up.
[----------] 20 tests from Parameters/TestRpc
[ RUN      ] Parameters/TestRpc.TestMessengerCreateDestroy/SSL_TCP
WARNING: Logging before InitGoogleLogging() is written to STDERR
I20260925 19:30:31.247699   390 rpc-test.cc:169] started messenger TestCreateDestroy
[       OK ] Parameters/TestRpc.TestMessengerCreateDestroy/SSL_TCP (1190 ms)
[ RUN      ] Parameters/TestRpc.TestNegotiationDeadlock/SSL_TCP
I20260925 19:30:32.401989   412 acceptor_pool.cc:254] collecting diagnostics on the listening RPC socket 0.0.0.0:38631 every 8 connection(s)
I20260925 19:30:32.403347   413 acceptor_pool.cc:254] collecting diagnostics on the listening RPC socket 0.0.0.0:38631 every 8 connection(s)
[       OK ] Parameters/TestRpc.TestNegotiationDeadlock/SSL_TCP (79 ms)
[ RUN      ] Parameters/TestRpc.TestCallWithChainCertAndChainCA/SSL_TCP
I20260925 19:30:32.475801   428 acceptor_pool.cc:254] collecting diagnostics on the listening RPC socket 0.0.0.0:42193 every 8 connection(s)
I20260925 19:30:32.477600   429 acceptor_pool.cc:254] collecting diagnostics on the listening RPC socket 0.0.0.0:42193 every 8 connection(s)
/data0/somelongdirectorytoavoidrpathissues/src/kudu/src/kudu/rpc/rpc-test.cc:270: Failure
Failed
Bad status: Runtime error: could not verify certificate chain (error with cert: subject=CN = localhost, ST = sadfjas, C = AS, emailAddress = sdflkdsajf, O = lskdfjlsad, OU = sldfkja, issuer=C = AS, ST = ASDfkjdhf, L = lskdjf, O = saldfja, OU = skdjf, CN = localhost, emailAddress = sadjflkadsj): : certificate has expired
Google Test trace:
/data0/somelongdirectorytoavoidrpathissues/src/kudu/src/kudu/rpc/rpc-test.cc:267: Connecting to 0.0.0.0:42193
I20260925 19:30:32.504776   390 test_util.cc:175] -----------------------------------------------
I20260925 19:30:32.504971   390 test_util.cc:176] Had fatal failures, leaving test files at /tmp/dist-test-task1M6Csz/test-tmp/rpc-test.5.Parameters_TestRpc.TestCallWithChainCertAndChainCA_SSL_TCP.1790364631132330-390-0
[  FAILED  ] Parameters/TestRpc.TestCallWithChainCertAndChainCA/SSL_TCP, where GetParam() = (true, false) (51 ms)
[ RUN      ] Parameters/TestRpc.TestCallWithPasswordProtectedKey/SSL_TCP
I20260925 19:30:32.525564   453 acceptor_pool.cc:254] collecting diagnostics on the listening RPC socket 0.0.0.0:42405 every 8 connection(s)
I20260925 19:30:32.526297   454 acceptor_pool.cc:254] collecting diagnostics on the listening RPC socket 0.0.0.0:42405 every 8 connection(s)
[       OK ] Parameters/TestRpc.TestCallWithPasswordProtectedKey/SSL_TCP (68 ms)
[ RUN      ] Parameters/TestRpc.TestCallToBadServer/SSL_TCP
I20260925 19:30:32.595333   390 rpc-test.cc:394] Status: Network error: Client connection negotiation failed: client connection to 0.0.0.0:0: connect: Connection refused (error 111)
I20260925 19:30:32.596704   390 rpc-test.cc:394] Status: Network error: Client connection negotiation failed: client connection to 0.0.0.0:0: connect: Connection refused (error 111)
I20260925 19:30:32.598057   390 rpc-test.cc:394] Status: Network error: Client connection negotiation failed: client connection to 0.0.0.0:0: connect: Connection refused (error 111)
I20260925 19:30:32.599357   390 rpc-test.cc:394] Status: Network error: Client connection negotiation failed: client connection to 0.0.0.0:0: connect: Connection refused (error 111)
I20260925 19:30:32.600690   390 rpc-test.cc:394] Status: Network error: Client connection negotiation failed: client connection to 0.0.0.0:0: connect: Connection refused (error 111)
[       OK ] Parameters/TestRpc.TestCallToBadServer/SSL_TCP (30 ms)
[ RUN      ] Parameters/TestRpc.TestWrongService/SSL_TCP
I20260925 19:30:32.638805   488 acceptor_pool.cc:254] collecting diagnostics on the listening RPC socket 0.0.0.0:43175 every 8 connection(s)
I20260925 19:30:32.639616   489 acceptor_pool.cc:254] collecting diagnostics on the listening RPC socket 0.0.0.0:43175 every 8 connection(s)
I20260925 19:30:32.685738   486 messenger.cc:345] service WrongServiceName not registered on TestServer
[       OK ] Parameters/TestRpc.TestWrongService/SSL_TCP (90 ms)
[ RUN      ] Parameters/TestRpc.TestConnectionKeepalive/SSL_TCP
I20260925 19:30:32.712662   511 acceptor_pool.cc:254] collecting diagnostics on the listening RPC socket 0.0.0.0:45751 every 8 connection(s)
I20260925 19:30:32.713497   512 acceptor_pool.cc:254] collecting diagnostics on the listening RPC socket 0.0.0.0:45751 every 8 connection(s)
I20260925 19:30:32.716918   390 rpc-test.cc:488] Connecting to 0.0.0.0:45751
[       OK ] Parameters/TestRpc.TestConnectionKeepalive/SSL_TCP (1071 ms)
[ RUN      ] Parameters/TestRpc.TestClientConnectionMetrics/SSL_TCP
I20260925 19:30:33.799356   536 acceptor_pool.cc:254] collecting diagnostics on the listening RPC socket 0.0.0.0:33645 every 8 connection(s)
I20260925 19:30:33.800071   537 acceptor_pool.cc:254] collecting diagnostics on the listening RPC socket 0.0.0.0:33645 every 8 connection(s)
I20260925 19:30:33.803210   390 rpc-test.cc:569] Connecting to 0.0.0.0:33645
[       OK ] Parameters/TestRpc.TestClientConnectionMetrics/SSL_TCP (115163 ms)
[ RUN      ] Parameters/TestRpc.TestCredentialsPolicy/SSL_TCP
I20260925 19:32:28.945744   570 acceptor_pool.cc:254] collecting diagnostics on the listening RPC socket 0.0.0.0:45601 every 8 connection(s)
I20260925 19:32:28.946496   571 acceptor_pool.cc:254] collecting diagnostics on the listening RPC socket 0.0.0.0:45601 every 8 connection(s)
I20260925 19:32:28.949707   390 rpc-test.cc:700] Connecting to 0.0.0.0:45601
[       OK ] Parameters/TestRpc.TestCredentialsPolicy/SSL_TCP (79 ms)
[ RUN      ] Parameters/TestRpc.TestCallLongerThanKeepalive/SSL_TCP
I20260925 19:32:29.029614   595 acceptor_pool.cc:254] collecting diagnostics on the listening RPC socket 0.0.0.0:33297 every 8 connection(s)
I20260925 19:32:29.030319   596 acceptor_pool.cc:254] collecting diagnostics on the listening RPC socket 0.0.0.0:33297 every 8 connection(s)
I20260925 19:32:29.092209   599 rpc-test-base.h:222] got call: sleep_micros: 3000000 deferred: true
I20260925 19:32:32.096676   599 rpcz_store.cc:275] Call kudu.rpc.GenericCalculatorService.Sleep from 127.0.0.1:58682 (request call id 0) took 3004 ms. Trace:
I20260925 19:32:32.097132   599 rpcz_store.cc:276] 0925 19:32:29.091969 (+     0us) service_pool.cc:170] Inserting onto call queue
0925 19:32:29.092073 (+   104us) service_pool.cc:227] Handling call
0925 19:32:32.096499 (+3004426us) inbound_call.cc:173] Queueing success response
Metrics: {}
[       OK ] Parameters/TestRpc.TestCallLongerThanKeepalive/SSL_TCP (3101 ms)
[ RUN      ] Parameters/TestRpc.TestRpcSidecar/SSL_TCP
I20260925 19:32:32.150071   621 acceptor_pool.cc:254] collecting diagnostics on the listening RPC socket 0.0.0.0:43377 every 8 connection(s)
I20260925 19:32:32.150816   622 acceptor_pool.cc:254] collecting diagnostics on the listening RPC socket 0.0.0.0:43377 every 8 connection(s)
[       OK ] Parameters/TestRpc.TestRpcSidecar/SSL_TCP (545 ms)
[ RUN      ] Parameters/TestRpc.TestRpcSidecarLimits/SSL_TCP
I20260925 19:32:49.578437   647 acceptor_pool.cc:254] collecting diagnostics on the listening RPC socket 0.0.0.0:43825 every 8 connection(s)
I20260925 19:32:49.579447   648 acceptor_pool.cc:254] collecting diagnostics on the listening RPC socket 0.0.0.0:43825 every 8 connection(s)
W20260925 19:32:49.604835   390 serialization.cc:72] Serialized kudu.rpc_test.PushStringsRequestPB (2147483654 bytes) is larger than the maximum configured RPC message size (52428800 bytes). Sending anyway, but peer may reject the data.
W20260925 19:32:49.615221   645 connection.cc:535] server connection from 127.0.0.1:40752 recv error: Network error: RPC frame had a length of 2147483714, but we only support messages up to 52428800 bytes long.
W20260925 19:32:49.615504   645 connection.cc:158] shutting down server connection from 127.0.0.1:40752 with pending inbound data: 4/2147483714 bytes received; last active 0 ns ago: status Network error: RPC frame had a length of 2147483714, but we only support messages up to 52428800 bytes long.
W20260925 19:32:49.616811   660 connection.cc:698] client connection to 0.0.0.0:43825 send error: Network error: failed to write to TLS socket: Connection reset by peer
W20260925 19:32:49.617341   660 connection.cc:196] Error closing socket: Network error: TlsSocket::Close: Success
[       OK ] Parameters/TestRpc.TestRpcSidecarLimits/SSL_TCP (17735 ms)
[ RUN      ] Parameters/TestRpc.TestCallTimeoutDoesntAffectNegotiation/SSL_TCP
I20260925 19:32:50.425577   672 acceptor_pool.cc:254] collecting diagnostics on the listening RPC socket 0.0.0.0:35615 every 8 connection(s)
I20260925 19:32:50.426307   673 acceptor_pool.cc:254] collecting diagnostics on the listening RPC socket 0.0.0.0:35615 every 8 connection(s)
W20260925 19:32:50.467588   668 negotiation.cc:266] Injecting 500ms delay in negotiation
I20260925 19:32:50.517153   390 rpc-test-base.h:595] status: Timed out: connection negotiation to 0.0.0.0:35615 for RPC Sleep timed out after 0.050s (ON_OUTBOUND_QUEUE), seconds elapsed: 0.0506724
[       OK ] Parameters/TestRpc.TestCallTimeoutDoesntAffectNegotiation/SSL_TCP (591 ms)
[ RUN      ] Parameters/TestRpc.TestRpcHandlerLatencyMetric/SSL_TCP
I20260925 19:32:51.011773   697 acceptor_pool.cc:254] collecting diagnostics on the listening RPC socket 0.0.0.0:44187 every 8 connection(s)
I20260925 19:32:51.012534   698 acceptor_pool.cc:254] collecting diagnostics on the listening RPC socket 0.0.0.0:44187 every 8 connection(s)
I20260925 19:32:51.085285   390 rpc-test.cc:1236] Sleep() min lat: 21624
I20260925 19:32:51.085520   390 rpc-test.cc:1237] Sleep() mean lat: 21624
I20260925 19:32:51.085731   390 rpc-test.cc:1238] Sleep() max lat: 21624
I20260925 19:32:51.085898   390 rpc-test.cc:1239] Sleep() #calls: 1
[       OK ] Parameters/TestRpc.TestRpcHandlerLatencyMetric/SSL_TCP (109 ms)
[ RUN      ] Parameters/TestRpc.TimedOutOnResponseMetricServiceQueue/SSL_TCP
I20260925 19:32:51.122810   723 acceptor_pool.cc:254] collecting diagnostics on the listening RPC socket 0.0.0.0:45301 every 8 connection(s)
I20260925 19:32:51.123557   724 acceptor_pool.cc:254] collecting diagnostics on the listening RPC socket 0.0.0.0:45301 every 8 connection(s)
W20260925 19:32:51.223369   725 rpcz_store.cc:267] Call kudu.rpc_test.CalculatorService.Sleep from 127.0.0.1:44302 (request call id 2) took 20 ms (client timeout 20 ms). Trace:
W20260925 19:32:51.223730   725 rpcz_store.cc:269] 0925 19:32:51.202879 (+     0us) service_pool.cc:170] Inserting onto call queue
0925 19:32:51.223237 (+ 20358us) service_pool.cc:214] Skipping call since client already timed out
0925 19:32:51.223318 (+    81us) inbound_call.cc:173] Queueing failure response
Metrics: {}
[       OK ] Parameters/TestRpc.TimedOutOnResponseMetricServiceQueue/SSL_TCP (136 ms)
[ RUN      ] Parameters/TestRpc.RpcPendingConnectionsMetric/SSL_TCP
I20260925 19:32:51.240307   746 acceptor_pool.cc:254] collecting diagnostics on the listening RPC socket 0.0.0.0:38825 every 8 connection(s)
I20260925 19:32:51.240998   747 acceptor_pool.cc:254] collecting diagnostics on the listening RPC socket 0.0.0.0:38825 every 8 connection(s)
W20260925 19:32:51.254601   742 negotiation.cc:337] Failed RPC negotiation. Trace:
0925 19:32:51.252612 (+     0us) reactor.cc:625] Submitting negotiation task for server connection from 127.0.0.1:47436 (local address 127.0.0.1:38825)
0925 19:32:51.253256 (+   644us) server_negotiation.cc:206] Beginning negotiation
0925 19:32:51.253300 (+    44us) server_negotiation.cc:399] Waiting for connection header
0925 19:32:51.253669 (+   369us) negotiation.cc:327] Negotiation complete: Network error: Server connection negotiation failed: server connection from 127.0.0.1:47436: BlockingRecv error: recv got EOF from 127.0.0.1:47436 (error 108)
Metrics: {"server-negotiator.queue_time_us":141}
[       OK ] Parameters/TestRpc.RpcPendingConnectionsMetric/SSL_TCP (37 ms)
[ RUN      ] Parameters/TestRpc.TestRpcContextClientDeadline/SSL_TCP
I20260925 19:32:51.298410   762 acceptor_pool.cc:254] collecting diagnostics on the listening RPC socket 0.0.0.0:36793 every 8 connection(s)
I20260925 19:32:51.299167   763 acceptor_pool.cc:254] collecting diagnostics on the listening RPC socket 0.0.0.0:36793 every 8 connection(s)
[       OK ] Parameters/TestRpc.TestRpcContextClientDeadline/SSL_TCP (91 ms)
[ RUN      ] Parameters/TestRpc.TestApplicationFeatureFlagUnsupportedServer/SSL_TCP
I20260925 19:32:51.377291   787 acceptor_pool.cc:254] collecting diagnostics on the listening RPC socket 0.0.0.0:42911 every 8 connection(s)
I20260925 19:32:51.377993   788 acceptor_pool.cc:254] collecting diagnostics on the listening RPC socket 0.0.0.0:42911 every 8 connection(s)
[       OK ] Parameters/TestRpc.TestApplicationFeatureFlagUnsupportedServer/SSL_TCP (62 ms)
[ RUN      ] Parameters/TestRpc.TestCancellationAsync/SSL_TCP
I20260925 19:32:51.450145   812 acceptor_pool.cc:254] collecting diagnostics on the listening RPC socket 0.0.0.0:43223 every 8 connection(s)
I20260925 19:32:51.450891   813 acceptor_pool.cc:254] collecting diagnostics on the listening RPC socket 0.0.0.0:43223 every 8 connection(s)
I20260925 19:32:51.453943   390 rpc-test.cc:1716] Connecting to 0.0.0.0:43223
I20260925 19:32:51.480891   390 test_util.cc:268] Using random seed: -935791322
W20260925 19:32:51.691993   825 outbound_call.cc:322] RPC callback for RPC call kudu.rpc.GenericCalculatorService.SleepWithSidecar -> {remote=0.0.0.0:43223 (localhost), user_credentials={real_user=slave}} blocked reactor thread for 54177.7us
I20260925 19:32:51.734127   816 rpc-test-base.h:240] got call: sleep_micros: 500 pattern: 4294967295 num_repetitions: 2097152 sidecar_idx: 0
I20260925 19:32:51.950191   815 rpc-test-base.h:240] got call: sleep_micros: 500 pattern: 4294967295 num_repetitions: 2097152 sidecar_idx: 0
I20260925 19:32:52.159130   816 rpc-test-base.h:240] got call: sleep_micros: 500 pattern: 4294967295 num_repetitions: 2097152 sidecar_idx: 0
I20260925 19:32:52.339731   815 rpc-test-base.h:240] got call: sleep_micros: 500 pattern: 4294967295 num_repetitions: 2097152 sidecar_idx: 0
I20260925 19:32:52.521513   816 rpc-test-base.h:240] got call: sleep_micros: 500 pattern: 4294967295 num_repetitions: 2097152 sidecar_idx: 0
W20260925 19:32:52.568293   825 outbound_call.cc:322] RPC callback for RPC call kudu.rpc.GenericCalculatorService.SleepWithSidecar -> {remote=0.0.0.0:43223 (localhost), user_credentials={real_user=slave}} blocked reactor thread for 45221.8us
I20260925 19:32:52.712446   816 rpc-test-base.h:240] got call: sleep_micros: 500 pattern: 4294967295 num_repetitions: 2097152 sidecar_idx: 0
I20260925 19:32:52.888713   816 rpc-test-base.h:240] got call: sleep_micros: 500 pattern: 4294967295 num_repetitions: 2097152 sidecar_idx: 0
I20260925 19:32:53.065322   816 rpc-test-base.h:240] got call: sleep_micros: 500 pattern: 4294967295 num_repetitions: 2097152 sidecar_idx: 0
W20260925 19:32:53.208114   809 connection.cc:196] Error closing socket: Network error: TlsSocket::Close: Broken pipe
W20260925 19:32:53.221552   809 connection.cc:441] server connection from 127.0.0.1:55454 torn down before Call kudu.rpc.GenericCalculatorService.SleepWithSidecar from 127.0.0.1:55454 (request call id 8) could send its response
[       OK ] Parameters/TestRpc.TestCancellationAsync/SSL_TCP (1811 ms)
[ RUN      ] Parameters/TestRpc.TestPerformanceBySocketType/SSL_TCP
I20260925 19:32:53.333433   838 acceptor_pool.cc:254] collecting diagnostics on the listening RPC socket 0.0.0.0:38915 every 8 connection(s)
I20260925 19:32:53.334290   839 acceptor_pool.cc:254] collecting diagnostics on the listening RPC socket 0.0.0.0:38915 every 8 connection(s)
I20260925 19:32:53.337423   390 rpc-test.cc:1846] Connecting to 0.0.0.0:38915
I20260925 19:33:12.531014   390 rpc-test.cc:1859] Sending 1024MB via ssl-enabled tcp socket: real 19.165s	user 16.719s	sys 10.699s
I20260925 19:33:31.574929   390 rpc-test.cc:1859] Sending 1024MB via ssl-enabled tcp socket: real 19.043s	user 16.520s	sys 10.512s
I20260925 19:33:50.566644   390 rpc-test.cc:1859] Sending 1024MB via ssl-enabled tcp socket: real 18.991s	user 16.464s	sys 10.517s
I20260925 19:34:09.491779   390 rpc-test.cc:1859] Sending 1024MB via ssl-enabled tcp socket: real 18.925s	user 16.307s	sys 10.510s
I20260925 19:34:28.394505   390 rpc-test.cc:1859] Sending 1024MB via ssl-enabled tcp socket: real 18.902s	user 16.264s	sys 10.588s
[       OK ] Parameters/TestRpc.TestPerformanceBySocketType/SSL_TCP (95179 ms)
[----------] 20 tests from Parameters/TestRpc (237229 ms total)

[----------] 1 test from Parameters/TestRpcSocketTxRxQueue
[ RUN      ] Parameters/TestRpcSocketTxRxQueue.OverCapacity/0
W20260925 19:34:28.844736   864 negotiation.cc:337] Failed RPC negotiation. Trace:
0925 19:34:28.421338 (+     0us) reactor.cc:625] Submitting negotiation task for client connection to 0.0.0.0:36751 (local address 127.0.0.1:35752)
0925 19:34:28.422017 (+   679us) negotiation.cc:107] Waiting for socket to connect
0925 19:34:28.422089 (+    72us) client_negotiation.cc:174] Beginning negotiation
0925 19:34:28.422576 (+   487us) client_negotiation.cc:252] Sending NEGOTIATE NegotiatePB request
0925 19:34:28.843545 (+420969us) negotiation.cc:327] Negotiation complete: Network error: Client connection negotiation failed: client connection to 0.0.0.0:36751: BlockingRecv error: recv error from unknown peer: Transport endpoint is not connected (error 107)
Metrics: {"client-negotiator.queue_time_us":117}
W20260925 19:34:28.844806   882 negotiation.cc:337] Failed RPC negotiation. Trace:
0925 19:34:28.435113 (+     0us) reactor.cc:625] Submitting negotiation task for client connection to 0.0.0.0:36751 (local address 127.0.0.1:35764)
0925 19:34:28.435678 (+   565us) negotiation.cc:107] Waiting for socket to connect
0925 19:34:28.435713 (+    35us) client_negotiation.cc:174] Beginning negotiation
0925 19:34:28.435887 (+   174us) client_negotiation.cc:252] Sending NEGOTIATE NegotiatePB request
0925 19:34:28.843668 (+407781us) negotiation.cc:327] Negotiation complete: Network error: Client connection negotiation failed: client connection to 0.0.0.0:36751: BlockingRecv error: recv error from unknown peer: Transport endpoint is not connected (error 107)
Metrics: {"client-negotiator.queue_time_us":167}
W20260925 19:34:28.845080   900 negotiation.cc:337] Failed RPC negotiation. Trace:
0925 19:34:28.459825 (+     0us) reactor.cc:625] Submitting negotiation task for client connection to 0.0.0.0:36751 (local address 127.0.0.1:35778)
0925 19:34:28.460392 (+   567us) negotiation.cc:107] Waiting for socket to connect
0925 19:34:28.460422 (+    30us) client_negotiation.cc:174] Beginning negotiation
0925 19:34:28.460624 (+   202us) client_negotiation.cc:252] Sending NEGOTIATE NegotiatePB request
0925 19:34:28.844008 (+383384us) negotiation.cc:327] Negotiation complete: Network error: Client connection negotiation failed: client connection to 0.0.0.0:36751: BlockingRecv error: recv error from unknown peer: Transport endpoint is not connected (error 107)
Metrics: {"client-negotiator.queue_time_us":162}
W20260925 19:34:28.845216   873 negotiation.cc:337] Failed RPC negotiation. Trace:
0925 19:34:28.428067 (+     0us) reactor.cc:625] Submitting negotiation task for client connection to 0.0.0.0:36751 (local address 127.0.0.1:35760)
0925 19:34:28.428666 (+   599us) negotiation.cc:107] Waiting for socket to connect
0925 19:34:28.428695 (+    29us) client_negotiation.cc:174] Beginning negotiation
0925 19:34:28.428865 (+   170us) client_negotiation.cc:252] Sending NEGOTIATE NegotiatePB request
0925 19:34:28.843618 (+414753us) negotiation.cc:327] Negotiation complete: Network error: Client connection negotiation failed: client connection to 0.0.0.0:36751: BlockingRecv error: recv error from unknown peer: Transport endpoint is not connected (error 107)
Metrics: {"client-negotiator.queue_time_us":184}
W20260925 19:34:28.846176   891 negotiation.cc:337] Failed RPC negotiation. Trace:
0925 19:34:28.446978 (+     0us) reactor.cc:625] Submitting negotiation task for client connection to 0.0.0.0:36751 (local address 127.0.0.1:35766)
0925 19:34:28.447491 (+   513us) negotiation.cc:107] Waiting for socket to connect
0925 19:34:28.447520 (+    29us) client_negotiation.cc:174] Beginning negotiation
0925 19:34:28.447695 (+   175us) client_negotiation.cc:252] Sending NEGOTIATE NegotiatePB request
0925 19:34:28.843545 (+395850us) negotiation.cc:327] Negotiation complete: Network error: Client connection negotiation failed: client connection to 0.0.0.0:36751: BlockingRecv error: recv error from unknown peer: Transport endpoint is not connected (error 107)
Metrics: {"client-negotiator.queue_time_us":125}
W20260925 19:34:28.847150   909 negotiation.cc:337] Failed RPC negotiation. Trace:
0925 19:34:28.471655 (+     0us) reactor.cc:625] Submitting negotiation task for client connection to 0.0.0.0:36751 (local address 127.0.0.1:35784)
0925 19:34:28.472297 (+   642us) negotiation.cc:107] Waiting for socket to connect
0925 19:34:28.472327 (+    30us) client_negotiation.cc:174] Beginning negotiation
0925 19:34:28.472535 (+   208us) client_negotiation.cc:252] Sending NEGOTIATE NegotiatePB request
0925 19:34:28.846211 (+373676us) negotiation.cc:327] Negotiation complete: Network error: Client connection negotiation failed: client connection to 0.0.0.0:36751: BlockingRecv error: recv error from unknown peer: Transport endpoint is not connected (error 107)
Metrics: {"client-negotiator.queue_time_us":172}
[       OK ] Parameters/TestRpcSocketTxRxQueue.OverCapacity/0 (1243 ms)
[----------] 1 test from Parameters/TestRpcSocketTxRxQueue (1243 ms total)

[----------] Global test environment tear-down
[==========] 21 tests from 2 test suites ran. (238473 ms total)
[  PASSED  ] 20 tests.
[  FAILED  ] 1 test, listed below:
[  FAILED  ] Parameters/TestRpc.TestCallWithChainCertAndChainCA/SSL_TCP, where GetParam() = (true, false)

 1 FAILED TEST