Diagnosed failure
Parameters/TestRpc.TestCallWithChainCertAndChainCA/SSL_UnixSocket: /data0/somelongdirectorytoavoidrpathissues/src/kudu/src/kudu/rpc/rpc-test.cc:270: Failure
Failed
Bad status: Runtime error: could not verify certificate chain (error with cert: subject=CN = localhost, ST = sadfjas, C = AS, emailAddress = sdflkdsajf, O = lskdfjlsad, OU = sldfkja, issuer=C = AS, ST = ASDfkjdhf, L = lskdjf, O = saldfja, OU = skdjf, CN = localhost, emailAddress = sadjflkadsj): : certificate has expired
Google Test trace:
/data0/somelongdirectorytoavoidrpathissues/src/kudu/src/kudu/rpc/rpc-test.cc:267: Connecting to unix:/tmp/dist-test-taskqDDS7D/test-tmp/rpc-test-0c10d746ae724c0dbb7b1ccacbc08491.sock
I20260927 07:00:01.984163 3164 test_util.cc:175] -----------------------------------------------
I20260927 07:00:01.984230 3164 test_util.cc:176] Had fatal failures, leaving test files at /tmp/dist-test-taskqDDS7D/test-tmp/rpc-test.6.Parameters_TestRpc.TestCallWithChainCertAndChainCA_SSL_UnixSocket.1790492401920064-3164-0
Full log
Note: This is test shard 7 of 8.
[==========] Running 21 tests from 2 test suites.
[----------] Global test environment set-up.
[----------] 20 tests from Parameters/TestRpc
[ RUN ] Parameters/TestRpc.TestMessengerCreateDestroy/SSL_UnixSocket
WARNING: Logging before InitGoogleLogging() is written to STDERR
I20260927 07:00:01.937548 3164 rpc-test.cc:169] started messenger TestCreateDestroy
[ OK ] Parameters/TestRpc.TestMessengerCreateDestroy/SSL_UnixSocket (16 ms)
[ RUN ] Parameters/TestRpc.TestNegotiationDeadlock/SSL_UnixSocket
I20260927 07:00:01.950078 3184 acceptor_pool.cc:254] collecting diagnostics on the listening RPC socket unix:/tmp/dist-test-taskqDDS7D/test-tmp/rpc-test-2da37b5b8f824d05a38be3a8e01e61f6.sock every 8 connection(s)
I20260927 07:00:01.950546 3185 acceptor_pool.cc:254] collecting diagnostics on the listening RPC socket unix:/tmp/dist-test-taskqDDS7D/test-tmp/rpc-test-2da37b5b8f824d05a38be3a8e01e61f6.sock every 8 connection(s)
[ OK ] Parameters/TestRpc.TestNegotiationDeadlock/SSL_UnixSocket (20 ms)
[ RUN ] Parameters/TestRpc.TestCallWithChainCertAndChainCA/SSL_UnixSocket
I20260927 07:00:01.978773 3201 acceptor_pool.cc:254] collecting diagnostics on the listening RPC socket unix:/tmp/dist-test-taskqDDS7D/test-tmp/rpc-test-0c10d746ae724c0dbb7b1ccacbc08491.sock every 8 connection(s)
I20260927 07:00:01.978794 3200 acceptor_pool.cc:254] collecting diagnostics on the listening RPC socket unix:/tmp/dist-test-taskqDDS7D/test-tmp/rpc-test-0c10d746ae724c0dbb7b1ccacbc08491.sock every 8 connection(s)
/data0/somelongdirectorytoavoidrpathissues/src/kudu/src/kudu/rpc/rpc-test.cc:270: Failure
Failed
Bad status: Runtime error: could not verify certificate chain (error with cert: subject=CN = localhost, ST = sadfjas, C = AS, emailAddress = sdflkdsajf, O = lskdfjlsad, OU = sldfkja, issuer=C = AS, ST = ASDfkjdhf, L = lskdjf, O = saldfja, OU = skdjf, CN = localhost, emailAddress = sadjflkadsj): : certificate has expired
Google Test trace:
/data0/somelongdirectorytoavoidrpathissues/src/kudu/src/kudu/rpc/rpc-test.cc:267: Connecting to unix:/tmp/dist-test-taskqDDS7D/test-tmp/rpc-test-0c10d746ae724c0dbb7b1ccacbc08491.sock
I20260927 07:00:01.984163 3164 test_util.cc:175] -----------------------------------------------
I20260927 07:00:01.984230 3164 test_util.cc:176] Had fatal failures, leaving test files at /tmp/dist-test-taskqDDS7D/test-tmp/rpc-test.6.Parameters_TestRpc.TestCallWithChainCertAndChainCA_SSL_UnixSocket.1790492401920064-3164-0
[ FAILED ] Parameters/TestRpc.TestCallWithChainCertAndChainCA/SSL_UnixSocket, where GetParam() = (true, true) (24 ms)
[ RUN ] Parameters/TestRpc.TestCallWithPasswordProtectedKey/SSL_UnixSocket
I20260927 07:00:02.008502 3225 acceptor_pool.cc:254] collecting diagnostics on the listening RPC socket unix:/tmp/dist-test-taskqDDS7D/test-tmp/rpc-test-362f3780e2fa48fcb98b355596a5d4fc.sock every 8 connection(s)
I20260927 07:00:02.008543 3226 acceptor_pool.cc:254] collecting diagnostics on the listening RPC socket unix:/tmp/dist-test-taskqDDS7D/test-tmp/rpc-test-362f3780e2fa48fcb98b355596a5d4fc.sock every 8 connection(s)
[ OK ] Parameters/TestRpc.TestCallWithPasswordProtectedKey/SSL_UnixSocket (40 ms)
[ RUN ] Parameters/TestRpc.TestCallToBadServer/SSL_UnixSocket
I20260927 07:00:02.041302 3164 rpc-test.cc:394] Status: Network error: Client connection negotiation failed: client connection to 0.0.0.0:0: connect: Connection refused (error 111)
I20260927 07:00:02.041956 3164 rpc-test.cc:394] Status: Network error: Client connection negotiation failed: client connection to 0.0.0.0:0: connect: Connection refused (error 111)
I20260927 07:00:02.042470 3164 rpc-test.cc:394] Status: Network error: Client connection negotiation failed: client connection to 0.0.0.0:0: connect: Connection refused (error 111)
I20260927 07:00:02.042855 3164 rpc-test.cc:394] Status: Network error: Client connection negotiation failed: client connection to 0.0.0.0:0: connect: Connection refused (error 111)
I20260927 07:00:02.043470 3164 rpc-test.cc:394] Status: Network error: Client connection negotiation failed: client connection to 0.0.0.0:0: connect: Connection refused (error 111)
[ OK ] Parameters/TestRpc.TestCallToBadServer/SSL_UnixSocket (19 ms)
[ RUN ] Parameters/TestRpc.TestWrongService/SSL_UnixSocket
I20260927 07:00:02.062970 3260 acceptor_pool.cc:254] collecting diagnostics on the listening RPC socket unix:/tmp/dist-test-taskqDDS7D/test-tmp/rpc-test-ad38413e6dd1402bb79a76143e34b572.sock every 8 connection(s)
I20260927 07:00:02.062997 3261 acceptor_pool.cc:254] collecting diagnostics on the listening RPC socket unix:/tmp/dist-test-taskqDDS7D/test-tmp/rpc-test-ad38413e6dd1402bb79a76143e34b572.sock every 8 connection(s)
I20260927 07:00:02.079787 3257 messenger.cc:345] service WrongServiceName not registered on TestServer
[ OK ] Parameters/TestRpc.TestWrongService/SSL_UnixSocket (38 ms)
[ RUN ] Parameters/TestRpc.TestConnectionKeepalive/SSL_UnixSocket
I20260927 07:00:02.098389 3283 acceptor_pool.cc:254] collecting diagnostics on the listening RPC socket unix:/tmp/dist-test-taskqDDS7D/test-tmp/rpc-test-e5fe5e0202e14d228859ac7dec4d9aa5.sock every 8 connection(s)
I20260927 07:00:02.098412 3284 acceptor_pool.cc:254] collecting diagnostics on the listening RPC socket unix:/tmp/dist-test-taskqDDS7D/test-tmp/rpc-test-e5fe5e0202e14d228859ac7dec4d9aa5.sock every 8 connection(s)
I20260927 07:00:02.098604 3164 rpc-test.cc:488] Connecting to unix:/tmp/dist-test-taskqDDS7D/test-tmp/rpc-test-e5fe5e0202e14d228859ac7dec4d9aa5.sock
W20260927 07:00:02.584240 3296 connection.cc:196] Error closing socket: Network error: TlsSocket::Close: Broken pipe
[ OK ] Parameters/TestRpc.TestConnectionKeepalive/SSL_UnixSocket (1048 ms)
[ RUN ] Parameters/TestRpc.TestClientConnectionMetrics/SSL_UnixSocket
I20260927 07:00:03.153265 3308 acceptor_pool.cc:254] collecting diagnostics on the listening RPC socket unix:/tmp/dist-test-taskqDDS7D/test-tmp/rpc-test-8df63e2cb80544c2a3e36c8d1b5a601a.sock every 8 connection(s)
I20260927 07:00:03.153275 3309 acceptor_pool.cc:254] collecting diagnostics on the listening RPC socket unix:/tmp/dist-test-taskqDDS7D/test-tmp/rpc-test-8df63e2cb80544c2a3e36c8d1b5a601a.sock every 8 connection(s)
I20260927 07:00:03.153451 3164 rpc-test.cc:569] Connecting to unix:/tmp/dist-test-taskqDDS7D/test-tmp/rpc-test-8df63e2cb80544c2a3e36c8d1b5a601a.sock
W20260927 07:00:12.262251 3305 connection.cc:196] Error closing socket: Network error: TlsSocket::Close: Broken pipe
[ OK ] Parameters/TestRpc.TestClientConnectionMetrics/SSL_UnixSocket (9132 ms)
[ RUN ] Parameters/TestRpc.TestCredentialsPolicy/SSL_UnixSocket
I20260927 07:00:12.285449 3331 acceptor_pool.cc:254] collecting diagnostics on the listening RPC socket unix:/tmp/dist-test-taskqDDS7D/test-tmp/rpc-test-38b1eb37db7542ad8b042069c4258878.sock every 8 connection(s)
I20260927 07:00:12.285552 3332 acceptor_pool.cc:254] collecting diagnostics on the listening RPC socket unix:/tmp/dist-test-taskqDDS7D/test-tmp/rpc-test-38b1eb37db7542ad8b042069c4258878.sock every 8 connection(s)
I20260927 07:00:12.285739 3164 rpc-test.cc:700] Connecting to unix:/tmp/dist-test-taskqDDS7D/test-tmp/rpc-test-38b1eb37db7542ad8b042069c4258878.sock
W20260927 07:00:12.308190 3330 connection.cc:196] Error closing socket: Network error: TlsSocket::Close: Broken pipe
[ OK ] Parameters/TestRpc.TestCredentialsPolicy/SSL_UnixSocket (50 ms)
[ RUN ] Parameters/TestRpc.TestCallLongerThanKeepalive/SSL_UnixSocket
I20260927 07:00:12.325672 3356 acceptor_pool.cc:254] collecting diagnostics on the listening RPC socket unix:/tmp/dist-test-taskqDDS7D/test-tmp/rpc-test-0c508591b44a48fca8c7b1fe09e475d6.sock every 8 connection(s)
I20260927 07:00:12.325718 3357 acceptor_pool.cc:254] collecting diagnostics on the listening RPC socket unix:/tmp/dist-test-taskqDDS7D/test-tmp/rpc-test-0c508591b44a48fca8c7b1fe09e475d6.sock every 8 connection(s)
I20260927 07:00:12.337957 3358 rpc-test-base.h:222] got call: sleep_micros: 3000000 deferred: true
I20260927 07:00:15.338763 3358 rpcz_store.cc:275] Call kudu.rpc.GenericCalculatorService.Sleep from unix:<unnamed> (request call id 0) took 3000 ms. Trace:
I20260927 07:00:15.338925 3358 rpcz_store.cc:276] 0927 07:00:12.337783 (+ 0us) service_pool.cc:170] Inserting onto call queue
0927 07:00:12.337929 (+ 146us) service_pool.cc:227] Handling call
0927 07:00:15.338745 (+3000816us) inbound_call.cc:173] Queueing success response
Metrics: {}
[ OK ] Parameters/TestRpc.TestCallLongerThanKeepalive/SSL_UnixSocket (3027 ms)
[ RUN ] Parameters/TestRpc.TestRpcSidecar/SSL_UnixSocket
I20260927 07:00:15.360415 3381 acceptor_pool.cc:254] collecting diagnostics on the listening RPC socket unix:/tmp/dist-test-taskqDDS7D/test-tmp/rpc-test-31df7a46ab00442e957887f55817a167.sock every 8 connection(s)
I20260927 07:00:15.360569 3382 acceptor_pool.cc:254] collecting diagnostics on the listening RPC socket unix:/tmp/dist-test-taskqDDS7D/test-tmp/rpc-test-31df7a46ab00442e957887f55817a167.sock every 8 connection(s)
W20260927 07:00:15.400157 3378 connection.cc:196] Error closing socket: Network error: TlsSocket::Close: Broken pipe
[ OK ] Parameters/TestRpc.TestRpcSidecar/SSL_UnixSocket (60 ms)
[ RUN ] Parameters/TestRpc.TestRpcSidecarLimits/SSL_UnixSocket
I20260927 07:00:17.271240 3406 acceptor_pool.cc:254] collecting diagnostics on the listening RPC socket unix:/tmp/dist-test-taskqDDS7D/test-tmp/rpc-test-4de3177ac54d40c3b978ba00ade2778e.sock every 8 connection(s)
I20260927 07:00:17.271268 3407 acceptor_pool.cc:254] collecting diagnostics on the listening RPC socket unix:/tmp/dist-test-taskqDDS7D/test-tmp/rpc-test-4de3177ac54d40c3b978ba00ade2778e.sock every 8 connection(s)
W20260927 07:00:17.297475 3164 serialization.cc:72] Serialized kudu.rpc_test.PushStringsRequestPB (2147483654 bytes) is larger than the maximum configured RPC message size (52428800 bytes). Sending anyway, but peer may reject the data.
W20260927 07:00:17.301225 3403 connection.cc:535] server connection from unix:<unnamed> recv error: Network error: RPC frame had a length of 2147483714, but we only support messages up to 52428800 bytes long.
W20260927 07:00:17.301288 3403 connection.cc:158] shutting down server connection from unix:<unnamed> with pending inbound data: 4/2147483714 bytes received; last active 0 ns ago: status Network error: RPC frame had a length of 2147483714, but we only support messages up to 52428800 bytes long.
W20260927 07:00:17.301411 3419 connection.cc:698] client connection to unix:/tmp/dist-test-taskqDDS7D/test-tmp/rpc-test-4de3177ac54d40c3b978ba00ade2778e.sock send error: Network error: failed to write to TLS socket: Broken pipe
W20260927 07:00:17.301604 3419 connection.cc:196] Error closing socket: Network error: TlsSocket::Close: Success
I20260927 07:00:17.311707 3431 acceptor_pool.cc:254] collecting diagnostics on the listening RPC socket unix:/tmp/dist-test-taskqDDS7D/test-tmp/rpc-test-4de3177ac54d40c3b978ba00ade2778e.sock every 8 connection(s)
I20260927 07:00:17.311765 3432 acceptor_pool.cc:254] collecting diagnostics on the listening RPC socket unix:/tmp/dist-test-taskqDDS7D/test-tmp/rpc-test-4de3177ac54d40c3b978ba00ade2778e.sock every 8 connection(s)
W20260927 07:00:22.027808 3428 connection.cc:577] server connection from unix:<unnamed>: received bad data: 'Corruption: Invalid packet: message had a length of 2147483710, but we only support messages up to 2147483647 bytes
'
W20260927 07:00:22.028267 3444 connection.cc:196] Error closing socket: Network error: TlsSocket::Close: Broken pipe
[ OK ] Parameters/TestRpc.TestRpcSidecarLimits/SSL_UnixSocket (6628 ms)
[ RUN ] Parameters/TestRpc.TestCallTimeoutDoesntAffectNegotiation/SSL_UnixSocket
I20260927 07:00:22.051229 3456 acceptor_pool.cc:254] collecting diagnostics on the listening RPC socket unix:/tmp/dist-test-taskqDDS7D/test-tmp/rpc-test-4b5bc61764c84c84b98ed8b149c80ca9.sock every 8 connection(s)
I20260927 07:00:22.051259 3457 acceptor_pool.cc:254] collecting diagnostics on the listening RPC socket unix:/tmp/dist-test-taskqDDS7D/test-tmp/rpc-test-4b5bc61764c84c84b98ed8b149c80ca9.sock every 8 connection(s)
W20260927 07:00:22.058959 3452 negotiation.cc:266] Injecting 500ms delay in negotiation
I20260927 07:00:22.109236 3164 rpc-test-base.h:595] status: Timed out: connection negotiation to unix:/tmp/dist-test-taskqDDS7D/test-tmp/rpc-test-4b5bc61764c84c84b98ed8b149c80ca9.sock for RPC Sleep timed out after 0.050s (ON_OUTBOUND_QUEUE), seconds elapsed: 0.0506699
[ OK ] Parameters/TestRpc.TestCallTimeoutDoesntAffectNegotiation/SSL_UnixSocket (533 ms)
[ RUN ] Parameters/TestRpc.TestRpcHandlerLatencyMetric/SSL_UnixSocket
I20260927 07:00:22.595558 3482 acceptor_pool.cc:254] collecting diagnostics on the listening RPC socket unix:/tmp/dist-test-taskqDDS7D/test-tmp/rpc-test-35167c340ab3429ca5588f1562f1553a.sock every 8 connection(s)
I20260927 07:00:22.595587 3481 acceptor_pool.cc:254] collecting diagnostics on the listening RPC socket unix:/tmp/dist-test-taskqDDS7D/test-tmp/rpc-test-35167c340ab3429ca5588f1562f1553a.sock every 8 connection(s)
I20260927 07:00:22.630367 3164 rpc-test.cc:1236] Sleep() min lat: 20309
I20260927 07:00:22.630453 3164 rpc-test.cc:1237] Sleep() mean lat: 20309
I20260927 07:00:22.630486 3164 rpc-test.cc:1238] Sleep() max lat: 20309
I20260927 07:00:22.630499 3164 rpc-test.cc:1239] Sleep() #calls: 1
W20260927 07:00:22.631083 3478 connection.cc:196] Error closing socket: Network error: TlsSocket::Close: Broken pipe
[ OK ] Parameters/TestRpc.TestRpcHandlerLatencyMetric/SSL_UnixSocket (67 ms)
[ RUN ] Parameters/TestRpc.TimedOutOnResponseMetricServiceQueue/SSL_UnixSocket
I20260927 07:00:22.644778 3507 acceptor_pool.cc:254] collecting diagnostics on the listening RPC socket unix:/tmp/dist-test-taskqDDS7D/test-tmp/rpc-test-2f40fc9d6f9c4f159bb6fd12ea97a9eb.sock every 8 connection(s)
I20260927 07:00:22.644801 3508 acceptor_pool.cc:254] collecting diagnostics on the listening RPC socket unix:/tmp/dist-test-taskqDDS7D/test-tmp/rpc-test-2f40fc9d6f9c4f159bb6fd12ea97a9eb.sock every 8 connection(s)
W20260927 07:00:22.705576 3509 rpcz_store.cc:267] Call kudu.rpc_test.CalculatorService.Sleep from unix:<unnamed> (request call id 2) took 20 ms (client timeout 20 ms). Trace:
W20260927 07:00:22.705708 3509 rpcz_store.cc:269] 0927 07:00:22.685247 (+ 0us) service_pool.cc:170] Inserting onto call queue
0927 07:00:22.705545 (+ 20298us) service_pool.cc:214] Skipping call since client already timed out
0927 07:00:22.705559 (+ 14us) inbound_call.cc:173] Queueing failure response
Metrics: {}
[ OK ] Parameters/TestRpc.TimedOutOnResponseMetricServiceQueue/SSL_UnixSocket (75 ms)
[ RUN ] Parameters/TestRpc.RpcPendingConnectionsMetric/SSL_UnixSocket
I20260927 07:00:22.709734 3530 acceptor_pool.cc:254] collecting diagnostics on the listening RPC socket 0.0.0.0:37757 every 8 connection(s)
I20260927 07:00:22.709792 3531 acceptor_pool.cc:254] collecting diagnostics on the listening RPC socket 0.0.0.0:37757 every 8 connection(s)
W20260927 07:00:22.710454 3526 negotiation.cc:337] Failed RPC negotiation. Trace:
0927 07:00:22.710275 (+ 0us) reactor.cc:625] Submitting negotiation task for server connection from 127.0.0.1:39568 (local address 127.0.0.1:37757)
0927 07:00:22.710317 (+ 42us) server_negotiation.cc:206] Beginning negotiation
0927 07:00:22.710319 (+ 2us) server_negotiation.cc:399] Waiting for connection header
0927 07:00:22.710400 (+ 81us) negotiation.cc:327] Negotiation complete: Network error: Server connection negotiation failed: server connection from 127.0.0.1:39568: BlockingRecv error: recv got EOF from 127.0.0.1:39568 (error 108)
Metrics: {"server-negotiator.queue_time_us":14}
[ OK ] Parameters/TestRpc.RpcPendingConnectionsMetric/SSL_UnixSocket (13 ms)
[ RUN ] Parameters/TestRpc.TestRpcContextClientDeadline/SSL_UnixSocket
I20260927 07:00:22.767918 3546 acceptor_pool.cc:254] collecting diagnostics on the listening RPC socket unix:/tmp/dist-test-taskqDDS7D/test-tmp/rpc-test-439901f386fa4687930b6f97881d6b93.sock every 8 connection(s)
I20260927 07:00:22.767937 3547 acceptor_pool.cc:254] collecting diagnostics on the listening RPC socket unix:/tmp/dist-test-taskqDDS7D/test-tmp/rpc-test-439901f386fa4687930b6f97881d6b93.sock every 8 connection(s)
W20260927 07:00:22.799121 3543 connection.cc:196] Error closing socket: Network error: TlsSocket::Close: Broken pipe
[ OK ] Parameters/TestRpc.TestRpcContextClientDeadline/SSL_UnixSocket (78 ms)
[ RUN ] Parameters/TestRpc.TestApplicationFeatureFlagUnsupportedServer/SSL_UnixSocket
I20260927 07:00:22.811950 3571 acceptor_pool.cc:254] collecting diagnostics on the listening RPC socket unix:/tmp/dist-test-taskqDDS7D/test-tmp/rpc-test-269990c5945246cdb0d35a8c8765d397.sock every 8 connection(s)
I20260927 07:00:22.811971 3572 acceptor_pool.cc:254] collecting diagnostics on the listening RPC socket unix:/tmp/dist-test-taskqDDS7D/test-tmp/rpc-test-269990c5945246cdb0d35a8c8765d397.sock every 8 connection(s)
[ OK ] Parameters/TestRpc.TestApplicationFeatureFlagUnsupportedServer/SSL_UnixSocket (33 ms)
[ RUN ] Parameters/TestRpc.TestCancellationAsync/SSL_UnixSocket
I20260927 07:00:22.843456 3596 acceptor_pool.cc:254] collecting diagnostics on the listening RPC socket unix:/tmp/dist-test-taskqDDS7D/test-tmp/rpc-test-50f03484d5ec467690db4dcb0a35d22b.sock every 8 connection(s)
I20260927 07:00:22.843487 3597 acceptor_pool.cc:254] collecting diagnostics on the listening RPC socket unix:/tmp/dist-test-taskqDDS7D/test-tmp/rpc-test-50f03484d5ec467690db4dcb0a35d22b.sock every 8 connection(s)
I20260927 07:00:22.843737 3164 rpc-test.cc:1716] Connecting to unix:/tmp/dist-test-taskqDDS7D/test-tmp/rpc-test-50f03484d5ec467690db4dcb0a35d22b.sock
I20260927 07:00:22.852571 3164 test_util.cc:268] Using random seed: -2133438504
I20260927 07:00:22.869241 3600 rpc-test-base.h:240] got call: sleep_micros: 500 pattern: 4294967295 num_repetitions: 2097152 sidecar_idx: 0
I20260927 07:00:22.882562 3600 rpc-test-base.h:240] got call: sleep_micros: 500 pattern: 4294967295 num_repetitions: 2097152 sidecar_idx: 0
I20260927 07:00:22.895516 3600 rpc-test-base.h:240] got call: sleep_micros: 500 pattern: 4294967295 num_repetitions: 2097152 sidecar_idx: 0
I20260927 07:00:22.906589 3600 rpc-test-base.h:240] got call: sleep_micros: 500 pattern: 4294967295 num_repetitions: 2097152 sidecar_idx: 0
I20260927 07:00:22.919796 3600 rpc-test-base.h:240] got call: sleep_micros: 500 pattern: 4294967295 num_repetitions: 2097152 sidecar_idx: 0
I20260927 07:00:22.931710 3600 rpc-test-base.h:240] got call: sleep_micros: 500 pattern: 4294967295 num_repetitions: 2097152 sidecar_idx: 0
I20260927 07:00:22.943827 3600 rpc-test-base.h:240] got call: sleep_micros: 500 pattern: 4294967295 num_repetitions: 2097152 sidecar_idx: 0
I20260927 07:00:22.955281 3600 rpc-test-base.h:240] got call: sleep_micros: 500 pattern: 4294967295 num_repetitions: 2097152 sidecar_idx: 0
W20260927 07:00:22.957396 3593 connection.cc:196] Error closing socket: Network error: TlsSocket::Close: Broken pipe
W20260927 07:00:22.958714 3593 connection.cc:441] server connection from unix:<unnamed> torn down before Call kudu.rpc.GenericCalculatorService.SleepWithSidecar from unix:<unnamed> (request call id 9) could send its response
[ OK ] Parameters/TestRpc.TestCancellationAsync/SSL_UnixSocket (126 ms)
[ RUN ] Parameters/TestRpc.TestPerformanceBySocketType/SSL_UnixSocket
I20260927 07:00:22.981141 3621 acceptor_pool.cc:254] collecting diagnostics on the listening RPC socket unix:/tmp/dist-test-taskqDDS7D/test-tmp/rpc-test-4fa49a5808f6490b8c967bc26728ec2f.sock every 8 connection(s)
I20260927 07:00:22.981240 3622 acceptor_pool.cc:254] collecting diagnostics on the listening RPC socket unix:/tmp/dist-test-taskqDDS7D/test-tmp/rpc-test-4fa49a5808f6490b8c967bc26728ec2f.sock every 8 connection(s)
I20260927 07:00:22.981371 3164 rpc-test.cc:1846] Connecting to unix:/tmp/dist-test-taskqDDS7D/test-tmp/rpc-test-4fa49a5808f6490b8c967bc26728ec2f.sock
I20260927 07:00:24.603829 3164 rpc-test.cc:1859] Sending 1024MB via ssl-enabled unix socket: real 1.613s user 1.894s sys 0.899s
I20260927 07:00:26.130748 3164 rpc-test.cc:1859] Sending 1024MB via ssl-enabled unix socket: real 1.527s user 1.692s sys 0.962s
I20260927 07:00:27.658919 3164 rpc-test.cc:1859] Sending 1024MB via ssl-enabled unix socket: real 1.528s user 1.615s sys 1.043s
I20260927 07:00:29.231892 3164 rpc-test.cc:1859] Sending 1024MB via ssl-enabled unix socket: real 1.573s user 1.829s sys 0.921s
I20260927 07:00:30.801234 3164 rpc-test.cc:1859] Sending 1024MB via ssl-enabled unix socket: real 1.569s user 1.820s sys 0.928s
[ OK ] Parameters/TestRpc.TestPerformanceBySocketType/SSL_UnixSocket (7842 ms)
[----------] 20 tests from Parameters/TestRpc (28880 ms total)
[----------] 1 test from Parameters/TestRpcSocketTxRxQueue
[ RUN ] Parameters/TestRpcSocketTxRxQueue.AcceptorRxQueueSizeMetric/0
I20260927 07:00:30.805202 3646 acceptor_pool.cc:254] collecting diagnostics on the listening RPC socket 0.0.0.0:43315 every 1 connection(s)
I20260927 07:00:30.805328 3647 acceptor_pool.cc:254] collecting diagnostics on the listening RPC socket 0.0.0.0:43315 every 1 connection(s)
W20260927 07:00:30.805997 3642 negotiation.cc:337] Failed RPC negotiation. Trace:
0927 07:00:30.805731 (+ 0us) reactor.cc:625] Submitting negotiation task for server connection from 127.0.0.1:35528 (local address 127.0.0.1:43315)
0927 07:00:30.805813 (+ 82us) server_negotiation.cc:206] Beginning negotiation
0927 07:00:30.805815 (+ 2us) server_negotiation.cc:399] Waiting for connection header
0927 07:00:30.805956 (+ 141us) negotiation.cc:327] Negotiation complete: Network error: Server connection negotiation failed: server connection from 127.0.0.1:35528: BlockingRecv error: recv got EOF from 127.0.0.1:35528 (error 108)
Metrics: {"server-negotiator.queue_time_us":48}
[ OK ] Parameters/TestRpcSocketTxRxQueue.AcceptorRxQueueSizeMetric/0 (4 ms)
[----------] 1 test from Parameters/TestRpcSocketTxRxQueue (4 ms total)
[----------] Global test environment tear-down
[==========] 21 tests from 2 test suites ran. (28885 ms total)
[ PASSED ] 20 tests.
[ FAILED ] 1 test, listed below:
[ FAILED ] Parameters/TestRpc.TestCallWithChainCertAndChainCA/SSL_UnixSocket, where GetParam() = (true, true)
1 FAILED TEST