Diagnosed failure

Parameters/TestRpc.TestCallWithChainCertAndChainCA/SSL_UnixSocket: /data0/somelongdirectorytoavoidrpathissues/src/kudu/src/kudu/rpc/rpc-test.cc:270: Failure
Failed
Bad status: Runtime error: could not verify certificate chain (error with cert: subject=CN = localhost, ST = sadfjas, C = AS, emailAddress = sdflkdsajf, O = lskdfjlsad, OU = sldfkja, issuer=C = AS, ST = ASDfkjdhf, L = lskdjf, O = saldfja, OU = skdjf, CN = localhost, emailAddress = sadjflkadsj): : certificate has expired
Google Test trace:
/data0/somelongdirectorytoavoidrpathissues/src/kudu/src/kudu/rpc/rpc-test.cc:267: Connecting to unix:/tmp/dist-test-taskENgJxX/test-tmp/rpc-test-fe1d4d68986b4cc6a614345caef475a2.sock
I20260928 14:50:50.594398 17588 test_util.cc:175] -----------------------------------------------
I20260928 14:50:50.594486 17588 test_util.cc:176] Had fatal failures, leaving test files at /tmp/dist-test-taskENgJxX/test-tmp/rpc-test.6.Parameters_TestRpc.TestCallWithChainCertAndChainCA_SSL_UnixSocket.1790607050467610-17588-0

Full log

Note: This is test shard 7 of 8.
[==========] Running 21 tests from 2 test suites.
[----------] Global test environment set-up.
[----------] 20 tests from Parameters/TestRpc
[ RUN      ] Parameters/TestRpc.TestMessengerCreateDestroy/SSL_UnixSocket
WARNING: Logging before InitGoogleLogging() is written to STDERR
I20260928 14:50:50.510728 17588 rpc-test.cc:169] started messenger TestCreateDestroy
[       OK ] Parameters/TestRpc.TestMessengerCreateDestroy/SSL_UnixSocket (26 ms)
[ RUN      ] Parameters/TestRpc.TestNegotiationDeadlock/SSL_UnixSocket
I20260928 14:50:50.533780 17608 acceptor_pool.cc:254] collecting diagnostics on the listening RPC socket unix:/tmp/dist-test-taskENgJxX/test-tmp/rpc-test-ebd49fae2a324481acda8af90d0c5a90.sock every 8 connection(s)
I20260928 14:50:50.534471 17609 acceptor_pool.cc:254] collecting diagnostics on the listening RPC socket unix:/tmp/dist-test-taskENgJxX/test-tmp/rpc-test-ebd49fae2a324481acda8af90d0c5a90.sock every 8 connection(s)
[       OK ] Parameters/TestRpc.TestNegotiationDeadlock/SSL_UnixSocket (46 ms)
[ RUN      ] Parameters/TestRpc.TestCallWithChainCertAndChainCA/SSL_UnixSocket
I20260928 14:50:50.581116 17624 acceptor_pool.cc:254] collecting diagnostics on the listening RPC socket unix:/tmp/dist-test-taskENgJxX/test-tmp/rpc-test-fe1d4d68986b4cc6a614345caef475a2.sock every 8 connection(s)
I20260928 14:50:50.581423 17625 acceptor_pool.cc:254] collecting diagnostics on the listening RPC socket unix:/tmp/dist-test-taskENgJxX/test-tmp/rpc-test-fe1d4d68986b4cc6a614345caef475a2.sock every 8 connection(s)
/data0/somelongdirectorytoavoidrpathissues/src/kudu/src/kudu/rpc/rpc-test.cc:270: Failure
Failed
Bad status: Runtime error: could not verify certificate chain (error with cert: subject=CN = localhost, ST = sadfjas, C = AS, emailAddress = sdflkdsajf, O = lskdfjlsad, OU = sldfkja, issuer=C = AS, ST = ASDfkjdhf, L = lskdjf, O = saldfja, OU = skdjf, CN = localhost, emailAddress = sadjflkadsj): : certificate has expired
Google Test trace:
/data0/somelongdirectorytoavoidrpathissues/src/kudu/src/kudu/rpc/rpc-test.cc:267: Connecting to unix:/tmp/dist-test-taskENgJxX/test-tmp/rpc-test-fe1d4d68986b4cc6a614345caef475a2.sock
I20260928 14:50:50.594398 17588 test_util.cc:175] -----------------------------------------------
I20260928 14:50:50.594486 17588 test_util.cc:176] Had fatal failures, leaving test files at /tmp/dist-test-taskENgJxX/test-tmp/rpc-test.6.Parameters_TestRpc.TestCallWithChainCertAndChainCA_SSL_UnixSocket.1790607050467610-17588-0
[  FAILED  ] Parameters/TestRpc.TestCallWithChainCertAndChainCA/SSL_UnixSocket, where GetParam() = (true, true) (33 ms)
[ RUN      ] Parameters/TestRpc.TestCallWithPasswordProtectedKey/SSL_UnixSocket
I20260928 14:50:50.607017 17649 acceptor_pool.cc:254] collecting diagnostics on the listening RPC socket unix:/tmp/dist-test-taskENgJxX/test-tmp/rpc-test-40cc8886a37a4a0081a86d17d0d42142.sock every 8 connection(s)
I20260928 14:50:50.607246 17650 acceptor_pool.cc:254] collecting diagnostics on the listening RPC socket unix:/tmp/dist-test-taskENgJxX/test-tmp/rpc-test-40cc8886a37a4a0081a86d17d0d42142.sock every 8 connection(s)
W20260928 14:50:50.640036 17646 connection.cc:196] Error closing socket: Network error: TlsSocket::Close: Broken pipe
[       OK ] Parameters/TestRpc.TestCallWithPasswordProtectedKey/SSL_UnixSocket (49 ms)
[ RUN      ] Parameters/TestRpc.TestCallToBadServer/SSL_UnixSocket
I20260928 14:50:50.674377 17588 rpc-test.cc:394] Status: Network error: Client connection negotiation failed: client connection to 0.0.0.0:0: connect: Connection refused (error 111)
I20260928 14:50:50.675112 17588 rpc-test.cc:394] Status: Network error: Client connection negotiation failed: client connection to 0.0.0.0:0: connect: Connection refused (error 111)
I20260928 14:50:50.675681 17588 rpc-test.cc:394] Status: Network error: Client connection negotiation failed: client connection to 0.0.0.0:0: connect: Connection refused (error 111)
I20260928 14:50:50.676194 17588 rpc-test.cc:394] Status: Network error: Client connection negotiation failed: client connection to 0.0.0.0:0: connect: Connection refused (error 111)
I20260928 14:50:50.676738 17588 rpc-test.cc:394] Status: Network error: Client connection negotiation failed: client connection to 0.0.0.0:0: connect: Connection refused (error 111)
[       OK ] Parameters/TestRpc.TestCallToBadServer/SSL_UnixSocket (34 ms)
[ RUN      ] Parameters/TestRpc.TestWrongService/SSL_UnixSocket
I20260928 14:50:50.725366 17685 acceptor_pool.cc:254] collecting diagnostics on the listening RPC socket unix:/tmp/dist-test-taskENgJxX/test-tmp/rpc-test-7c61b3a7f32546b6823807c6cd16cad3.sock every 8 connection(s)
I20260928 14:50:50.725637 17686 acceptor_pool.cc:254] collecting diagnostics on the listening RPC socket unix:/tmp/dist-test-taskENgJxX/test-tmp/rpc-test-7c61b3a7f32546b6823807c6cd16cad3.sock every 8 connection(s)
I20260928 14:50:50.755285 17682 messenger.cc:345] service WrongServiceName not registered on TestServer
[       OK ] Parameters/TestRpc.TestWrongService/SSL_UnixSocket (81 ms)
[ RUN      ] Parameters/TestRpc.TestConnectionKeepalive/SSL_UnixSocket
I20260928 14:50:50.789602 17708 acceptor_pool.cc:254] collecting diagnostics on the listening RPC socket unix:/tmp/dist-test-taskENgJxX/test-tmp/rpc-test-01b8d70f5f0d44a6867ad4ee741eec48.sock every 8 connection(s)
I20260928 14:50:50.789834 17709 acceptor_pool.cc:254] collecting diagnostics on the listening RPC socket unix:/tmp/dist-test-taskENgJxX/test-tmp/rpc-test-01b8d70f5f0d44a6867ad4ee741eec48.sock every 8 connection(s)
I20260928 14:50:50.790904 17588 rpc-test.cc:488] Connecting to unix:/tmp/dist-test-taskENgJxX/test-tmp/rpc-test-01b8d70f5f0d44a6867ad4ee741eec48.sock
W20260928 14:50:51.263044 17721 connection.cc:196] Error closing socket: Network error: TlsSocket::Close: Broken pipe
[       OK ] Parameters/TestRpc.TestConnectionKeepalive/SSL_UnixSocket (1076 ms)
[ RUN      ] Parameters/TestRpc.TestClientConnectionMetrics/SSL_UnixSocket
I20260928 14:50:51.852434 17733 acceptor_pool.cc:254] collecting diagnostics on the listening RPC socket unix:/tmp/dist-test-taskENgJxX/test-tmp/rpc-test-5419a95c253d41cbbea7fd465b0d64a1.sock every 8 connection(s)
I20260928 14:50:51.852701 17734 acceptor_pool.cc:254] collecting diagnostics on the listening RPC socket unix:/tmp/dist-test-taskENgJxX/test-tmp/rpc-test-5419a95c253d41cbbea7fd465b0d64a1.sock every 8 connection(s)
I20260928 14:50:51.853638 17588 rpc-test.cc:569] Connecting to unix:/tmp/dist-test-taskENgJxX/test-tmp/rpc-test-5419a95c253d41cbbea7fd465b0d64a1.sock
[       OK ] Parameters/TestRpc.TestClientConnectionMetrics/SSL_UnixSocket (21898 ms)
[ RUN      ] Parameters/TestRpc.TestCredentialsPolicy/SSL_UnixSocket
I20260928 14:51:13.748198 17756 acceptor_pool.cc:254] collecting diagnostics on the listening RPC socket unix:/tmp/dist-test-taskENgJxX/test-tmp/rpc-test-80572fa3b0f0453085fb99c16fac7fed.sock every 8 connection(s)
I20260928 14:51:13.748423 17757 acceptor_pool.cc:254] collecting diagnostics on the listening RPC socket unix:/tmp/dist-test-taskENgJxX/test-tmp/rpc-test-80572fa3b0f0453085fb99c16fac7fed.sock every 8 connection(s)
I20260928 14:51:13.749467 17588 rpc-test.cc:700] Connecting to unix:/tmp/dist-test-taskENgJxX/test-tmp/rpc-test-80572fa3b0f0453085fb99c16fac7fed.sock
W20260928 14:51:13.779497 17755 connection.cc:196] Error closing socket: Network error: TlsSocket::Close: Broken pipe
[       OK ] Parameters/TestRpc.TestCredentialsPolicy/SSL_UnixSocket (54 ms)
[ RUN      ] Parameters/TestRpc.TestCallLongerThanKeepalive/SSL_UnixSocket
I20260928 14:51:13.804538 17781 acceptor_pool.cc:254] collecting diagnostics on the listening RPC socket unix:/tmp/dist-test-taskENgJxX/test-tmp/rpc-test-c650a959611043a2a8e5e086a01e2349.sock every 8 connection(s)
I20260928 14:51:13.804778 17782 acceptor_pool.cc:254] collecting diagnostics on the listening RPC socket unix:/tmp/dist-test-taskENgJxX/test-tmp/rpc-test-c650a959611043a2a8e5e086a01e2349.sock every 8 connection(s)
I20260928 14:51:13.824559 17785 rpc-test-base.h:222] got call: sleep_micros: 3000000 deferred: true
I20260928 14:51:16.826401 17785 rpcz_store.cc:275] Call kudu.rpc.GenericCalculatorService.Sleep from unix:<unnamed> (request call id 0) took 3001 ms. Trace:
I20260928 14:51:16.826565 17785 rpcz_store.cc:276] 0928 14:51:13.824414 (+     0us) service_pool.cc:170] Inserting onto call queue
0928 14:51:13.824500 (+    86us) service_pool.cc:227] Handling call
0928 14:51:16.826336 (+3001836us) inbound_call.cc:173] Queueing success response
Metrics: {}
[       OK ] Parameters/TestRpc.TestCallLongerThanKeepalive/SSL_UnixSocket (3041 ms)
[ RUN      ] Parameters/TestRpc.TestRpcSidecar/SSL_UnixSocket
I20260928 14:51:16.859723 17806 acceptor_pool.cc:254] collecting diagnostics on the listening RPC socket unix:/tmp/dist-test-taskENgJxX/test-tmp/rpc-test-419168d2ce21442084ef78e3c6715f4f.sock every 8 connection(s)
I20260928 14:51:16.859974 17807 acceptor_pool.cc:254] collecting diagnostics on the listening RPC socket unix:/tmp/dist-test-taskENgJxX/test-tmp/rpc-test-419168d2ce21442084ef78e3c6715f4f.sock every 8 connection(s)
[       OK ] Parameters/TestRpc.TestRpcSidecar/SSL_UnixSocket (126 ms)
[ RUN      ] Parameters/TestRpc.TestRpcSidecarLimits/SSL_UnixSocket
I20260928 14:51:20.697955 17831 acceptor_pool.cc:254] collecting diagnostics on the listening RPC socket unix:/tmp/dist-test-taskENgJxX/test-tmp/rpc-test-ff8c56cffebc42d4a70091e5ffb799f8.sock every 8 connection(s)
I20260928 14:51:20.698138 17832 acceptor_pool.cc:254] collecting diagnostics on the listening RPC socket unix:/tmp/dist-test-taskENgJxX/test-tmp/rpc-test-ff8c56cffebc42d4a70091e5ffb799f8.sock every 8 connection(s)
W20260928 14:51:20.757443 17588 serialization.cc:72] Serialized kudu.rpc_test.PushStringsRequestPB (2147483654 bytes) is larger than the maximum configured RPC message size (52428800 bytes). Sending anyway, but peer may reject the data.
W20260928 14:51:20.763734 17828 connection.cc:535] server connection from unix:<unnamed> recv error: Network error: RPC frame had a length of 2147483714, but we only support messages up to 52428800 bytes long.
W20260928 14:51:20.763896 17828 connection.cc:158] shutting down server connection from unix:<unnamed> with pending inbound data: 4/2147483714 bytes received; last active 0 ns ago: status Network error: RPC frame had a length of 2147483714, but we only support messages up to 52428800 bytes long.
W20260928 14:51:20.764405 17844 connection.cc:196] Error closing socket: Network error: TlsSocket::Close: Broken pipe
I20260928 14:51:20.780460 17856 acceptor_pool.cc:254] collecting diagnostics on the listening RPC socket unix:/tmp/dist-test-taskENgJxX/test-tmp/rpc-test-ff8c56cffebc42d4a70091e5ffb799f8.sock every 8 connection(s)
I20260928 14:51:20.780586 17857 acceptor_pool.cc:254] collecting diagnostics on the listening RPC socket unix:/tmp/dist-test-taskENgJxX/test-tmp/rpc-test-ff8c56cffebc42d4a70091e5ffb799f8.sock every 8 connection(s)
W20260928 14:51:27.962227 17853 connection.cc:577] server connection from unix:<unnamed>: received bad data: 'Corruption: Invalid packet: message had a length of 2147483710, but we only support messages up to 2147483647 bytes
'
W20260928 14:51:27.962857 17869 connection.cc:196] Error closing socket: Network error: TlsSocket::Close: Broken pipe
[       OK ] Parameters/TestRpc.TestRpcSidecarLimits/SSL_UnixSocket (11480 ms)
[ RUN      ] Parameters/TestRpc.TestCallTimeoutDoesntAffectNegotiation/SSL_UnixSocket
I20260928 14:51:28.474611 17881 acceptor_pool.cc:254] collecting diagnostics on the listening RPC socket unix:/tmp/dist-test-taskENgJxX/test-tmp/rpc-test-7b67ee99a6724049ab5b977881fae70c.sock every 8 connection(s)
I20260928 14:51:28.474889 17882 acceptor_pool.cc:254] collecting diagnostics on the listening RPC socket unix:/tmp/dist-test-taskENgJxX/test-tmp/rpc-test-7b67ee99a6724049ab5b977881fae70c.sock every 8 connection(s)
W20260928 14:51:28.498543 17877 negotiation.cc:266] Injecting 500ms delay in negotiation
I20260928 14:51:28.549019 17588 rpc-test-base.h:595] status: Timed out: connection negotiation to unix:/tmp/dist-test-taskENgJxX/test-tmp/rpc-test-7b67ee99a6724049ab5b977881fae70c.sock for RPC Sleep timed out after 0.050s (ON_OUTBOUND_QUEUE), seconds elapsed: 0.0510781
[       OK ] Parameters/TestRpc.TestCallTimeoutDoesntAffectNegotiation/SSL_UnixSocket (569 ms)
[ RUN      ] Parameters/TestRpc.TestRpcHandlerLatencyMetric/SSL_UnixSocket
I20260928 14:51:29.017916 17906 acceptor_pool.cc:254] collecting diagnostics on the listening RPC socket unix:/tmp/dist-test-taskENgJxX/test-tmp/rpc-test-5a76120ef1624bda8671b92334f3653a.sock every 8 connection(s)
I20260928 14:51:29.018177 17907 acceptor_pool.cc:254] collecting diagnostics on the listening RPC socket unix:/tmp/dist-test-taskENgJxX/test-tmp/rpc-test-5a76120ef1624bda8671b92334f3653a.sock every 8 connection(s)
I20260928 14:51:29.061718 17588 rpc-test.cc:1236] Sleep() min lat: 20614
I20260928 14:51:29.061817 17588 rpc-test.cc:1237] Sleep() mean lat: 20614
I20260928 14:51:29.061888 17588 rpc-test.cc:1238] Sleep() max lat: 20614
I20260928 14:51:29.061926 17588 rpc-test.cc:1239] Sleep() #calls: 1
[       OK ] Parameters/TestRpc.TestRpcHandlerLatencyMetric/SSL_UnixSocket (57 ms)
[ RUN      ] Parameters/TestRpc.TimedOutOnResponseMetricServiceQueue/SSL_UnixSocket
I20260928 14:51:29.083513 17932 acceptor_pool.cc:254] collecting diagnostics on the listening RPC socket unix:/tmp/dist-test-taskENgJxX/test-tmp/rpc-test-d71bc65d4c38478589e8ec0779af4d46.sock every 8 connection(s)
I20260928 14:51:29.083738 17933 acceptor_pool.cc:254] collecting diagnostics on the listening RPC socket unix:/tmp/dist-test-taskENgJxX/test-tmp/rpc-test-d71bc65d4c38478589e8ec0779af4d46.sock every 8 connection(s)
W20260928 14:51:29.151345 17934 rpcz_store.cc:267] Call kudu.rpc_test.CalculatorService.Sleep from unix:<unnamed> (request call id 2) took 20 ms (client timeout 20 ms). Trace:
W20260928 14:51:29.151540 17934 rpcz_store.cc:269] 0928 14:51:29.130902 (+     0us) service_pool.cc:170] Inserting onto call queue
0928 14:51:29.151268 (+ 20366us) service_pool.cc:214] Skipping call since client already timed out
0928 14:51:29.151325 (+    57us) inbound_call.cc:173] Queueing failure response
Metrics: {}
[       OK ] Parameters/TestRpc.TimedOutOnResponseMetricServiceQueue/SSL_UnixSocket (88 ms)
[ RUN      ] Parameters/TestRpc.RpcPendingConnectionsMetric/SSL_UnixSocket
I20260928 14:51:29.159948 17955 acceptor_pool.cc:254] collecting diagnostics on the listening RPC socket 0.0.0.0:34995 every 8 connection(s)
I20260928 14:51:29.160167 17956 acceptor_pool.cc:254] collecting diagnostics on the listening RPC socket 0.0.0.0:34995 every 8 connection(s)
W20260928 14:51:29.162052 17951 negotiation.cc:337] Failed RPC negotiation. Trace:
0928 14:51:29.161478 (+     0us) reactor.cc:625] Submitting negotiation task for server connection from 127.0.0.1:38290 (local address 127.0.0.1:34995)
0928 14:51:29.161610 (+   132us) server_negotiation.cc:206] Beginning negotiation
0928 14:51:29.161613 (+     3us) server_negotiation.cc:399] Waiting for connection header
0928 14:51:29.161758 (+   145us) negotiation.cc:327] Negotiation complete: Network error: Server connection negotiation failed: server connection from 127.0.0.1:38290: BlockingRecv error: recv got EOF from 127.0.0.1:38290 (error 108)
Metrics: {"server-negotiator.queue_time_us":38}
[       OK ] Parameters/TestRpc.RpcPendingConnectionsMetric/SSL_UnixSocket (19 ms)
[ RUN      ] Parameters/TestRpc.TestRpcContextClientDeadline/SSL_UnixSocket
I20260928 14:51:29.210130 17971 acceptor_pool.cc:254] collecting diagnostics on the listening RPC socket unix:/tmp/dist-test-taskENgJxX/test-tmp/rpc-test-7efcec612ff042589afca0ffbd9afbd6.sock every 8 connection(s)
I20260928 14:51:29.210310 17972 acceptor_pool.cc:254] collecting diagnostics on the listening RPC socket unix:/tmp/dist-test-taskENgJxX/test-tmp/rpc-test-7efcec612ff042589afca0ffbd9afbd6.sock every 8 connection(s)
[       OK ] Parameters/TestRpc.TestRpcContextClientDeadline/SSL_UnixSocket (82 ms)
[ RUN      ] Parameters/TestRpc.TestApplicationFeatureFlagUnsupportedServer/SSL_UnixSocket
I20260928 14:51:29.276788 17996 acceptor_pool.cc:254] collecting diagnostics on the listening RPC socket unix:/tmp/dist-test-taskENgJxX/test-tmp/rpc-test-4dc2645ed1c4488f9bbc8fb63e918d08.sock every 8 connection(s)
I20260928 14:51:29.277024 17997 acceptor_pool.cc:254] collecting diagnostics on the listening RPC socket unix:/tmp/dist-test-taskENgJxX/test-tmp/rpc-test-4dc2645ed1c4488f9bbc8fb63e918d08.sock every 8 connection(s)
W20260928 14:51:29.294386 17993 connection.cc:196] Error closing socket: Network error: TlsSocket::Close: Broken pipe
[       OK ] Parameters/TestRpc.TestApplicationFeatureFlagUnsupportedServer/SSL_UnixSocket (40 ms)
[ RUN      ] Parameters/TestRpc.TestCancellationAsync/SSL_UnixSocket
I20260928 14:51:29.310595 18021 acceptor_pool.cc:254] collecting diagnostics on the listening RPC socket unix:/tmp/dist-test-taskENgJxX/test-tmp/rpc-test-8101fcc41c0049fb99d35ef3241d954c.sock every 8 connection(s)
I20260928 14:51:29.310822 18022 acceptor_pool.cc:254] collecting diagnostics on the listening RPC socket unix:/tmp/dist-test-taskENgJxX/test-tmp/rpc-test-8101fcc41c0049fb99d35ef3241d954c.sock every 8 connection(s)
I20260928 14:51:29.311681 17588 rpc-test.cc:1716] Connecting to unix:/tmp/dist-test-taskENgJxX/test-tmp/rpc-test-8101fcc41c0049fb99d35ef3241d954c.sock
I20260928 14:51:29.323319 17588 test_util.cc:268] Using random seed: 863882533
I20260928 14:51:29.360734 18025 rpc-test-base.h:240] got call: sleep_micros: 500 pattern: 4294967295 num_repetitions: 2097152 sidecar_idx: 0
I20260928 14:51:29.389554 18024 rpc-test-base.h:240] got call: sleep_micros: 500 pattern: 4294967295 num_repetitions: 2097152 sidecar_idx: 0
I20260928 14:51:29.423659 18025 rpc-test-base.h:240] got call: sleep_micros: 500 pattern: 4294967295 num_repetitions: 2097152 sidecar_idx: 0
I20260928 14:51:29.458024 18025 rpc-test-base.h:240] got call: sleep_micros: 500 pattern: 4294967295 num_repetitions: 2097152 sidecar_idx: 0
I20260928 14:51:29.490806 18025 rpc-test-base.h:240] got call: sleep_micros: 500 pattern: 4294967295 num_repetitions: 2097152 sidecar_idx: 0
I20260928 14:51:29.524180 18025 rpc-test-base.h:240] got call: sleep_micros: 500 pattern: 4294967295 num_repetitions: 2097152 sidecar_idx: 0
I20260928 14:51:29.557431 18025 rpc-test-base.h:240] got call: sleep_micros: 500 pattern: 4294967295 num_repetitions: 2097152 sidecar_idx: 0
W20260928 14:51:29.559923 18018 connection.cc:196] Error closing socket: Network error: TlsSocket::Close: Broken pipe
W20260928 14:51:29.593778 18018 connection.cc:441] server connection from unix:<unnamed> torn down before Call kudu.rpc.GenericCalculatorService.SleepWithSidecar from unix:<unnamed> (request call id 9) could send its response
[       OK ] Parameters/TestRpc.TestCancellationAsync/SSL_UnixSocket (298 ms)
[ RUN      ] Parameters/TestRpc.TestPerformanceBySocketType/SSL_UnixSocket
I20260928 14:51:29.609396 18046 acceptor_pool.cc:254] collecting diagnostics on the listening RPC socket unix:/tmp/dist-test-taskENgJxX/test-tmp/rpc-test-6fea41c2605443219756c95ee20a5e9d.sock every 8 connection(s)
I20260928 14:51:29.609653 18047 acceptor_pool.cc:254] collecting diagnostics on the listening RPC socket unix:/tmp/dist-test-taskENgJxX/test-tmp/rpc-test-6fea41c2605443219756c95ee20a5e9d.sock every 8 connection(s)
I20260928 14:51:29.610594 17588 rpc-test.cc:1846] Connecting to unix:/tmp/dist-test-taskENgJxX/test-tmp/rpc-test-6fea41c2605443219756c95ee20a5e9d.sock
I20260928 14:51:32.979851 17588 rpc-test.cc:1859] Sending 1024MB via ssl-enabled unix socket: real 3.340s	user 3.274s	sys 2.378s
I20260928 14:51:36.270157 17588 rpc-test.cc:1859] Sending 1024MB via ssl-enabled unix socket: real 3.290s	user 3.322s	sys 2.231s
I20260928 14:51:39.560634 17588 rpc-test.cc:1859] Sending 1024MB via ssl-enabled unix socket: real 3.290s	user 3.230s	sys 2.312s
I20260928 14:51:42.823849 17588 rpc-test.cc:1859] Sending 1024MB via ssl-enabled unix socket: real 3.263s	user 3.204s	sys 2.286s
I20260928 14:51:46.160547 17588 rpc-test.cc:1859] Sending 1024MB via ssl-enabled unix socket: real 3.337s	user 3.230s	sys 2.398s
[       OK ] Parameters/TestRpc.TestPerformanceBySocketType/SSL_UnixSocket (16571 ms)
[----------] 20 tests from Parameters/TestRpc (55681 ms total)

[----------] 1 test from Parameters/TestRpcSocketTxRxQueue
[ RUN      ] Parameters/TestRpcSocketTxRxQueue.AcceptorRxQueueSizeMetric/0
I20260928 14:51:46.181993 18071 acceptor_pool.cc:254] collecting diagnostics on the listening RPC socket 0.0.0.0:37043 every 1 connection(s)
I20260928 14:51:46.182202 18072 acceptor_pool.cc:254] collecting diagnostics on the listening RPC socket 0.0.0.0:37043 every 1 connection(s)
W20260928 14:51:46.183945 18067 negotiation.cc:337] Failed RPC negotiation. Trace:
0928 14:51:46.183526 (+     0us) reactor.cc:625] Submitting negotiation task for server connection from 127.0.0.1:43694 (local address 127.0.0.1:37043)
0928 14:51:46.183691 (+   165us) server_negotiation.cc:206] Beginning negotiation
0928 14:51:46.183695 (+     4us) server_negotiation.cc:399] Waiting for connection header
0928 14:51:46.183833 (+   138us) negotiation.cc:327] Negotiation complete: Network error: Server connection negotiation failed: server connection from 127.0.0.1:43694: BlockingRecv error: recv got EOF from 127.0.0.1:43694 (error 108)
Metrics: {"server-negotiator.queue_time_us":53}
[       OK ] Parameters/TestRpcSocketTxRxQueue.AcceptorRxQueueSizeMetric/0 (18 ms)
[----------] 1 test from Parameters/TestRpcSocketTxRxQueue (18 ms total)

[----------] Global test environment tear-down
[==========] 21 tests from 2 test suites ran. (55700 ms total)
[  PASSED  ] 20 tests.
[  FAILED  ] 1 test, listed below:
[  FAILED  ] Parameters/TestRpc.TestCallWithChainCertAndChainCA/SSL_UnixSocket, where GetParam() = (true, true)

 1 FAILED TEST