Diagnosed failure

Parameters/TestRpc.TestCallWithChainCertAndChainCA/SSL_TCP: /data0/somelongdirectorytoavoidrpathissues/src/kudu/src/kudu/rpc/rpc-test.cc:270: Failure
Failed
Bad status: Runtime error: could not verify certificate chain (error with cert: subject=CN = localhost, ST = sadfjas, C = AS, emailAddress = sdflkdsajf, O = lskdfjlsad, OU = sldfkja, issuer=C = AS, ST = ASDfkjdhf, L = lskdjf, O = saldfja, OU = skdjf, CN = localhost, emailAddress = sadjflkadsj): : certificate has expired
Google Test trace:
/data0/somelongdirectorytoavoidrpathissues/src/kudu/src/kudu/rpc/rpc-test.cc:267: Connecting to 0.0.0.0:43117
I20260929 21:41:44.812548  2290 test_util.cc:175] -----------------------------------------------
I20260929 21:41:44.812739  2290 test_util.cc:176] Had fatal failures, leaving test files at /tmp/dist-test-taskTY0JbN/test-tmp/rpc-test.5.Parameters_TestRpc.TestCallWithChainCertAndChainCA_SSL_TCP.1790718103439638-2290-0

Full log

Note: This is test shard 6 of 8.
[==========] Running 21 tests from 2 test suites.
[----------] Global test environment set-up.
[----------] 20 tests from Parameters/TestRpc
[ RUN      ] Parameters/TestRpc.TestMessengerCreateDestroy/SSL_TCP
WARNING: Logging before InitGoogleLogging() is written to STDERR
I20260929 21:41:43.550911  2290 rpc-test.cc:169] started messenger TestCreateDestroy
[       OK ] Parameters/TestRpc.TestMessengerCreateDestroy/SSL_TCP (1185 ms)
[ RUN      ] Parameters/TestRpc.TestNegotiationDeadlock/SSL_TCP
I20260929 21:41:44.695858  2312 acceptor_pool.cc:254] collecting diagnostics on the listening RPC socket 0.0.0.0:37081 every 8 connection(s)
I20260929 21:41:44.697368  2313 acceptor_pool.cc:254] collecting diagnostics on the listening RPC socket 0.0.0.0:37081 every 8 connection(s)
[       OK ] Parameters/TestRpc.TestNegotiationDeadlock/SSL_TCP (71 ms)
[ RUN      ] Parameters/TestRpc.TestCallWithChainCertAndChainCA/SSL_TCP
I20260929 21:41:44.784410  2328 acceptor_pool.cc:254] collecting diagnostics on the listening RPC socket 0.0.0.0:43117 every 8 connection(s)
I20260929 21:41:44.786659  2329 acceptor_pool.cc:254] collecting diagnostics on the listening RPC socket 0.0.0.0:43117 every 8 connection(s)
/data0/somelongdirectorytoavoidrpathissues/src/kudu/src/kudu/rpc/rpc-test.cc:270: Failure
Failed
Bad status: Runtime error: could not verify certificate chain (error with cert: subject=CN = localhost, ST = sadfjas, C = AS, emailAddress = sdflkdsajf, O = lskdfjlsad, OU = sldfkja, issuer=C = AS, ST = ASDfkjdhf, L = lskdjf, O = saldfja, OU = skdjf, CN = localhost, emailAddress = sadjflkadsj): : certificate has expired
Google Test trace:
/data0/somelongdirectorytoavoidrpathissues/src/kudu/src/kudu/rpc/rpc-test.cc:267: Connecting to 0.0.0.0:43117
I20260929 21:41:44.812548  2290 test_util.cc:175] -----------------------------------------------
I20260929 21:41:44.812739  2290 test_util.cc:176] Had fatal failures, leaving test files at /tmp/dist-test-taskTY0JbN/test-tmp/rpc-test.5.Parameters_TestRpc.TestCallWithChainCertAndChainCA_SSL_TCP.1790718103439638-2290-0
[  FAILED  ] Parameters/TestRpc.TestCallWithChainCertAndChainCA/SSL_TCP, where GetParam() = (true, false) (63 ms)
[ RUN      ] Parameters/TestRpc.TestCallWithPasswordProtectedKey/SSL_TCP
I20260929 21:41:44.838946  2353 acceptor_pool.cc:254] collecting diagnostics on the listening RPC socket 0.0.0.0:34665 every 8 connection(s)
I20260929 21:41:44.839763  2354 acceptor_pool.cc:254] collecting diagnostics on the listening RPC socket 0.0.0.0:34665 every 8 connection(s)
[       OK ] Parameters/TestRpc.TestCallWithPasswordProtectedKey/SSL_TCP (74 ms)
[ RUN      ] Parameters/TestRpc.TestCallToBadServer/SSL_TCP
I20260929 21:41:44.913769  2290 rpc-test.cc:394] Status: Network error: Client connection negotiation failed: client connection to 0.0.0.0:0: connect: Connection refused (error 111)
I20260929 21:41:44.915088  2290 rpc-test.cc:394] Status: Network error: Client connection negotiation failed: client connection to 0.0.0.0:0: connect: Connection refused (error 111)
I20260929 21:41:44.916301  2290 rpc-test.cc:394] Status: Network error: Client connection negotiation failed: client connection to 0.0.0.0:0: connect: Connection refused (error 111)
I20260929 21:41:44.917603  2290 rpc-test.cc:394] Status: Network error: Client connection negotiation failed: client connection to 0.0.0.0:0: connect: Connection refused (error 111)
I20260929 21:41:44.918874  2290 rpc-test.cc:394] Status: Network error: Client connection negotiation failed: client connection to 0.0.0.0:0: connect: Connection refused (error 111)
[       OK ] Parameters/TestRpc.TestCallToBadServer/SSL_TCP (34 ms)
[ RUN      ] Parameters/TestRpc.TestWrongService/SSL_TCP
I20260929 21:41:44.958601  2388 acceptor_pool.cc:254] collecting diagnostics on the listening RPC socket 0.0.0.0:37731 every 8 connection(s)
I20260929 21:41:44.959403  2389 acceptor_pool.cc:254] collecting diagnostics on the listening RPC socket 0.0.0.0:37731 every 8 connection(s)
I20260929 21:41:45.022994  2385 messenger.cc:345] service WrongServiceName not registered on TestServer
[       OK ] Parameters/TestRpc.TestWrongService/SSL_TCP (109 ms)
[ RUN      ] Parameters/TestRpc.TestConnectionKeepalive/SSL_TCP
I20260929 21:41:45.045631  2411 acceptor_pool.cc:254] collecting diagnostics on the listening RPC socket 0.0.0.0:46357 every 8 connection(s)
I20260929 21:41:45.046412  2412 acceptor_pool.cc:254] collecting diagnostics on the listening RPC socket 0.0.0.0:46357 every 8 connection(s)
I20260929 21:41:45.049544  2290 rpc-test.cc:488] Connecting to 0.0.0.0:46357
[       OK ] Parameters/TestRpc.TestConnectionKeepalive/SSL_TCP (1060 ms)
[ RUN      ] Parameters/TestRpc.TestClientConnectionMetrics/SSL_TCP
I20260929 21:41:46.120720  2436 acceptor_pool.cc:254] collecting diagnostics on the listening RPC socket 0.0.0.0:43587 every 8 connection(s)
I20260929 21:41:46.121466  2437 acceptor_pool.cc:254] collecting diagnostics on the listening RPC socket 0.0.0.0:43587 every 8 connection(s)
I20260929 21:41:46.124574  2290 rpc-test.cc:569] Connecting to 0.0.0.0:43587
[       OK ] Parameters/TestRpc.TestClientConnectionMetrics/SSL_TCP (116422 ms)
[ RUN      ] Parameters/TestRpc.TestCredentialsPolicy/SSL_TCP
I20260929 21:43:42.537282  2470 acceptor_pool.cc:254] collecting diagnostics on the listening RPC socket 0.0.0.0:46403 every 8 connection(s)
I20260929 21:43:42.538054  2471 acceptor_pool.cc:254] collecting diagnostics on the listening RPC socket 0.0.0.0:46403 every 8 connection(s)
I20260929 21:43:42.541261  2290 rpc-test.cc:700] Connecting to 0.0.0.0:46403
[       OK ] Parameters/TestRpc.TestCredentialsPolicy/SSL_TCP (91 ms)
[ RUN      ] Parameters/TestRpc.TestCallLongerThanKeepalive/SSL_TCP
I20260929 21:43:42.629254  2495 acceptor_pool.cc:254] collecting diagnostics on the listening RPC socket 0.0.0.0:40907 every 8 connection(s)
I20260929 21:43:42.630074  2496 acceptor_pool.cc:254] collecting diagnostics on the listening RPC socket 0.0.0.0:40907 every 8 connection(s)
I20260929 21:43:42.658893  2499 rpc-test-base.h:222] got call: sleep_micros: 3000000 deferred: true
I20260929 21:43:45.663301  2499 rpcz_store.cc:275] Call kudu.rpc.GenericCalculatorService.Sleep from 127.0.0.1:44354 (request call id 0) took 3004 ms. Trace:
I20260929 21:43:45.663723  2499 rpcz_store.cc:276] 0929 21:43:42.658628 (+     0us) service_pool.cc:170] Inserting onto call queue
0929 21:43:42.658725 (+    97us) service_pool.cc:227] Handling call
0929 21:43:45.663131 (+3004406us) inbound_call.cc:173] Queueing success response
Metrics: {}
[       OK ] Parameters/TestRpc.TestCallLongerThanKeepalive/SSL_TCP (3069 ms)
[ RUN      ] Parameters/TestRpc.TestRpcSidecar/SSL_TCP
I20260929 21:43:45.708393  2521 acceptor_pool.cc:254] collecting diagnostics on the listening RPC socket 0.0.0.0:41295 every 8 connection(s)
I20260929 21:43:45.709213  2522 acceptor_pool.cc:254] collecting diagnostics on the listening RPC socket 0.0.0.0:41295 every 8 connection(s)
[       OK ] Parameters/TestRpc.TestRpcSidecar/SSL_TCP (540 ms)
[ RUN      ] Parameters/TestRpc.TestRpcSidecarLimits/SSL_TCP
I20260929 21:44:02.863394  2547 acceptor_pool.cc:254] collecting diagnostics on the listening RPC socket 0.0.0.0:36711 every 8 connection(s)
I20260929 21:44:02.864289  2548 acceptor_pool.cc:254] collecting diagnostics on the listening RPC socket 0.0.0.0:36711 every 8 connection(s)
W20260929 21:44:02.895823  2290 serialization.cc:72] Serialized kudu.rpc_test.PushStringsRequestPB (2147483654 bytes) is larger than the maximum configured RPC message size (52428800 bytes). Sending anyway, but peer may reject the data.
W20260929 21:44:02.908362  2546 connection.cc:535] server connection from 127.0.0.1:60382 recv error: Network error: RPC frame had a length of 2147483714, but we only support messages up to 52428800 bytes long.
W20260929 21:44:02.908812  2546 connection.cc:158] shutting down server connection from 127.0.0.1:60382 with pending inbound data: 4/2147483714 bytes received; last active 0 ns ago: status Network error: RPC frame had a length of 2147483714, but we only support messages up to 52428800 bytes long.
W20260929 21:44:02.909797  2560 connection.cc:698] client connection to 0.0.0.0:36711 send error: Network error: failed to write to TLS socket: Connection reset by peer
W20260929 21:44:02.910430  2560 connection.cc:196] Error closing socket: Network error: TlsSocket::Close: Success
[       OK ] Parameters/TestRpc.TestRpcSidecarLimits/SSL_TCP (17504 ms)
[ RUN      ] Parameters/TestRpc.TestCallTimeoutDoesntAffectNegotiation/SSL_TCP
I20260929 21:44:03.738737  2572 acceptor_pool.cc:254] collecting diagnostics on the listening RPC socket 0.0.0.0:41497 every 8 connection(s)
I20260929 21:44:03.739464  2573 acceptor_pool.cc:254] collecting diagnostics on the listening RPC socket 0.0.0.0:41497 every 8 connection(s)
W20260929 21:44:03.766062  2568 negotiation.cc:266] Injecting 500ms delay in negotiation
I20260929 21:44:03.815522  2290 rpc-test-base.h:595] status: Timed out: connection negotiation to 0.0.0.0:41497 for RPC Sleep timed out after 0.050s (ON_OUTBOUND_QUEUE), seconds elapsed: 0.0505126
[       OK ] Parameters/TestRpc.TestCallTimeoutDoesntAffectNegotiation/SSL_TCP (565 ms)
[ RUN      ] Parameters/TestRpc.TestRpcHandlerLatencyMetric/SSL_TCP
I20260929 21:44:04.321497  2598 acceptor_pool.cc:254] collecting diagnostics on the listening RPC socket 0.0.0.0:40353 every 8 connection(s)
I20260929 21:44:04.322274  2599 acceptor_pool.cc:254] collecting diagnostics on the listening RPC socket 0.0.0.0:40353 every 8 connection(s)
I20260929 21:44:04.387023  2290 rpc-test.cc:1236] Sleep() min lat: 21598
I20260929 21:44:04.387218  2290 rpc-test.cc:1237] Sleep() mean lat: 21598
I20260929 21:44:04.387364  2290 rpc-test.cc:1238] Sleep() max lat: 21598
I20260929 21:44:04.387481  2290 rpc-test.cc:1239] Sleep() #calls: 1
[       OK ] Parameters/TestRpc.TestRpcHandlerLatencyMetric/SSL_TCP (108 ms)
[ RUN      ] Parameters/TestRpc.TimedOutOnResponseMetricServiceQueue/SSL_TCP
I20260929 21:44:04.431201  2624 acceptor_pool.cc:254] collecting diagnostics on the listening RPC socket 0.0.0.0:40095 every 8 connection(s)
I20260929 21:44:04.432116  2625 acceptor_pool.cc:254] collecting diagnostics on the listening RPC socket 0.0.0.0:40095 every 8 connection(s)
W20260929 21:44:04.519613  2626 rpcz_store.cc:267] Call kudu.rpc_test.CalculatorService.Sleep from 127.0.0.1:39996 (request call id 2) took 20 ms (client timeout 20 ms). Trace:
W20260929 21:44:04.520006  2626 rpcz_store.cc:269] 0929 21:44:04.499066 (+     0us) service_pool.cc:170] Inserting onto call queue
0929 21:44:04.519354 (+ 20288us) service_pool.cc:214] Skipping call since client already timed out
0929 21:44:04.519450 (+    96us) inbound_call.cc:173] Queueing failure response
Metrics: {}
[       OK ] Parameters/TestRpc.TimedOutOnResponseMetricServiceQueue/SSL_TCP (131 ms)
[ RUN      ] Parameters/TestRpc.RpcPendingConnectionsMetric/SSL_TCP
I20260929 21:44:04.536633  2647 acceptor_pool.cc:254] collecting diagnostics on the listening RPC socket 0.0.0.0:33137 every 8 connection(s)
I20260929 21:44:04.537360  2648 acceptor_pool.cc:254] collecting diagnostics on the listening RPC socket 0.0.0.0:33137 every 8 connection(s)
W20260929 21:44:04.542171  2643 negotiation.cc:337] Failed RPC negotiation. Trace:
0929 21:44:04.540979 (+     0us) reactor.cc:625] Submitting negotiation task for server connection from 127.0.0.1:45630 (local address 127.0.0.1:33137)
0929 21:44:04.541349 (+   370us) server_negotiation.cc:206] Beginning negotiation
0929 21:44:04.541365 (+    16us) server_negotiation.cc:399] Waiting for connection header
0929 21:44:04.541616 (+   251us) negotiation.cc:327] Negotiation complete: Network error: Server connection negotiation failed: server connection from 127.0.0.1:45630: BlockingRecv error: recv got EOF from 127.0.0.1:45630 (error 108)
Metrics: {"server-negotiator.queue_time_us":95}
[       OK ] Parameters/TestRpc.RpcPendingConnectionsMetric/SSL_TCP (28 ms)
[ RUN      ] Parameters/TestRpc.TestRpcContextClientDeadline/SSL_TCP
I20260929 21:44:04.581848  2663 acceptor_pool.cc:254] collecting diagnostics on the listening RPC socket 0.0.0.0:41869 every 8 connection(s)
I20260929 21:44:04.582566  2664 acceptor_pool.cc:254] collecting diagnostics on the listening RPC socket 0.0.0.0:41869 every 8 connection(s)
[       OK ] Parameters/TestRpc.TestRpcContextClientDeadline/SSL_TCP (100 ms)
[ RUN      ] Parameters/TestRpc.TestApplicationFeatureFlagUnsupportedServer/SSL_TCP
I20260929 21:44:04.673679  2688 acceptor_pool.cc:254] collecting diagnostics on the listening RPC socket 0.0.0.0:37929 every 8 connection(s)
I20260929 21:44:04.674407  2689 acceptor_pool.cc:254] collecting diagnostics on the listening RPC socket 0.0.0.0:37929 every 8 connection(s)
[       OK ] Parameters/TestRpc.TestApplicationFeatureFlagUnsupportedServer/SSL_TCP (59 ms)
[ RUN      ] Parameters/TestRpc.TestCancellationAsync/SSL_TCP
I20260929 21:44:04.740242  2713 acceptor_pool.cc:254] collecting diagnostics on the listening RPC socket 0.0.0.0:40563 every 8 connection(s)
I20260929 21:44:04.741101  2714 acceptor_pool.cc:254] collecting diagnostics on the listening RPC socket 0.0.0.0:40563 every 8 connection(s)
I20260929 21:44:04.744439  2290 rpc-test.cc:1716] Connecting to 0.0.0.0:40563
I20260929 21:44:04.760555  2290 test_util.cc:268] Using random seed: 350170068
I20260929 21:44:05.000560  2717 rpc-test-base.h:240] got call: sleep_micros: 500 pattern: 4294967295 num_repetitions: 2097152 sidecar_idx: 0
I20260929 21:44:05.171870  2716 rpc-test-base.h:240] got call: sleep_micros: 500 pattern: 4294967295 num_repetitions: 2097152 sidecar_idx: 0
I20260929 21:44:05.365371  2717 rpc-test-base.h:240] got call: sleep_micros: 500 pattern: 4294967295 num_repetitions: 2097152 sidecar_idx: 0
I20260929 21:44:05.558398  2716 rpc-test-base.h:240] got call: sleep_micros: 500 pattern: 4294967295 num_repetitions: 2097152 sidecar_idx: 0
I20260929 21:44:05.745918  2717 rpc-test-base.h:240] got call: sleep_micros: 500 pattern: 4294967295 num_repetitions: 2097152 sidecar_idx: 0
I20260929 21:44:05.910351  2716 rpc-test-base.h:240] got call: sleep_micros: 500 pattern: 4294967295 num_repetitions: 2097152 sidecar_idx: 0
I20260929 21:44:06.099004  2717 rpc-test-base.h:240] got call: sleep_micros: 500 pattern: 4294967295 num_repetitions: 2097152 sidecar_idx: 0
I20260929 21:44:06.274286  2716 rpc-test-base.h:240] got call: sleep_micros: 500 pattern: 4294967295 num_repetitions: 2097152 sidecar_idx: 0
W20260929 21:44:06.439039  2711 connection.cc:196] Error closing socket: Network error: TlsSocket::Close: Broken pipe
W20260929 21:44:06.473485  2711 connection.cc:441] server connection from 127.0.0.1:35264 torn down before Call kudu.rpc.GenericCalculatorService.SleepWithSidecar from 127.0.0.1:35264 (request call id 8) could send its response
[       OK ] Parameters/TestRpc.TestCancellationAsync/SSL_TCP (1766 ms)
[ RUN      ] Parameters/TestRpc.TestPerformanceBySocketType/SSL_TCP
I20260929 21:44:06.574055  2738 acceptor_pool.cc:254] collecting diagnostics on the listening RPC socket 0.0.0.0:33465 every 8 connection(s)
I20260929 21:44:06.574787  2739 acceptor_pool.cc:254] collecting diagnostics on the listening RPC socket 0.0.0.0:33465 every 8 connection(s)
I20260929 21:44:06.577844  2290 rpc-test.cc:1846] Connecting to 0.0.0.0:33465
I20260929 21:44:25.753616  2290 rpc-test.cc:1859] Sending 1024MB via ssl-enabled tcp socket: real 19.155s	user 16.725s	sys 10.575s
I20260929 21:44:44.772518  2290 rpc-test.cc:1859] Sending 1024MB via ssl-enabled tcp socket: real 19.018s	user 16.366s	sys 10.677s
I20260929 21:45:03.590914  2290 rpc-test.cc:1859] Sending 1024MB via ssl-enabled tcp socket: real 18.818s	user 15.904s	sys 10.776s
I20260929 21:45:22.594637  2290 rpc-test.cc:1859] Sending 1024MB via ssl-enabled tcp socket: real 19.003s	user 16.438s	sys 10.604s
I20260929 21:45:41.595984  2290 rpc-test.cc:1859] Sending 1024MB via ssl-enabled tcp socket: real 19.001s	user 16.216s	sys 10.752s
[       OK ] Parameters/TestRpc.TestPerformanceBySocketType/SSL_TCP (95132 ms)
[----------] 20 tests from Parameters/TestRpc (238123 ms total)

[----------] 1 test from Parameters/TestRpcSocketTxRxQueue
[ RUN      ] Parameters/TestRpcSocketTxRxQueue.OverCapacity/0
W20260929 21:45:42.050168  2773 negotiation.cc:337] Failed RPC negotiation. Trace:
0929 21:45:41.638968 (+     0us) reactor.cc:625] Submitting negotiation task for client connection to 0.0.0.0:38765 (local address 127.0.0.1:45964)
0929 21:45:41.639685 (+   717us) negotiation.cc:107] Waiting for socket to connect
0929 21:45:41.639729 (+    44us) client_negotiation.cc:174] Beginning negotiation
0929 21:45:41.639996 (+   267us) client_negotiation.cc:252] Sending NEGOTIATE NegotiatePB request
0929 21:45:42.047766 (+407770us) negotiation.cc:327] Negotiation complete: Network error: Client connection negotiation failed: client connection to 0.0.0.0:38765: BlockingRecv error: recv error from unknown peer: Transport endpoint is not connected (error 107)
Metrics: {"client-negotiator.queue_time_us":183}
W20260929 21:45:42.051402  2764 negotiation.cc:337] Failed RPC negotiation. Trace:
0929 21:45:41.632135 (+     0us) reactor.cc:625] Submitting negotiation task for client connection to 0.0.0.0:38765 (local address 127.0.0.1:45950)
0929 21:45:41.632912 (+   777us) negotiation.cc:107] Waiting for socket to connect
0929 21:45:41.632979 (+    67us) client_negotiation.cc:174] Beginning negotiation
0929 21:45:41.633480 (+   501us) client_negotiation.cc:252] Sending NEGOTIATE NegotiatePB request
0929 21:45:42.047827 (+414347us) negotiation.cc:327] Negotiation complete: Network error: Client connection negotiation failed: client connection to 0.0.0.0:38765: BlockingRecv error: recv error from unknown peer: Transport endpoint is not connected (error 107)
Metrics: {"client-negotiator.queue_time_us":130}
W20260929 21:45:42.052023  2791 negotiation.cc:337] Failed RPC negotiation. Trace:
0929 21:45:41.658039 (+     0us) reactor.cc:625] Submitting negotiation task for client connection to 0.0.0.0:38765 (local address 127.0.0.1:45978)
0929 21:45:41.658624 (+   585us) negotiation.cc:107] Waiting for socket to connect
0929 21:45:41.658653 (+    29us) client_negotiation.cc:174] Beginning negotiation
0929 21:45:41.658952 (+   299us) client_negotiation.cc:252] Sending NEGOTIATE NegotiatePB request
0929 21:45:42.048250 (+389298us) negotiation.cc:327] Negotiation complete: Network error: Client connection negotiation failed: client connection to 0.0.0.0:38765: BlockingRecv error: recv error from unknown peer: Transport endpoint is not connected (error 107)
Metrics: {"client-negotiator.queue_time_us":148}
W20260929 21:45:42.052356  2809 negotiation.cc:337] Failed RPC negotiation. Trace:
0929 21:45:41.681137 (+     0us) reactor.cc:625] Submitting negotiation task for client connection to 0.0.0.0:38765 (local address 127.0.0.1:45998)
0929 21:45:41.681709 (+   572us) negotiation.cc:107] Waiting for socket to connect
0929 21:45:41.681739 (+    30us) client_negotiation.cc:174] Beginning negotiation
0929 21:45:41.682053 (+   314us) client_negotiation.cc:252] Sending NEGOTIATE NegotiatePB request
0929 21:45:42.048473 (+366420us) negotiation.cc:327] Negotiation complete: Network error: Client connection negotiation failed: client connection to 0.0.0.0:38765: BlockingRecv error: recv error from unknown peer: Transport endpoint is not connected (error 107)
Metrics: {"client-negotiator.queue_time_us":142}
W20260929 21:45:42.053063  2800 negotiation.cc:337] Failed RPC negotiation. Trace:
0929 21:45:41.669441 (+     0us) reactor.cc:625] Submitting negotiation task for client connection to 0.0.0.0:38765 (local address 127.0.0.1:45984)
0929 21:45:41.670001 (+   560us) negotiation.cc:107] Waiting for socket to connect
0929 21:45:41.670029 (+    28us) client_negotiation.cc:174] Beginning negotiation
0929 21:45:41.670327 (+   298us) client_negotiation.cc:252] Sending NEGOTIATE NegotiatePB request
0929 21:45:42.047766 (+377439us) negotiation.cc:327] Negotiation complete: Network error: Client connection negotiation failed: client connection to 0.0.0.0:38765: BlockingRecv error: recv error from unknown peer: Transport endpoint is not connected (error 107)
Metrics: {"client-negotiator.queue_time_us":139}
W20260929 21:45:42.053129  2782 negotiation.cc:337] Failed RPC negotiation. Trace:
0929 21:45:41.646046 (+     0us) reactor.cc:625] Submitting negotiation task for client connection to 0.0.0.0:38765 (local address 127.0.0.1:45970)
0929 21:45:41.646465 (+   419us) negotiation.cc:107] Waiting for socket to connect
0929 21:45:41.646493 (+    28us) client_negotiation.cc:174] Beginning negotiation
0929 21:45:41.646659 (+   166us) client_negotiation.cc:252] Sending NEGOTIATE NegotiatePB request
0929 21:45:42.048726 (+402067us) negotiation.cc:327] Negotiation complete: Network error: Client connection negotiation failed: client connection to 0.0.0.0:38765: BlockingRecv error: recv error from unknown peer: Transport endpoint is not connected (error 107)
Metrics: {"client-negotiator.queue_time_us":95}
[       OK ] Parameters/TestRpcSocketTxRxQueue.OverCapacity/0 (1233 ms)
[----------] 1 test from Parameters/TestRpcSocketTxRxQueue (1233 ms total)

[----------] Global test environment tear-down
[==========] 21 tests from 2 test suites ran. (239358 ms total)
[  PASSED  ] 20 tests.
[  FAILED  ] 1 test, listed below:
[  FAILED  ] Parameters/TestRpc.TestCallWithChainCertAndChainCA/SSL_TCP, where GetParam() = (true, false)

 1 FAILED TEST