Diagnosed failure
Parameters/TestRpc.TestCallWithChainCertAndChainCA/SSL_UnixSocket: /data0/somelongdirectorytoavoidrpathissues/src/kudu/src/kudu/rpc/rpc-test.cc:270: Failure
Failed
Bad status: Runtime error: could not verify certificate chain (error with cert: subject=CN = localhost, ST = sadfjas, C = AS, emailAddress = sdflkdsajf, O = lskdfjlsad, OU = sldfkja, issuer=C = AS, ST = ASDfkjdhf, L = lskdjf, O = saldfja, OU = skdjf, CN = localhost, emailAddress = sadjflkadsj): : certificate has expired
Google Test trace:
/data0/somelongdirectorytoavoidrpathissues/src/kudu/src/kudu/rpc/rpc-test.cc:267: Connecting to unix:/tmp/dist-test-task6D2iYW/test-tmp/rpc-test-4dc6629f19cd43009ba0863398dd4a82.sock
I20260927 23:37:52.502461 6598 test_util.cc:175] -----------------------------------------------
I20260927 23:37:52.502660 6598 test_util.cc:176] Had fatal failures, leaving test files at /tmp/dist-test-task6D2iYW/test-tmp/rpc-test.6.Parameters_TestRpc.TestCallWithChainCertAndChainCA_SSL_UnixSocket.1790552271151653-6598-0
Full log
Note: This is test shard 7 of 8.
[==========] Running 21 tests from 2 test suites.
[----------] Global test environment set-up.
[----------] 20 tests from Parameters/TestRpc
[ RUN ] Parameters/TestRpc.TestMessengerCreateDestroy/SSL_UnixSocket
WARNING: Logging before InitGoogleLogging() is written to STDERR
I20260927 23:37:51.296937 6598 rpc-test.cc:169] started messenger TestCreateDestroy
[ OK ] Parameters/TestRpc.TestMessengerCreateDestroy/SSL_UnixSocket (1147 ms)
[ RUN ] Parameters/TestRpc.TestNegotiationDeadlock/SSL_UnixSocket
I20260927 23:37:52.382265 6620 acceptor_pool.cc:254] collecting diagnostics on the listening RPC socket unix:/tmp/dist-test-task6D2iYW/test-tmp/rpc-test-5c2acb48c82c4193a198963dfdf7ba83.sock every 8 connection(s)
I20260927 23:37:52.383574 6621 acceptor_pool.cc:254] collecting diagnostics on the listening RPC socket unix:/tmp/dist-test-task6D2iYW/test-tmp/rpc-test-5c2acb48c82c4193a198963dfdf7ba83.sock every 8 connection(s)
[ OK ] Parameters/TestRpc.TestNegotiationDeadlock/SSL_UnixSocket (82 ms)
[ RUN ] Parameters/TestRpc.TestCallWithChainCertAndChainCA/SSL_UnixSocket
I20260927 23:37:52.471992 6636 acceptor_pool.cc:254] collecting diagnostics on the listening RPC socket unix:/tmp/dist-test-task6D2iYW/test-tmp/rpc-test-4dc6629f19cd43009ba0863398dd4a82.sock every 8 connection(s)
I20260927 23:37:52.474339 6637 acceptor_pool.cc:254] collecting diagnostics on the listening RPC socket unix:/tmp/dist-test-task6D2iYW/test-tmp/rpc-test-4dc6629f19cd43009ba0863398dd4a82.sock every 8 connection(s)
/data0/somelongdirectorytoavoidrpathissues/src/kudu/src/kudu/rpc/rpc-test.cc:270: Failure
Failed
Bad status: Runtime error: could not verify certificate chain (error with cert: subject=CN = localhost, ST = sadfjas, C = AS, emailAddress = sdflkdsajf, O = lskdfjlsad, OU = sldfkja, issuer=C = AS, ST = ASDfkjdhf, L = lskdjf, O = saldfja, OU = skdjf, CN = localhost, emailAddress = sadjflkadsj): : certificate has expired
Google Test trace:
/data0/somelongdirectorytoavoidrpathissues/src/kudu/src/kudu/rpc/rpc-test.cc:267: Connecting to unix:/tmp/dist-test-task6D2iYW/test-tmp/rpc-test-4dc6629f19cd43009ba0863398dd4a82.sock
I20260927 23:37:52.502461 6598 test_util.cc:175] -----------------------------------------------
I20260927 23:37:52.502660 6598 test_util.cc:176] Had fatal failures, leaving test files at /tmp/dist-test-task6D2iYW/test-tmp/rpc-test.6.Parameters_TestRpc.TestCallWithChainCertAndChainCA_SSL_UnixSocket.1790552271151653-6598-0
[ FAILED ] Parameters/TestRpc.TestCallWithChainCertAndChainCA/SSL_UnixSocket, where GetParam() = (true, true) (66 ms)
[ RUN ] Parameters/TestRpc.TestCallWithPasswordProtectedKey/SSL_UnixSocket
I20260927 23:37:52.524919 6661 acceptor_pool.cc:254] collecting diagnostics on the listening RPC socket unix:/tmp/dist-test-task6D2iYW/test-tmp/rpc-test-271815fc609f4322b7abf468b0ce5505.sock every 8 connection(s)
I20260927 23:37:52.525671 6662 acceptor_pool.cc:254] collecting diagnostics on the listening RPC socket unix:/tmp/dist-test-task6D2iYW/test-tmp/rpc-test-271815fc609f4322b7abf468b0ce5505.sock every 8 connection(s)
W20260927 23:37:52.574066 6658 connection.cc:196] Error closing socket: Network error: TlsSocket::Close: Broken pipe
[ OK ] Parameters/TestRpc.TestCallWithPasswordProtectedKey/SSL_UnixSocket (77 ms)
[ RUN ] Parameters/TestRpc.TestCallToBadServer/SSL_UnixSocket
I20260927 23:37:52.600771 6598 rpc-test.cc:394] Status: Network error: Client connection negotiation failed: client connection to 0.0.0.0:0: connect: Connection refused (error 111)
I20260927 23:37:52.602412 6598 rpc-test.cc:394] Status: Network error: Client connection negotiation failed: client connection to 0.0.0.0:0: connect: Connection refused (error 111)
I20260927 23:37:52.603772 6598 rpc-test.cc:394] Status: Network error: Client connection negotiation failed: client connection to 0.0.0.0:0: connect: Connection refused (error 111)
I20260927 23:37:52.605177 6598 rpc-test.cc:394] Status: Network error: Client connection negotiation failed: client connection to 0.0.0.0:0: connect: Connection refused (error 111)
I20260927 23:37:52.606689 6598 rpc-test.cc:394] Status: Network error: Client connection negotiation failed: client connection to 0.0.0.0:0: connect: Connection refused (error 111)
[ OK ] Parameters/TestRpc.TestCallToBadServer/SSL_UnixSocket (29 ms)
[ RUN ] Parameters/TestRpc.TestWrongService/SSL_UnixSocket
I20260927 23:37:52.635223 6696 acceptor_pool.cc:254] collecting diagnostics on the listening RPC socket unix:/tmp/dist-test-task6D2iYW/test-tmp/rpc-test-9638ff4d2608467490779936dfe3659e.sock every 8 connection(s)
I20260927 23:37:52.636013 6697 acceptor_pool.cc:254] collecting diagnostics on the listening RPC socket unix:/tmp/dist-test-task6D2iYW/test-tmp/rpc-test-9638ff4d2608467490779936dfe3659e.sock every 8 connection(s)
I20260927 23:37:52.670382 6693 messenger.cc:345] service WrongServiceName not registered on TestServer
[ OK ] Parameters/TestRpc.TestWrongService/SSL_UnixSocket (70 ms)
[ RUN ] Parameters/TestRpc.TestConnectionKeepalive/SSL_UnixSocket
I20260927 23:37:52.731688 6719 acceptor_pool.cc:254] collecting diagnostics on the listening RPC socket unix:/tmp/dist-test-task6D2iYW/test-tmp/rpc-test-a5345cd8a95e45bfbfbd01b0b886302f.sock every 8 connection(s)
I20260927 23:37:52.732518 6720 acceptor_pool.cc:254] collecting diagnostics on the listening RPC socket unix:/tmp/dist-test-task6D2iYW/test-tmp/rpc-test-a5345cd8a95e45bfbfbd01b0b886302f.sock every 8 connection(s)
I20260927 23:37:52.735931 6598 rpc-test.cc:488] Connecting to unix:/tmp/dist-test-task6D2iYW/test-tmp/rpc-test-a5345cd8a95e45bfbfbd01b0b886302f.sock
W20260927 23:37:53.184190 6732 connection.cc:196] Error closing socket: Network error: TlsSocket::Close: Broken pipe
[ OK ] Parameters/TestRpc.TestConnectionKeepalive/SSL_UnixSocket (1104 ms)
[ RUN ] Parameters/TestRpc.TestClientConnectionMetrics/SSL_UnixSocket
I20260927 23:37:53.806223 6744 acceptor_pool.cc:254] collecting diagnostics on the listening RPC socket unix:/tmp/dist-test-task6D2iYW/test-tmp/rpc-test-1ae1650b19e144fc97ace7ebc4ec1a3b.sock every 8 connection(s)
I20260927 23:37:53.806941 6745 acceptor_pool.cc:254] collecting diagnostics on the listening RPC socket unix:/tmp/dist-test-task6D2iYW/test-tmp/rpc-test-1ae1650b19e144fc97ace7ebc4ec1a3b.sock every 8 connection(s)
I20260927 23:37:53.810259 6598 rpc-test.cc:569] Connecting to unix:/tmp/dist-test-task6D2iYW/test-tmp/rpc-test-1ae1650b19e144fc97ace7ebc4ec1a3b.sock
W20260927 23:40:16.697105 6741 connection.cc:196] Error closing socket: Network error: TlsSocket::Close: Broken pipe
[ OK ] Parameters/TestRpc.TestClientConnectionMetrics/SSL_UnixSocket (142921 ms)
[ RUN ] Parameters/TestRpc.TestCredentialsPolicy/SSL_UnixSocket
I20260927 23:40:16.749003 6781 acceptor_pool.cc:254] collecting diagnostics on the listening RPC socket unix:/tmp/dist-test-task6D2iYW/test-tmp/rpc-test-b266b90e68904677b98e81bf1f6d1be5.sock every 8 connection(s)
I20260927 23:40:16.750063 6782 acceptor_pool.cc:254] collecting diagnostics on the listening RPC socket unix:/tmp/dist-test-task6D2iYW/test-tmp/rpc-test-b266b90e68904677b98e81bf1f6d1be5.sock every 8 connection(s)
I20260927 23:40:16.753690 6598 rpc-test.cc:700] Connecting to unix:/tmp/dist-test-task6D2iYW/test-tmp/rpc-test-b266b90e68904677b98e81bf1f6d1be5.sock
W20260927 23:40:16.814685 6780 connection.cc:196] Error closing socket: Network error: TlsSocket::Close: Broken pipe
[ OK ] Parameters/TestRpc.TestCredentialsPolicy/SSL_UnixSocket (132 ms)
[ RUN ] Parameters/TestRpc.TestCallLongerThanKeepalive/SSL_UnixSocket
I20260927 23:40:16.870692 6806 acceptor_pool.cc:254] collecting diagnostics on the listening RPC socket unix:/tmp/dist-test-task6D2iYW/test-tmp/rpc-test-d284f404391b4c35adcd849d3c2a2026.sock every 8 connection(s)
I20260927 23:40:16.871431 6807 acceptor_pool.cc:254] collecting diagnostics on the listening RPC socket unix:/tmp/dist-test-task6D2iYW/test-tmp/rpc-test-d284f404391b4c35adcd849d3c2a2026.sock every 8 connection(s)
I20260927 23:40:16.903573 6810 rpc-test-base.h:222] got call: sleep_micros: 3000000 deferred: true
I20260927 23:40:19.908339 6810 rpcz_store.cc:275] Call kudu.rpc.GenericCalculatorService.Sleep from unix:<unnamed> (request call id 0) took 3005 ms. Trace:
I20260927 23:40:19.908653 6810 rpcz_store.cc:276] 0927 23:40:16.903377 (+ 0us) service_pool.cc:170] Inserting onto call queue
0927 23:40:16.903506 (+ 129us) service_pool.cc:227] Handling call
0927 23:40:19.908276 (+3004770us) inbound_call.cc:173] Queueing success response
Metrics: {}
W20260927 23:40:19.913278 6803 connection.cc:196] Error closing socket: Network error: TlsSocket::Close: Broken pipe
[ OK ] Parameters/TestRpc.TestCallLongerThanKeepalive/SSL_UnixSocket (3080 ms)
[ RUN ] Parameters/TestRpc.TestRpcSidecar/SSL_UnixSocket
I20260927 23:40:19.937836 6831 acceptor_pool.cc:254] collecting diagnostics on the listening RPC socket unix:/tmp/dist-test-task6D2iYW/test-tmp/rpc-test-bc25afb68ec94346a6244c0868a727fb.sock every 8 connection(s)
I20260927 23:40:19.938638 6832 acceptor_pool.cc:254] collecting diagnostics on the listening RPC socket unix:/tmp/dist-test-task6D2iYW/test-tmp/rpc-test-bc25afb68ec94346a6244c0868a727fb.sock every 8 connection(s)
W20260927 23:40:20.472430 6828 connection.cc:196] Error closing socket: Network error: TlsSocket::Close: Broken pipe
[ OK ] Parameters/TestRpc.TestRpcSidecar/SSL_UnixSocket (559 ms)
[ RUN ] Parameters/TestRpc.TestRpcSidecarLimits/SSL_UnixSocket
I20260927 23:40:42.286885 6859 acceptor_pool.cc:254] collecting diagnostics on the listening RPC socket unix:/tmp/dist-test-task6D2iYW/test-tmp/rpc-test-4ebc08be43024b27b9c51272c921493c.sock every 8 connection(s)
I20260927 23:40:42.287658 6860 acceptor_pool.cc:254] collecting diagnostics on the listening RPC socket unix:/tmp/dist-test-task6D2iYW/test-tmp/rpc-test-4ebc08be43024b27b9c51272c921493c.sock every 8 connection(s)
W20260927 23:40:42.325773 6598 serialization.cc:72] Serialized kudu.rpc_test.PushStringsRequestPB (2147483654 bytes) is larger than the maximum configured RPC message size (52428800 bytes). Sending anyway, but peer may reject the data.
W20260927 23:40:42.338099 6856 connection.cc:535] server connection from unix:<unnamed> recv error: Network error: RPC frame had a length of 2147483714, but we only support messages up to 52428800 bytes long.
W20260927 23:40:42.338502 6856 connection.cc:158] shutting down server connection from unix:<unnamed> with pending inbound data: 4/2147483714 bytes received; last active 0 ns ago: status Network error: RPC frame had a length of 2147483714, but we only support messages up to 52428800 bytes long.
W20260927 23:40:42.340150 6872 connection.cc:196] Error closing socket: Network error: TlsSocket::Close: Broken pipe
[ OK ] Parameters/TestRpc.TestRpcSidecarLimits/SSL_UnixSocket (22440 ms)
[ RUN ] Parameters/TestRpc.TestCallTimeoutDoesntAffectNegotiation/SSL_UnixSocket
I20260927 23:40:42.950099 6884 acceptor_pool.cc:254] collecting diagnostics on the listening RPC socket unix:/tmp/dist-test-task6D2iYW/test-tmp/rpc-test-d740f8b897884ea3885cf6bd8d5aa186.sock every 8 connection(s)
I20260927 23:40:42.950905 6885 acceptor_pool.cc:254] collecting diagnostics on the listening RPC socket unix:/tmp/dist-test-task6D2iYW/test-tmp/rpc-test-d740f8b897884ea3885cf6bd8d5aa186.sock every 8 connection(s)
W20260927 23:40:42.987859 6880 negotiation.cc:266] Injecting 500ms delay in negotiation
I20260927 23:40:43.037446 6598 rpc-test-base.h:595] status: Timed out: connection negotiation to unix:/tmp/dist-test-task6D2iYW/test-tmp/rpc-test-d740f8b897884ea3885cf6bd8d5aa186.sock for RPC Sleep timed out after 0.050s (ON_OUTBOUND_QUEUE), seconds elapsed: 0.0507223
W20260927 23:40:43.501686 6881 connection.cc:196] Error closing socket: Network error: TlsSocket::Close: Broken pipe
[ OK ] Parameters/TestRpc.TestCallTimeoutDoesntAffectNegotiation/SSL_UnixSocket (586 ms)
[ RUN ] Parameters/TestRpc.TestRpcHandlerLatencyMetric/SSL_UnixSocket
I20260927 23:40:43.531544 6909 acceptor_pool.cc:254] collecting diagnostics on the listening RPC socket unix:/tmp/dist-test-task6D2iYW/test-tmp/rpc-test-663014a8f0934c83ac080a073eb56c0e.sock every 8 connection(s)
I20260927 23:40:43.532367 6910 acceptor_pool.cc:254] collecting diagnostics on the listening RPC socket unix:/tmp/dist-test-task6D2iYW/test-tmp/rpc-test-663014a8f0934c83ac080a073eb56c0e.sock every 8 connection(s)
I20260927 23:40:43.607056 6598 rpc-test.cc:1236] Sleep() min lat: 21763
I20260927 23:40:43.607283 6598 rpc-test.cc:1237] Sleep() mean lat: 21763
I20260927 23:40:43.607476 6598 rpc-test.cc:1238] Sleep() max lat: 21763
I20260927 23:40:43.607625 6598 rpc-test.cc:1239] Sleep() #calls: 1
[ OK ] Parameters/TestRpc.TestRpcHandlerLatencyMetric/SSL_UnixSocket (112 ms)
[ RUN ] Parameters/TestRpc.TimedOutOnResponseMetricServiceQueue/SSL_UnixSocket
I20260927 23:40:43.639794 6935 acceptor_pool.cc:254] collecting diagnostics on the listening RPC socket unix:/tmp/dist-test-task6D2iYW/test-tmp/rpc-test-3b731d541f6842479510d82f885ac457.sock every 8 connection(s)
I20260927 23:40:43.640544 6936 acceptor_pool.cc:254] collecting diagnostics on the listening RPC socket unix:/tmp/dist-test-task6D2iYW/test-tmp/rpc-test-3b731d541f6842479510d82f885ac457.sock every 8 connection(s)
W20260927 23:40:43.712431 6937 rpcz_store.cc:267] Call kudu.rpc_test.CalculatorService.Sleep from unix:<unnamed> (request call id 2) took 20 ms (client timeout 20 ms). Trace:
W20260927 23:40:43.712846 6937 rpcz_store.cc:269] 0927 23:40:43.691900 (+ 0us) service_pool.cc:170] Inserting onto call queue
0927 23:40:43.712286 (+ 20386us) service_pool.cc:214] Skipping call since client already timed out
0927 23:40:43.712375 (+ 89us) inbound_call.cc:173] Queueing failure response
Metrics: {}
W20260927 23:40:43.715173 6932 connection.cc:196] Error closing socket: Network error: TlsSocket::Close: Broken pipe
[ OK ] Parameters/TestRpc.TimedOutOnResponseMetricServiceQueue/SSL_UnixSocket (101 ms)
[ RUN ] Parameters/TestRpc.RpcPendingConnectionsMetric/SSL_UnixSocket
I20260927 23:40:43.731477 6958 acceptor_pool.cc:254] collecting diagnostics on the listening RPC socket 0.0.0.0:41499 every 8 connection(s)
I20260927 23:40:43.732256 6959 acceptor_pool.cc:254] collecting diagnostics on the listening RPC socket 0.0.0.0:41499 every 8 connection(s)
W20260927 23:40:43.738092 6954 negotiation.cc:337] Failed RPC negotiation. Trace:
0927 23:40:43.736810 (+ 0us) reactor.cc:625] Submitting negotiation task for server connection from 127.0.0.1:39412 (local address 127.0.0.1:41499)
0927 23:40:43.737241 (+ 431us) server_negotiation.cc:206] Beginning negotiation
0927 23:40:43.737272 (+ 31us) server_negotiation.cc:399] Waiting for connection header
0927 23:40:43.737533 (+ 261us) negotiation.cc:327] Negotiation complete: Network error: Server connection negotiation failed: server connection from 127.0.0.1:39412: BlockingRecv error: recv got EOF from 127.0.0.1:39412 (error 108)
Metrics: {"server-negotiator.queue_time_us":106}
[ OK ] Parameters/TestRpc.RpcPendingConnectionsMetric/SSL_UnixSocket (31 ms)
[ RUN ] Parameters/TestRpc.TestRpcContextClientDeadline/SSL_UnixSocket
I20260927 23:40:43.789924 6974 acceptor_pool.cc:254] collecting diagnostics on the listening RPC socket unix:/tmp/dist-test-task6D2iYW/test-tmp/rpc-test-ea133a430ecd4ce786571ded86d11672.sock every 8 connection(s)
I20260927 23:40:43.790661 6975 acceptor_pool.cc:254] collecting diagnostics on the listening RPC socket unix:/tmp/dist-test-task6D2iYW/test-tmp/rpc-test-ea133a430ecd4ce786571ded86d11672.sock every 8 connection(s)
W20260927 23:40:43.845013 6971 connection.cc:196] Error closing socket: Network error: TlsSocket::Close: Broken pipe
[ OK ] Parameters/TestRpc.TestRpcContextClientDeadline/SSL_UnixSocket (98 ms)
[ RUN ] Parameters/TestRpc.TestApplicationFeatureFlagUnsupportedServer/SSL_UnixSocket
I20260927 23:40:43.874642 6999 acceptor_pool.cc:254] collecting diagnostics on the listening RPC socket unix:/tmp/dist-test-task6D2iYW/test-tmp/rpc-test-eb3cf4e43fb64c2bbea5506b2015777b.sock every 8 connection(s)
I20260927 23:40:43.875416 7000 acceptor_pool.cc:254] collecting diagnostics on the listening RPC socket unix:/tmp/dist-test-task6D2iYW/test-tmp/rpc-test-eb3cf4e43fb64c2bbea5506b2015777b.sock every 8 connection(s)
W20260927 23:40:43.911049 6996 connection.cc:196] Error closing socket: Network error: TlsSocket::Close: Broken pipe
[ OK ] Parameters/TestRpc.TestApplicationFeatureFlagUnsupportedServer/SSL_UnixSocket (66 ms)
[ RUN ] Parameters/TestRpc.TestCancellationAsync/SSL_UnixSocket
I20260927 23:40:43.942412 7024 acceptor_pool.cc:254] collecting diagnostics on the listening RPC socket unix:/tmp/dist-test-task6D2iYW/test-tmp/rpc-test-9ec8db3da8624679860e5adcd39afb24.sock every 8 connection(s)
I20260927 23:40:43.943090 7025 acceptor_pool.cc:254] collecting diagnostics on the listening RPC socket unix:/tmp/dist-test-task6D2iYW/test-tmp/rpc-test-9ec8db3da8624679860e5adcd39afb24.sock every 8 connection(s)
I20260927 23:40:43.946305 6598 rpc-test.cc:1716] Connecting to unix:/tmp/dist-test-task6D2iYW/test-tmp/rpc-test-9ec8db3da8624679860e5adcd39afb24.sock
I20260927 23:40:43.977962 6598 test_util.cc:268] Using random seed: 2053112018
I20260927 23:40:44.205535 7028 rpc-test-base.h:240] got call: sleep_micros: 500 pattern: 4294967295 num_repetitions: 2097152 sidecar_idx: 0
I20260927 23:40:44.419755 7027 rpc-test-base.h:240] got call: sleep_micros: 500 pattern: 4294967295 num_repetitions: 2097152 sidecar_idx: 0
I20260927 23:40:44.629293 7028 rpc-test-base.h:240] got call: sleep_micros: 500 pattern: 4294967295 num_repetitions: 2097152 sidecar_idx: 0
I20260927 23:40:44.851675 7028 rpc-test-base.h:240] got call: sleep_micros: 500 pattern: 4294967295 num_repetitions: 2097152 sidecar_idx: 0
I20260927 23:40:45.061269 7028 rpc-test-base.h:240] got call: sleep_micros: 500 pattern: 4294967295 num_repetitions: 2097152 sidecar_idx: 0
I20260927 23:40:45.271344 7028 rpc-test-base.h:240] got call: sleep_micros: 500 pattern: 4294967295 num_repetitions: 2097152 sidecar_idx: 0
I20260927 23:40:45.491273 7027 rpc-test-base.h:240] got call: sleep_micros: 500 pattern: 4294967295 num_repetitions: 2097152 sidecar_idx: 0
I20260927 23:40:45.684276 7028 rpc-test-base.h:240] got call: sleep_micros: 500 pattern: 4294967295 num_repetitions: 2097152 sidecar_idx: 0
I20260927 23:40:45.903549 7028 rpc-test-base.h:240] got call: sleep_micros: 500 pattern: 4294967295 num_repetitions: 2097152 sidecar_idx: 0
W20260927 23:40:45.918732 7021 connection.cc:196] Error closing socket: Network error: TlsSocket::Close: Broken pipe
W20260927 23:40:46.040256 7021 connection.cc:441] server connection from unix:<unnamed> torn down before Call kudu.rpc.GenericCalculatorService.SleepWithSidecar from unix:<unnamed> (request call id 9) could send its response
[ OK ] Parameters/TestRpc.TestCancellationAsync/SSL_UnixSocket (2132 ms)
[ RUN ] Parameters/TestRpc.TestPerformanceBySocketType/SSL_UnixSocket
I20260927 23:40:46.135185 7049 acceptor_pool.cc:254] collecting diagnostics on the listening RPC socket unix:/tmp/dist-test-task6D2iYW/test-tmp/rpc-test-cb364decc7f5408dab7eb0ea85f9a74e.sock every 8 connection(s)
I20260927 23:40:46.135989 7050 acceptor_pool.cc:254] collecting diagnostics on the listening RPC socket unix:/tmp/dist-test-task6D2iYW/test-tmp/rpc-test-cb364decc7f5408dab7eb0ea85f9a74e.sock every 8 connection(s)
I20260927 23:40:46.139465 6598 rpc-test.cc:1846] Connecting to unix:/tmp/dist-test-task6D2iYW/test-tmp/rpc-test-cb364decc7f5408dab7eb0ea85f9a74e.sock
I20260927 23:41:08.643656 6598 rpc-test.cc:1859] Sending 1024MB via ssl-enabled unix socket: real 22.490s user 20.741s sys 13.637s
I20260927 23:41:30.679925 6598 rpc-test.cc:1859] Sending 1024MB via ssl-enabled unix socket: real 22.036s user 20.196s sys 13.344s
I20260927 23:41:52.760346 6598 rpc-test.cc:1859] Sending 1024MB via ssl-enabled unix socket: real 22.080s user 20.113s sys 13.519s
I20260927 23:42:14.842322 6598 rpc-test.cc:1859] Sending 1024MB via ssl-enabled unix socket: real 22.081s user 20.131s sys 13.498s
I20260927 23:42:36.943365 6598 rpc-test.cc:1859] Sending 1024MB via ssl-enabled unix socket: real 22.101s user 20.197s sys 13.531s
W20260927 23:42:36.949261 7046 connection.cc:196] Error closing socket: Network error: TlsSocket::Close: Broken pipe
[ OK ] Parameters/TestRpc.TestPerformanceBySocketType/SSL_UnixSocket (110913 ms)
[----------] 20 tests from Parameters/TestRpc (285757 ms total)
[----------] 1 test from Parameters/TestRpcSocketTxRxQueue
[ RUN ] Parameters/TestRpcSocketTxRxQueue.AcceptorRxQueueSizeMetric/0
I20260927 23:42:36.981422 7085 acceptor_pool.cc:254] collecting diagnostics on the listening RPC socket 0.0.0.0:37551 every 1 connection(s)
I20260927 23:42:36.982437 7086 acceptor_pool.cc:254] collecting diagnostics on the listening RPC socket 0.0.0.0:37551 every 1 connection(s)
W20260927 23:42:36.988457 7081 negotiation.cc:337] Failed RPC negotiation. Trace:
0927 23:42:36.986683 (+ 0us) reactor.cc:625] Submitting negotiation task for server connection from 127.0.0.1:48696 (local address 127.0.0.1:37551)
0927 23:42:36.987186 (+ 503us) server_negotiation.cc:206] Beginning negotiation
0927 23:42:36.987210 (+ 24us) server_negotiation.cc:399] Waiting for connection header
0927 23:42:36.987504 (+ 294us) negotiation.cc:327] Negotiation complete: Network error: Server connection negotiation failed: server connection from 127.0.0.1:48696: BlockingRecv error: recv got EOF from 127.0.0.1:48696 (error 108)
Metrics: {"server-negotiator.queue_time_us":132}
[ OK ] Parameters/TestRpcSocketTxRxQueue.AcceptorRxQueueSizeMetric/0 (32 ms)
[----------] 1 test from Parameters/TestRpcSocketTxRxQueue (32 ms total)
[----------] Global test environment tear-down
[==========] 21 tests from 2 test suites ran. (285791 ms total)
[ PASSED ] 20 tests.
[ FAILED ] 1 test, listed below:
[ FAILED ] Parameters/TestRpc.TestCallWithChainCertAndChainCA/SSL_UnixSocket, where GetParam() = (true, true)
1 FAILED TEST