Diagnosed failure

Parameters/TestRpc.TestCallWithChainCertAndChainCA/SSL_TCP: /data0/somelongdirectorytoavoidrpathissues/src/kudu/src/kudu/rpc/rpc-test.cc:270: Failure
Failed
Bad status: Runtime error: could not verify certificate chain (error with cert: subject=CN = localhost, ST = sadfjas, C = AS, emailAddress = sdflkdsajf, O = lskdfjlsad, OU = sldfkja, issuer=C = AS, ST = ASDfkjdhf, L = lskdjf, O = saldfja, OU = skdjf, CN = localhost, emailAddress = sadjflkadsj): : certificate has expired
Google Test trace:
/data0/somelongdirectorytoavoidrpathissues/src/kudu/src/kudu/rpc/rpc-test.cc:267: Connecting to 0.0.0.0:35201
I20260927 10:41:44.993232   772 test_util.cc:175] -----------------------------------------------
I20260927 10:41:44.993297   772 test_util.cc:176] Had fatal failures, leaving test files at /tmp/dist-test-taskiy5xIh/test-tmp/rpc-test.5.Parameters_TestRpc.TestCallWithChainCertAndChainCA_SSL_TCP.1790505704904692-772-0

Full log

Note: This is test shard 6 of 8.
[==========] Running 21 tests from 2 test suites.
[----------] Global test environment set-up.
[----------] 20 tests from Parameters/TestRpc
[ RUN      ] Parameters/TestRpc.TestMessengerCreateDestroy/SSL_TCP
WARNING: Logging before InitGoogleLogging() is written to STDERR
I20260927 10:41:44.947896   772 rpc-test.cc:169] started messenger TestCreateDestroy
[       OK ] Parameters/TestRpc.TestMessengerCreateDestroy/SSL_TCP (39 ms)
[ RUN      ] Parameters/TestRpc.TestNegotiationDeadlock/SSL_TCP
I20260927 10:41:44.960527   792 acceptor_pool.cc:254] collecting diagnostics on the listening RPC socket 0.0.0.0:41155 every 8 connection(s)
I20260927 10:41:44.960527   793 acceptor_pool.cc:254] collecting diagnostics on the listening RPC socket 0.0.0.0:41155 every 8 connection(s)
[       OK ] Parameters/TestRpc.TestNegotiationDeadlock/SSL_TCP (21 ms)
[ RUN      ] Parameters/TestRpc.TestCallWithChainCertAndChainCA/SSL_TCP
I20260927 10:41:44.988318   808 acceptor_pool.cc:254] collecting diagnostics on the listening RPC socket 0.0.0.0:35201 every 8 connection(s)
I20260927 10:41:44.988343   809 acceptor_pool.cc:254] collecting diagnostics on the listening RPC socket 0.0.0.0:35201 every 8 connection(s)
/data0/somelongdirectorytoavoidrpathissues/src/kudu/src/kudu/rpc/rpc-test.cc:270: Failure
Failed
Bad status: Runtime error: could not verify certificate chain (error with cert: subject=CN = localhost, ST = sadfjas, C = AS, emailAddress = sdflkdsajf, O = lskdfjlsad, OU = sldfkja, issuer=C = AS, ST = ASDfkjdhf, L = lskdjf, O = saldfja, OU = skdjf, CN = localhost, emailAddress = sadjflkadsj): : certificate has expired
Google Test trace:
/data0/somelongdirectorytoavoidrpathissues/src/kudu/src/kudu/rpc/rpc-test.cc:267: Connecting to 0.0.0.0:35201
I20260927 10:41:44.993232   772 test_util.cc:175] -----------------------------------------------
I20260927 10:41:44.993297   772 test_util.cc:176] Had fatal failures, leaving test files at /tmp/dist-test-taskiy5xIh/test-tmp/rpc-test.5.Parameters_TestRpc.TestCallWithChainCertAndChainCA_SSL_TCP.1790505704904692-772-0
[  FAILED  ] Parameters/TestRpc.TestCallWithChainCertAndChainCA/SSL_TCP, where GetParam() = (true, false) (20 ms)
[ RUN      ] Parameters/TestRpc.TestCallWithPasswordProtectedKey/SSL_TCP
I20260927 10:41:45.007759   834 acceptor_pool.cc:254] collecting diagnostics on the listening RPC socket 0.0.0.0:34633 every 8 connection(s)
I20260927 10:41:45.007753   833 acceptor_pool.cc:254] collecting diagnostics on the listening RPC socket 0.0.0.0:34633 every 8 connection(s)
[       OK ] Parameters/TestRpc.TestCallWithPasswordProtectedKey/SSL_TCP (29 ms)
[ RUN      ] Parameters/TestRpc.TestCallToBadServer/SSL_TCP
I20260927 10:41:45.040364   772 rpc-test.cc:394] Status: Network error: Client connection negotiation failed: client connection to 0.0.0.0:0: connect: Connection refused (error 111)
I20260927 10:41:45.040807   772 rpc-test.cc:394] Status: Network error: Client connection negotiation failed: client connection to 0.0.0.0:0: connect: Connection refused (error 111)
I20260927 10:41:45.041143   772 rpc-test.cc:394] Status: Network error: Client connection negotiation failed: client connection to 0.0.0.0:0: connect: Connection refused (error 111)
I20260927 10:41:45.041482   772 rpc-test.cc:394] Status: Network error: Client connection negotiation failed: client connection to 0.0.0.0:0: connect: Connection refused (error 111)
I20260927 10:41:45.041900   772 rpc-test.cc:394] Status: Network error: Client connection negotiation failed: client connection to 0.0.0.0:0: connect: Connection refused (error 111)
[       OK ] Parameters/TestRpc.TestCallToBadServer/SSL_TCP (19 ms)
[ RUN      ] Parameters/TestRpc.TestWrongService/SSL_TCP
I20260927 10:41:45.061115   868 acceptor_pool.cc:254] collecting diagnostics on the listening RPC socket 0.0.0.0:36487 every 8 connection(s)
I20260927 10:41:45.061134   869 acceptor_pool.cc:254] collecting diagnostics on the listening RPC socket 0.0.0.0:36487 every 8 connection(s)
I20260927 10:41:45.100937   866 messenger.cc:345] service WrongServiceName not registered on TestServer
[       OK ] Parameters/TestRpc.TestWrongService/SSL_TCP (60 ms)
[ RUN      ] Parameters/TestRpc.TestConnectionKeepalive/SSL_TCP
I20260927 10:41:45.119639   891 acceptor_pool.cc:254] collecting diagnostics on the listening RPC socket 0.0.0.0:33847 every 8 connection(s)
I20260927 10:41:45.119659   892 acceptor_pool.cc:254] collecting diagnostics on the listening RPC socket 0.0.0.0:33847 every 8 connection(s)
I20260927 10:41:45.119886   772 rpc-test.cc:488] Connecting to 0.0.0.0:33847
[       OK ] Parameters/TestRpc.TestConnectionKeepalive/SSL_TCP (1067 ms)
[ RUN      ] Parameters/TestRpc.TestClientConnectionMetrics/SSL_TCP
I20260927 10:41:46.179106   916 acceptor_pool.cc:254] collecting diagnostics on the listening RPC socket 0.0.0.0:45497 every 8 connection(s)
I20260927 10:41:46.179173   917 acceptor_pool.cc:254] collecting diagnostics on the listening RPC socket 0.0.0.0:45497 every 8 connection(s)
I20260927 10:41:46.179383   772 rpc-test.cc:569] Connecting to 0.0.0.0:45497
[       OK ] Parameters/TestRpc.TestClientConnectionMetrics/SSL_TCP (13822 ms)
[ RUN      ] Parameters/TestRpc.TestCredentialsPolicy/SSL_TCP
I20260927 10:42:00.005674   939 acceptor_pool.cc:254] collecting diagnostics on the listening RPC socket 0.0.0.0:38195 every 8 connection(s)
I20260927 10:42:00.005720   940 acceptor_pool.cc:254] collecting diagnostics on the listening RPC socket 0.0.0.0:38195 every 8 connection(s)
I20260927 10:42:00.005980   772 rpc-test.cc:700] Connecting to 0.0.0.0:38195
[       OK ] Parameters/TestRpc.TestCredentialsPolicy/SSL_TCP (44 ms)
[ RUN      ] Parameters/TestRpc.TestCallLongerThanKeepalive/SSL_TCP
I20260927 10:42:00.049226   964 acceptor_pool.cc:254] collecting diagnostics on the listening RPC socket 0.0.0.0:38377 every 8 connection(s)
I20260927 10:42:00.049240   965 acceptor_pool.cc:254] collecting diagnostics on the listening RPC socket 0.0.0.0:38377 every 8 connection(s)
I20260927 10:42:00.079823   966 rpc-test-base.h:222] got call: sleep_micros: 3000000 deferred: true
I20260927 10:42:03.080792   966 rpcz_store.cc:275] Call kudu.rpc.GenericCalculatorService.Sleep from 127.0.0.1:35668 (request call id 0) took 3001 ms. Trace:
I20260927 10:42:03.080963   966 rpcz_store.cc:276] 0927 10:42:00.079732 (+     0us) service_pool.cc:170] Inserting onto call queue
0927 10:42:00.079796 (+    64us) service_pool.cc:227] Handling call
0927 10:42:03.080763 (+3000967us) inbound_call.cc:173] Queueing success response
Metrics: {}
[       OK ] Parameters/TestRpc.TestCallLongerThanKeepalive/SSL_TCP (3046 ms)
[ RUN      ] Parameters/TestRpc.TestRpcSidecar/SSL_TCP
I20260927 10:42:03.115331   989 acceptor_pool.cc:254] collecting diagnostics on the listening RPC socket 0.0.0.0:44271 every 8 connection(s)
I20260927 10:42:03.115491   990 acceptor_pool.cc:254] collecting diagnostics on the listening RPC socket 0.0.0.0:44271 every 8 connection(s)
[       OK ] Parameters/TestRpc.TestRpcSidecar/SSL_TCP (102 ms)
[ RUN      ] Parameters/TestRpc.TestRpcSidecarLimits/SSL_TCP
I20260927 10:42:05.043401  1014 acceptor_pool.cc:254] collecting diagnostics on the listening RPC socket 0.0.0.0:46503 every 8 connection(s)
I20260927 10:42:05.043428  1015 acceptor_pool.cc:254] collecting diagnostics on the listening RPC socket 0.0.0.0:46503 every 8 connection(s)
W20260927 10:42:05.060251   772 serialization.cc:72] Serialized kudu.rpc_test.PushStringsRequestPB (2147483654 bytes) is larger than the maximum configured RPC message size (52428800 bytes). Sending anyway, but peer may reject the data.
W20260927 10:42:05.065237  1013 connection.cc:535] server connection from 127.0.0.1:52592 recv error: Network error: RPC frame had a length of 2147483714, but we only support messages up to 52428800 bytes long.
W20260927 10:42:05.065325  1013 connection.cc:158] shutting down server connection from 127.0.0.1:52592 with pending inbound data: 4/2147483714 bytes received; last active 0 ns ago: status Network error: RPC frame had a length of 2147483714, but we only support messages up to 52428800 bytes long.
W20260927 10:42:05.065620  1027 connection.cc:196] Error closing socket: Network error: TlsSocket::Close: Connection reset by peer
I20260927 10:42:05.072253  1039 acceptor_pool.cc:254] collecting diagnostics on the listening RPC socket 0.0.0.0:34903 every 8 connection(s)
I20260927 10:42:05.072273  1040 acceptor_pool.cc:254] collecting diagnostics on the listening RPC socket 0.0.0.0:34903 every 8 connection(s)
W20260927 10:42:09.398665  1036 connection.cc:577] server connection from 127.0.0.1:53592: received bad data: 'Corruption: Invalid packet: message had a length of 2147483710, but we only support messages up to 2147483647 bytes
'
[       OK ] Parameters/TestRpc.TestRpcSidecarLimits/SSL_TCP (6214 ms)
[ RUN      ] Parameters/TestRpc.TestCallTimeoutDoesntAffectNegotiation/SSL_TCP
I20260927 10:42:09.417814  1064 acceptor_pool.cc:254] collecting diagnostics on the listening RPC socket 0.0.0.0:33379 every 8 connection(s)
I20260927 10:42:09.417841  1065 acceptor_pool.cc:254] collecting diagnostics on the listening RPC socket 0.0.0.0:33379 every 8 connection(s)
W20260927 10:42:09.431113  1060 negotiation.cc:266] Injecting 500ms delay in negotiation
I20260927 10:42:09.481547   772 rpc-test-base.h:595] status: Timed out: connection negotiation to 0.0.0.0:33379 for RPC Sleep timed out after 0.050s (ON_OUTBOUND_QUEUE), seconds elapsed: 0.0509115
[       OK ] Parameters/TestRpc.TestCallTimeoutDoesntAffectNegotiation/SSL_TCP (536 ms)
[ RUN      ] Parameters/TestRpc.TestRpcHandlerLatencyMetric/SSL_TCP
I20260927 10:42:09.954101  1090 acceptor_pool.cc:254] collecting diagnostics on the listening RPC socket 0.0.0.0:42005 every 8 connection(s)
I20260927 10:42:09.954231  1089 acceptor_pool.cc:254] collecting diagnostics on the listening RPC socket 0.0.0.0:42005 every 8 connection(s)
I20260927 10:42:09.992611   772 rpc-test.cc:1236] Sleep() min lat: 20524
I20260927 10:42:09.992707   772 rpc-test.cc:1237] Sleep() mean lat: 20524
I20260927 10:42:09.992740   772 rpc-test.cc:1238] Sleep() max lat: 20524
I20260927 10:42:09.992753   772 rpc-test.cc:1239] Sleep() #calls: 1
[       OK ] Parameters/TestRpc.TestRpcHandlerLatencyMetric/SSL_TCP (56 ms)
[ RUN      ] Parameters/TestRpc.TimedOutOnResponseMetricServiceQueue/SSL_TCP
I20260927 10:42:10.015504  1115 acceptor_pool.cc:254] collecting diagnostics on the listening RPC socket 0.0.0.0:45427 every 8 connection(s)
I20260927 10:42:10.015506  1116 acceptor_pool.cc:254] collecting diagnostics on the listening RPC socket 0.0.0.0:45427 every 8 connection(s)
W20260927 10:42:10.072551  1117 rpcz_store.cc:267] Call kudu.rpc_test.CalculatorService.Sleep from 127.0.0.1:46256 (request call id 2) took 20 ms (client timeout 20 ms). Trace:
W20260927 10:42:10.072697  1117 rpcz_store.cc:269] 0927 10:42:10.052035 (+     0us) service_pool.cc:170] Inserting onto call queue
0927 10:42:10.072487 (+ 20452us) service_pool.cc:214] Skipping call since client already timed out
0927 10:42:10.072526 (+    39us) inbound_call.cc:173] Queueing failure response
Metrics: {}
[       OK ] Parameters/TestRpc.TimedOutOnResponseMetricServiceQueue/SSL_TCP (79 ms)
[ RUN      ] Parameters/TestRpc.RpcPendingConnectionsMetric/SSL_TCP
I20260927 10:42:10.082257  1138 acceptor_pool.cc:254] collecting diagnostics on the listening RPC socket 0.0.0.0:40571 every 8 connection(s)
I20260927 10:42:10.082360  1139 acceptor_pool.cc:254] collecting diagnostics on the listening RPC socket 0.0.0.0:40571 every 8 connection(s)
W20260927 10:42:10.094045  1134 negotiation.cc:337] Failed RPC negotiation. Trace:
0927 10:42:10.093345 (+     0us) reactor.cc:625] Submitting negotiation task for server connection from 127.0.0.1:55108 (local address 127.0.0.1:40571)
0927 10:42:10.093519 (+   174us) server_negotiation.cc:206] Beginning negotiation
0927 10:42:10.093523 (+     4us) server_negotiation.cc:399] Waiting for connection header
0927 10:42:10.093654 (+   131us) negotiation.cc:327] Negotiation complete: Network error: Server connection negotiation failed: server connection from 127.0.0.1:55108: BlockingRecv error: recv got EOF from 127.0.0.1:55108 (error 108)
Metrics: {"server-negotiator.queue_time_us":71}
[       OK ] Parameters/TestRpc.RpcPendingConnectionsMetric/SSL_TCP (30 ms)
[ RUN      ] Parameters/TestRpc.TestRpcContextClientDeadline/SSL_TCP
I20260927 10:42:10.123004  1155 acceptor_pool.cc:254] collecting diagnostics on the listening RPC socket 0.0.0.0:35125 every 8 connection(s)
I20260927 10:42:10.123000  1154 acceptor_pool.cc:254] collecting diagnostics on the listening RPC socket 0.0.0.0:35125 every 8 connection(s)
[       OK ] Parameters/TestRpc.TestRpcContextClientDeadline/SSL_TCP (57 ms)
[ RUN      ] Parameters/TestRpc.TestApplicationFeatureFlagUnsupportedServer/SSL_TCP
I20260927 10:42:10.174840  1179 acceptor_pool.cc:254] collecting diagnostics on the listening RPC socket 0.0.0.0:39981 every 8 connection(s)
I20260927 10:42:10.174850  1180 acceptor_pool.cc:254] collecting diagnostics on the listening RPC socket 0.0.0.0:39981 every 8 connection(s)
[       OK ] Parameters/TestRpc.TestApplicationFeatureFlagUnsupportedServer/SSL_TCP (30 ms)
[ RUN      ] Parameters/TestRpc.TestCancellationAsync/SSL_TCP
I20260927 10:42:10.203084  1204 acceptor_pool.cc:254] collecting diagnostics on the listening RPC socket 0.0.0.0:32951 every 8 connection(s)
I20260927 10:42:10.203111  1205 acceptor_pool.cc:254] collecting diagnostics on the listening RPC socket 0.0.0.0:32951 every 8 connection(s)
I20260927 10:42:10.203398   772 rpc-test.cc:1716] Connecting to 0.0.0.0:32951
I20260927 10:42:10.209695   772 test_util.cc:268] Using random seed: -1710983269
I20260927 10:42:10.236404  1208 rpc-test-base.h:240] got call: sleep_micros: 500 pattern: 4294967295 num_repetitions: 2097152 sidecar_idx: 0
I20260927 10:42:10.257638  1207 rpc-test-base.h:240] got call: sleep_micros: 500 pattern: 4294967295 num_repetitions: 2097152 sidecar_idx: 0
I20260927 10:42:10.276280  1208 rpc-test-base.h:240] got call: sleep_micros: 500 pattern: 4294967295 num_repetitions: 2097152 sidecar_idx: 0
I20260927 10:42:10.296063  1207 rpc-test-base.h:240] got call: sleep_micros: 500 pattern: 4294967295 num_repetitions: 2097152 sidecar_idx: 0
I20260927 10:42:10.321252  1208 rpc-test-base.h:240] got call: sleep_micros: 500 pattern: 4294967295 num_repetitions: 2097152 sidecar_idx: 0
I20260927 10:42:10.342970  1207 rpc-test-base.h:240] got call: sleep_micros: 500 pattern: 4294967295 num_repetitions: 2097152 sidecar_idx: 0
I20260927 10:42:10.364353  1208 rpc-test-base.h:240] got call: sleep_micros: 500 pattern: 4294967295 num_repetitions: 2097152 sidecar_idx: 0
I20260927 10:42:10.386770  1207 rpc-test-base.h:240] got call: sleep_micros: 500 pattern: 4294967295 num_repetitions: 2097152 sidecar_idx: 0
W20260927 10:42:10.391161  1202 connection.cc:441] server connection from 127.0.0.1:35066 torn down before Call kudu.rpc.GenericCalculatorService.SleepWithSidecar from 127.0.0.1:35066 (request call id 8) could send its response
W20260927 10:42:10.405189  1202 connection.cc:441] server connection from 127.0.0.1:35066 torn down before Call kudu.rpc.GenericCalculatorService.SleepWithSidecar from 127.0.0.1:35066 (request call id 9) could send its response
[       OK ] Parameters/TestRpc.TestCancellationAsync/SSL_TCP (213 ms)
[ RUN      ] Parameters/TestRpc.TestPerformanceBySocketType/SSL_TCP
I20260927 10:42:10.429940  1229 acceptor_pool.cc:254] collecting diagnostics on the listening RPC socket 0.0.0.0:34583 every 8 connection(s)
I20260927 10:42:10.429940  1230 acceptor_pool.cc:254] collecting diagnostics on the listening RPC socket 0.0.0.0:34583 every 8 connection(s)
I20260927 10:42:10.430238   772 rpc-test.cc:1846] Connecting to 0.0.0.0:34583
I20260927 10:42:12.702888   772 rpc-test.cc:1859] Sending 1024MB via ssl-enabled tcp socket: real 2.256s	user 2.462s	sys 1.494s
I20260927 10:42:14.901846   772 rpc-test.cc:1859] Sending 1024MB via ssl-enabled tcp socket: real 2.199s	user 2.365s	sys 1.475s
I20260927 10:42:17.072075   772 rpc-test.cc:1859] Sending 1024MB via ssl-enabled tcp socket: real 2.170s	user 2.329s	sys 1.485s
I20260927 10:42:19.190222   772 rpc-test.cc:1859] Sending 1024MB via ssl-enabled tcp socket: real 2.118s	user 2.232s	sys 1.459s
I20260927 10:42:21.316370   772 rpc-test.cc:1859] Sending 1024MB via ssl-enabled tcp socket: real 2.126s	user 2.306s	sys 1.414s
[       OK ] Parameters/TestRpc.TestPerformanceBySocketType/SSL_TCP (10911 ms)
[----------] 20 tests from Parameters/TestRpc (36407 ms total)

[----------] 1 test from Parameters/TestRpcSocketTxRxQueue
[ RUN      ] Parameters/TestRpcSocketTxRxQueue.OverCapacity/0
W20260927 10:42:21.587486  1282 negotiation.cc:337] Failed RPC negotiation. Trace:
0927 10:42:21.325451 (+     0us) reactor.cc:625] Submitting negotiation task for client connection to 0.0.0.0:35357 (local address 127.0.0.1:36976)
0927 10:42:21.325545 (+    94us) negotiation.cc:107] Waiting for socket to connect
0927 10:42:21.325555 (+    10us) client_negotiation.cc:174] Beginning negotiation
0927 10:42:21.325625 (+    70us) client_negotiation.cc:252] Sending NEGOTIATE NegotiatePB request
0927 10:42:21.587279 (+261654us) negotiation.cc:327] Negotiation complete: Network error: Client connection negotiation failed: client connection to 0.0.0.0:35357: BlockingRecv error: recv error from unknown peer: Transport endpoint is not connected (error 107)
Metrics: {"client-negotiator.queue_time_us":40}
W20260927 10:42:21.587489  1264 negotiation.cc:337] Failed RPC negotiation. Trace:
0927 10:42:21.323081 (+     0us) reactor.cc:625] Submitting negotiation task for client connection to 0.0.0.0:35357 (local address 127.0.0.1:36964)
0927 10:42:21.323215 (+   134us) negotiation.cc:107] Waiting for socket to connect
0927 10:42:21.323228 (+    13us) client_negotiation.cc:174] Beginning negotiation
0927 10:42:21.323319 (+    91us) client_negotiation.cc:252] Sending NEGOTIATE NegotiatePB request
0927 10:42:21.587285 (+263966us) negotiation.cc:327] Negotiation complete: Network error: Client connection negotiation failed: client connection to 0.0.0.0:35357: BlockingRecv error: recv error from unknown peer: Transport endpoint is not connected (error 107)
Metrics: {"client-negotiator.queue_time_us":54}
W20260927 10:42:21.587631  1291 negotiation.cc:337] Failed RPC negotiation. Trace:
0927 10:42:21.326612 (+     0us) reactor.cc:625] Submitting negotiation task for client connection to 0.0.0.0:35357 (local address 127.0.0.1:36988)
0927 10:42:21.326695 (+    83us) negotiation.cc:107] Waiting for socket to connect
0927 10:42:21.326704 (+     9us) client_negotiation.cc:174] Beginning negotiation
0927 10:42:21.326762 (+    58us) client_negotiation.cc:252] Sending NEGOTIATE NegotiatePB request
0927 10:42:21.587578 (+260816us) negotiation.cc:327] Negotiation complete: Network error: Client connection negotiation failed: client connection to 0.0.0.0:35357: BlockingRecv error: recv error from unknown peer: Transport endpoint is not connected (error 107)
Metrics: {"client-negotiator.queue_time_us":28}
W20260927 10:42:21.587492  1255 negotiation.cc:337] Failed RPC negotiation. Trace:
0927 10:42:21.321858 (+     0us) reactor.cc:625] Submitting negotiation task for client connection to 0.0.0.0:35357 (local address 127.0.0.1:36960)
0927 10:42:21.322046 (+   188us) negotiation.cc:107] Waiting for socket to connect
0927 10:42:21.322060 (+    14us) client_negotiation.cc:174] Beginning negotiation
0927 10:42:21.322156 (+    96us) client_negotiation.cc:252] Sending NEGOTIATE NegotiatePB request
0927 10:42:21.587285 (+265129us) negotiation.cc:327] Negotiation complete: Network error: Client connection negotiation failed: client connection to 0.0.0.0:35357: BlockingRecv error: recv error from unknown peer: Transport endpoint is not connected (error 107)
Metrics: {"client-negotiator.queue_time_us":103}
W20260927 10:42:21.587514  1273 negotiation.cc:337] Failed RPC negotiation. Trace:
0927 10:42:21.324314 (+     0us) reactor.cc:625] Submitting negotiation task for client connection to 0.0.0.0:35357 (local address 127.0.0.1:36970)
0927 10:42:21.324415 (+   101us) negotiation.cc:107] Waiting for socket to connect
0927 10:42:21.324426 (+    11us) client_negotiation.cc:174] Beginning negotiation
0927 10:42:21.324501 (+    75us) client_negotiation.cc:252] Sending NEGOTIATE NegotiatePB request
0927 10:42:21.587352 (+262851us) negotiation.cc:327] Negotiation complete: Network error: Client connection negotiation failed: client connection to 0.0.0.0:35357: BlockingRecv error: recv error from unknown peer: Transport endpoint is not connected (error 107)
Metrics: {"client-negotiator.queue_time_us":43}
W20260927 10:42:21.587909  1245 negotiation.cc:337] Failed RPC negotiation. Trace:
0927 10:42:21.320670 (+     0us) reactor.cc:625] Submitting negotiation task for client connection to 0.0.0.0:35357 (local address 127.0.0.1:36956)
0927 10:42:21.320751 (+    81us) negotiation.cc:107] Waiting for socket to connect
0927 10:42:21.320762 (+    11us) client_negotiation.cc:174] Beginning negotiation
0927 10:42:21.320857 (+    95us) client_negotiation.cc:252] Sending NEGOTIATE NegotiatePB request
0927 10:42:21.587279 (+266422us) negotiation.cc:327] Negotiation complete: Network error: Client connection negotiation failed: client connection to 0.0.0.0:35357: BlockingRecv error: recv error from unknown peer: Transport endpoint is not connected (error 107)
Metrics: {"client-negotiator.queue_time_us":23}
[       OK ] Parameters/TestRpcSocketTxRxQueue.OverCapacity/0 (1047 ms)
[----------] 1 test from Parameters/TestRpcSocketTxRxQueue (1047 ms total)

[----------] Global test environment tear-down
[==========] 21 tests from 2 test suites ran. (37454 ms total)
[  PASSED  ] 20 tests.
[  FAILED  ] 1 test, listed below:
[  FAILED  ] Parameters/TestRpc.TestCallWithChainCertAndChainCA/SSL_TCP, where GetParam() = (true, false)

 1 FAILED TEST