Diagnosed failure
Parameters/TestRpc.TestCallWithChainCertAndChainCA/SSL_UnixSocket: /data0/somelongdirectorytoavoidrpathissues/src/kudu/src/kudu/rpc/rpc-test.cc:270: Failure
Failed
Bad status: Runtime error: could not verify certificate chain (error with cert: subject=CN = localhost, ST = sadfjas, C = AS, emailAddress = sdflkdsajf, O = lskdfjlsad, OU = sldfkja, issuer=C = AS, ST = ASDfkjdhf, L = lskdjf, O = saldfja, OU = skdjf, CN = localhost, emailAddress = sadjflkadsj): : certificate has expired
Google Test trace:
/data0/somelongdirectorytoavoidrpathissues/src/kudu/src/kudu/rpc/rpc-test.cc:267: Connecting to unix:/tmp/dist-test-taskINwiO_/test-tmp/rpc-test-23081d900a9e4362873f7aa4b5602880.sock
I20260926 17:59:45.267870 383 test_util.cc:175] -----------------------------------------------
I20260926 17:59:45.267922 383 test_util.cc:176] Had fatal failures, leaving test files at /tmp/dist-test-taskINwiO_/test-tmp/rpc-test.6.Parameters_TestRpc.TestCallWithChainCertAndChainCA_SSL_UnixSocket.1790445585206366-383-0
Full log
Note: This is test shard 7 of 8.
[==========] Running 21 tests from 2 test suites.
[----------] Global test environment set-up.
[----------] 20 tests from Parameters/TestRpc
[ RUN ] Parameters/TestRpc.TestMessengerCreateDestroy/SSL_UnixSocket
WARNING: Logging before InitGoogleLogging() is written to STDERR
I20260926 17:59:45.229218 383 rpc-test.cc:169] started messenger TestCreateDestroy
[ OK ] Parameters/TestRpc.TestMessengerCreateDestroy/SSL_UnixSocket (21 ms)
[ RUN ] Parameters/TestRpc.TestNegotiationDeadlock/SSL_UnixSocket
I20260926 17:59:45.249612 403 acceptor_pool.cc:254] collecting diagnostics on the listening RPC socket unix:/tmp/dist-test-taskINwiO_/test-tmp/rpc-test-aa6e0786a7914f1eb75e34edd4f6c831.sock every 8 connection(s)
I20260926 17:59:45.249946 404 acceptor_pool.cc:254] collecting diagnostics on the listening RPC socket unix:/tmp/dist-test-taskINwiO_/test-tmp/rpc-test-aa6e0786a7914f1eb75e34edd4f6c831.sock every 8 connection(s)
[ OK ] Parameters/TestRpc.TestNegotiationDeadlock/SSL_UnixSocket (26 ms)
[ RUN ] Parameters/TestRpc.TestCallWithChainCertAndChainCA/SSL_UnixSocket
I20260926 17:59:45.263734 419 acceptor_pool.cc:254] collecting diagnostics on the listening RPC socket unix:/tmp/dist-test-taskINwiO_/test-tmp/rpc-test-23081d900a9e4362873f7aa4b5602880.sock every 8 connection(s)
I20260926 17:59:45.263782 420 acceptor_pool.cc:254] collecting diagnostics on the listening RPC socket unix:/tmp/dist-test-taskINwiO_/test-tmp/rpc-test-23081d900a9e4362873f7aa4b5602880.sock every 8 connection(s)
/data0/somelongdirectorytoavoidrpathissues/src/kudu/src/kudu/rpc/rpc-test.cc:270: Failure
Failed
Bad status: Runtime error: could not verify certificate chain (error with cert: subject=CN = localhost, ST = sadfjas, C = AS, emailAddress = sdflkdsajf, O = lskdfjlsad, OU = sldfkja, issuer=C = AS, ST = ASDfkjdhf, L = lskdjf, O = saldfja, OU = skdjf, CN = localhost, emailAddress = sadjflkadsj): : certificate has expired
Google Test trace:
/data0/somelongdirectorytoavoidrpathissues/src/kudu/src/kudu/rpc/rpc-test.cc:267: Connecting to unix:/tmp/dist-test-taskINwiO_/test-tmp/rpc-test-23081d900a9e4362873f7aa4b5602880.sock
I20260926 17:59:45.267870 383 test_util.cc:175] -----------------------------------------------
I20260926 17:59:45.267922 383 test_util.cc:176] Had fatal failures, leaving test files at /tmp/dist-test-taskINwiO_/test-tmp/rpc-test.6.Parameters_TestRpc.TestCallWithChainCertAndChainCA_SSL_UnixSocket.1790445585206366-383-0
[ FAILED ] Parameters/TestRpc.TestCallWithChainCertAndChainCA/SSL_UnixSocket, where GetParam() = (true, true) (11 ms)
[ RUN ] Parameters/TestRpc.TestCallWithPasswordProtectedKey/SSL_UnixSocket
I20260926 17:59:45.276216 444 acceptor_pool.cc:254] collecting diagnostics on the listening RPC socket unix:/tmp/dist-test-taskINwiO_/test-tmp/rpc-test-8f37dcf5c39149ab9a0b68315b3b0070.sock every 8 connection(s)
I20260926 17:59:45.276216 445 acceptor_pool.cc:254] collecting diagnostics on the listening RPC socket unix:/tmp/dist-test-taskINwiO_/test-tmp/rpc-test-8f37dcf5c39149ab9a0b68315b3b0070.sock every 8 connection(s)
[ OK ] Parameters/TestRpc.TestCallWithPasswordProtectedKey/SSL_UnixSocket (22 ms)
[ RUN ] Parameters/TestRpc.TestCallToBadServer/SSL_UnixSocket
I20260926 17:59:45.296831 383 rpc-test.cc:394] Status: Network error: Client connection negotiation failed: client connection to 0.0.0.0:0: connect: Connection refused (error 111)
I20260926 17:59:45.297117 383 rpc-test.cc:394] Status: Network error: Client connection negotiation failed: client connection to 0.0.0.0:0: connect: Connection refused (error 111)
I20260926 17:59:45.297338 383 rpc-test.cc:394] Status: Network error: Client connection negotiation failed: client connection to 0.0.0.0:0: connect: Connection refused (error 111)
I20260926 17:59:45.297514 383 rpc-test.cc:394] Status: Network error: Client connection negotiation failed: client connection to 0.0.0.0:0: connect: Connection refused (error 111)
I20260926 17:59:45.297698 383 rpc-test.cc:394] Status: Network error: Client connection negotiation failed: client connection to 0.0.0.0:0: connect: Connection refused (error 111)
[ OK ] Parameters/TestRpc.TestCallToBadServer/SSL_UnixSocket (7 ms)
[ RUN ] Parameters/TestRpc.TestWrongService/SSL_UnixSocket
I20260926 17:59:45.305375 479 acceptor_pool.cc:254] collecting diagnostics on the listening RPC socket unix:/tmp/dist-test-taskINwiO_/test-tmp/rpc-test-2e1f8b225546497089d1746825254390.sock every 8 connection(s)
I20260926 17:59:45.305410 480 acceptor_pool.cc:254] collecting diagnostics on the listening RPC socket unix:/tmp/dist-test-taskINwiO_/test-tmp/rpc-test-2e1f8b225546497089d1746825254390.sock every 8 connection(s)
I20260926 17:59:45.324087 476 messenger.cc:345] service WrongServiceName not registered on TestServer
W20260926 17:59:45.324869 476 connection.cc:196] Error closing socket: Network error: TlsSocket::Close: Broken pipe
[ OK ] Parameters/TestRpc.TestWrongService/SSL_UnixSocket (27 ms)
[ RUN ] Parameters/TestRpc.TestConnectionKeepalive/SSL_UnixSocket
I20260926 17:59:45.340939 502 acceptor_pool.cc:254] collecting diagnostics on the listening RPC socket unix:/tmp/dist-test-taskINwiO_/test-tmp/rpc-test-e828a3200ab04e2ba6d9aa465ff03a61.sock every 8 connection(s)
I20260926 17:59:45.340981 503 acceptor_pool.cc:254] collecting diagnostics on the listening RPC socket unix:/tmp/dist-test-taskINwiO_/test-tmp/rpc-test-e828a3200ab04e2ba6d9aa465ff03a61.sock every 8 connection(s)
I20260926 17:59:45.341220 383 rpc-test.cc:488] Connecting to unix:/tmp/dist-test-taskINwiO_/test-tmp/rpc-test-e828a3200ab04e2ba6d9aa465ff03a61.sock
W20260926 17:59:45.828325 515 connection.cc:196] Error closing socket: Network error: TlsSocket::Close: Broken pipe
[ OK ] Parameters/TestRpc.TestConnectionKeepalive/SSL_UnixSocket (1031 ms)
[ RUN ] Parameters/TestRpc.TestClientConnectionMetrics/SSL_UnixSocket
I20260926 17:59:46.364771 527 acceptor_pool.cc:254] collecting diagnostics on the listening RPC socket unix:/tmp/dist-test-taskINwiO_/test-tmp/rpc-test-967a4938f9a847849c99b7c6ef31e1aa.sock every 8 connection(s)
I20260926 17:59:46.364890 528 acceptor_pool.cc:254] collecting diagnostics on the listening RPC socket unix:/tmp/dist-test-taskINwiO_/test-tmp/rpc-test-967a4938f9a847849c99b7c6ef31e1aa.sock every 8 connection(s)
I20260926 17:59:46.365015 383 rpc-test.cc:569] Connecting to unix:/tmp/dist-test-taskINwiO_/test-tmp/rpc-test-967a4938f9a847849c99b7c6ef31e1aa.sock
W20260926 17:59:54.945331 524 connection.cc:196] Error closing socket: Network error: TlsSocket::Close: Broken pipe
[ OK ] Parameters/TestRpc.TestClientConnectionMetrics/SSL_UnixSocket (8588 ms)
[ RUN ] Parameters/TestRpc.TestCredentialsPolicy/SSL_UnixSocket
I20260926 17:59:54.957262 550 acceptor_pool.cc:254] collecting diagnostics on the listening RPC socket unix:/tmp/dist-test-taskINwiO_/test-tmp/rpc-test-7c36b283e55e46a584b87961bc286389.sock every 8 connection(s)
I20260926 17:59:54.957324 551 acceptor_pool.cc:254] collecting diagnostics on the listening RPC socket unix:/tmp/dist-test-taskINwiO_/test-tmp/rpc-test-7c36b283e55e46a584b87961bc286389.sock every 8 connection(s)
I20260926 17:59:54.957484 383 rpc-test.cc:700] Connecting to unix:/tmp/dist-test-taskINwiO_/test-tmp/rpc-test-7c36b283e55e46a584b87961bc286389.sock
W20260926 17:59:54.977274 549 connection.cc:196] Error closing socket: Network error: TlsSocket::Close: Broken pipe
[ OK ] Parameters/TestRpc.TestCredentialsPolicy/SSL_UnixSocket (34 ms)
[ RUN ] Parameters/TestRpc.TestCallLongerThanKeepalive/SSL_UnixSocket
I20260926 17:59:54.991073 575 acceptor_pool.cc:254] collecting diagnostics on the listening RPC socket unix:/tmp/dist-test-taskINwiO_/test-tmp/rpc-test-e0cea0f36f92431dacca11be9f03809f.sock every 8 connection(s)
I20260926 17:59:54.991103 576 acceptor_pool.cc:254] collecting diagnostics on the listening RPC socket unix:/tmp/dist-test-taskINwiO_/test-tmp/rpc-test-e0cea0f36f92431dacca11be9f03809f.sock every 8 connection(s)
I20260926 17:59:55.002789 577 rpc-test-base.h:222] got call: sleep_micros: 3000000 deferred: true
I20260926 17:59:58.003458 577 rpcz_store.cc:275] Call kudu.rpc.GenericCalculatorService.Sleep from unix:<unnamed> (request call id 0) took 3000 ms. Trace:
I20260926 17:59:58.003582 577 rpcz_store.cc:276] 0926 17:59:55.002741 (+ 0us) service_pool.cc:170] Inserting onto call queue
0926 17:59:55.002775 (+ 34us) service_pool.cc:227] Handling call
0926 17:59:58.003442 (+3000667us) inbound_call.cc:173] Queueing success response
Metrics: {}
[ OK ] Parameters/TestRpc.TestCallLongerThanKeepalive/SSL_UnixSocket (3024 ms)
[ RUN ] Parameters/TestRpc.TestRpcSidecar/SSL_UnixSocket
I20260926 17:59:58.022827 600 acceptor_pool.cc:254] collecting diagnostics on the listening RPC socket unix:/tmp/dist-test-taskINwiO_/test-tmp/rpc-test-267e9e8bbf75493cbd8bdc7287fc8707.sock every 8 connection(s)
I20260926 17:59:58.022935 601 acceptor_pool.cc:254] collecting diagnostics on the listening RPC socket unix:/tmp/dist-test-taskINwiO_/test-tmp/rpc-test-267e9e8bbf75493cbd8bdc7287fc8707.sock every 8 connection(s)
W20260926 17:59:58.058492 597 connection.cc:196] Error closing socket: Network error: TlsSocket::Close: Broken pipe
[ OK ] Parameters/TestRpc.TestRpcSidecar/SSL_UnixSocket (53 ms)
[ RUN ] Parameters/TestRpc.TestRpcSidecarLimits/SSL_UnixSocket
I20260926 17:59:59.787230 625 acceptor_pool.cc:254] collecting diagnostics on the listening RPC socket unix:/tmp/dist-test-taskINwiO_/test-tmp/rpc-test-ee489c15e760413584111c0d739b60bc.sock every 8 connection(s)
I20260926 17:59:59.787263 626 acceptor_pool.cc:254] collecting diagnostics on the listening RPC socket unix:/tmp/dist-test-taskINwiO_/test-tmp/rpc-test-ee489c15e760413584111c0d739b60bc.sock every 8 connection(s)
W20260926 17:59:59.804111 383 serialization.cc:72] Serialized kudu.rpc_test.PushStringsRequestPB (2147483654 bytes) is larger than the maximum configured RPC message size (52428800 bytes). Sending anyway, but peer may reject the data.
W20260926 17:59:59.807382 622 connection.cc:535] server connection from unix:<unnamed> recv error: Network error: RPC frame had a length of 2147483714, but we only support messages up to 52428800 bytes long.
W20260926 17:59:59.807438 622 connection.cc:158] shutting down server connection from unix:<unnamed> with pending inbound data: 4/2147483714 bytes received; last active 0 ns ago: status Network error: RPC frame had a length of 2147483714, but we only support messages up to 52428800 bytes long.
W20260926 17:59:59.807551 638 connection.cc:698] client connection to unix:/tmp/dist-test-taskINwiO_/test-tmp/rpc-test-ee489c15e760413584111c0d739b60bc.sock send error: Network error: failed to write to TLS socket: Broken pipe
W20260926 17:59:59.807672 638 connection.cc:196] Error closing socket: Network error: TlsSocket::Close: Success
I20260926 17:59:59.827652 651 acceptor_pool.cc:254] collecting diagnostics on the listening RPC socket unix:/tmp/dist-test-taskINwiO_/test-tmp/rpc-test-ee489c15e760413584111c0d739b60bc.sock every 8 connection(s)
I20260926 17:59:59.827652 650 acceptor_pool.cc:254] collecting diagnostics on the listening RPC socket unix:/tmp/dist-test-taskINwiO_/test-tmp/rpc-test-ee489c15e760413584111c0d739b60bc.sock every 8 connection(s)
W20260926 18:00:04.278004 647 connection.cc:577] server connection from unix:<unnamed>: received bad data: 'Corruption: Invalid packet: message had a length of 2147483710, but we only support messages up to 2147483647 bytes
'
W20260926 18:00:04.278321 663 connection.cc:196] Error closing socket: Network error: TlsSocket::Close: Broken pipe
[ OK ] Parameters/TestRpc.TestRpcSidecarLimits/SSL_UnixSocket (6220 ms)
[ RUN ] Parameters/TestRpc.TestCallTimeoutDoesntAffectNegotiation/SSL_UnixSocket
I20260926 18:00:04.306288 675 acceptor_pool.cc:254] collecting diagnostics on the listening RPC socket unix:/tmp/dist-test-taskINwiO_/test-tmp/rpc-test-597ada86b5b247c28184a5e9aff4c041.sock every 8 connection(s)
I20260926 18:00:04.306342 676 acceptor_pool.cc:254] collecting diagnostics on the listening RPC socket unix:/tmp/dist-test-taskINwiO_/test-tmp/rpc-test-597ada86b5b247c28184a5e9aff4c041.sock every 8 connection(s)
W20260926 18:00:04.324949 670 negotiation.cc:266] Injecting 500ms delay in negotiation
I20260926 18:00:04.375209 383 rpc-test-base.h:595] status: Timed out: connection negotiation to unix:/tmp/dist-test-taskINwiO_/test-tmp/rpc-test-597ada86b5b247c28184a5e9aff4c041.sock for RPC Sleep timed out after 0.050s (ON_OUTBOUND_QUEUE), seconds elapsed: 0.0505915
[ OK ] Parameters/TestRpc.TestCallTimeoutDoesntAffectNegotiation/SSL_UnixSocket (549 ms)
[ RUN ] Parameters/TestRpc.TestRpcHandlerLatencyMetric/SSL_UnixSocket
I20260926 18:00:04.836113 700 acceptor_pool.cc:254] collecting diagnostics on the listening RPC socket unix:/tmp/dist-test-taskINwiO_/test-tmp/rpc-test-a682c4de5f2a43eea2ace5e37eeec298.sock every 8 connection(s)
I20260926 18:00:04.836196 701 acceptor_pool.cc:254] collecting diagnostics on the listening RPC socket unix:/tmp/dist-test-taskINwiO_/test-tmp/rpc-test-a682c4de5f2a43eea2ace5e37eeec298.sock every 8 connection(s)
I20260926 18:00:04.867069 383 rpc-test.cc:1236] Sleep() min lat: 20325
I20260926 18:00:04.867174 383 rpc-test.cc:1237] Sleep() mean lat: 20325
I20260926 18:00:04.867211 383 rpc-test.cc:1238] Sleep() max lat: 20325
I20260926 18:00:04.867233 383 rpc-test.cc:1239] Sleep() #calls: 1
[ OK ] Parameters/TestRpc.TestRpcHandlerLatencyMetric/SSL_UnixSocket (38 ms)
[ RUN ] Parameters/TestRpc.TimedOutOnResponseMetricServiceQueue/SSL_UnixSocket
I20260926 18:00:04.883577 727 acceptor_pool.cc:254] collecting diagnostics on the listening RPC socket unix:/tmp/dist-test-taskINwiO_/test-tmp/rpc-test-f36d3e0af424403389317421c64f3644.sock every 8 connection(s)
I20260926 18:00:04.883543 726 acceptor_pool.cc:254] collecting diagnostics on the listening RPC socket unix:/tmp/dist-test-taskINwiO_/test-tmp/rpc-test-f36d3e0af424403389317421c64f3644.sock every 8 connection(s)
W20260926 18:00:04.935444 728 rpcz_store.cc:267] Call kudu.rpc_test.CalculatorService.Sleep from unix:<unnamed> (request call id 2) took 20 ms (client timeout 20 ms). Trace:
W20260926 18:00:04.935539 728 rpcz_store.cc:269] 0926 18:00:04.915189 (+ 0us) service_pool.cc:170] Inserting onto call queue
0926 18:00:04.935421 (+ 20232us) service_pool.cc:214] Skipping call since client already timed out
0926 18:00:04.935431 (+ 10us) inbound_call.cc:173] Queueing failure response
Metrics: {}
[ OK ] Parameters/TestRpc.TimedOutOnResponseMetricServiceQueue/SSL_UnixSocket (68 ms)
[ RUN ] Parameters/TestRpc.RpcPendingConnectionsMetric/SSL_UnixSocket
I20260926 18:00:04.939045 749 acceptor_pool.cc:254] collecting diagnostics on the listening RPC socket 0.0.0.0:40513 every 8 connection(s)
I20260926 18:00:04.939121 750 acceptor_pool.cc:254] collecting diagnostics on the listening RPC socket 0.0.0.0:40513 every 8 connection(s)
W20260926 18:00:04.948238 745 negotiation.cc:337] Failed RPC negotiation. Trace:
0926 18:00:04.948031 (+ 0us) reactor.cc:625] Submitting negotiation task for server connection from 127.0.0.1:37048 (local address 127.0.0.1:40513)
0926 18:00:04.948109 (+ 78us) server_negotiation.cc:206] Beginning negotiation
0926 18:00:04.948112 (+ 3us) server_negotiation.cc:399] Waiting for connection header
0926 18:00:04.948182 (+ 70us) negotiation.cc:327] Negotiation complete: Network error: Server connection negotiation failed: server connection from 127.0.0.1:37048: BlockingRecv error: recv got EOF from 127.0.0.1:37048 (error 108)
Metrics: {"server-negotiator.queue_time_us":32}
[ OK ] Parameters/TestRpc.RpcPendingConnectionsMetric/SSL_UnixSocket (21 ms)
[ RUN ] Parameters/TestRpc.TestRpcContextClientDeadline/SSL_UnixSocket
I20260926 18:00:04.968562 765 acceptor_pool.cc:254] collecting diagnostics on the listening RPC socket unix:/tmp/dist-test-taskINwiO_/test-tmp/rpc-test-a95b22e1a61344c9b4ec5d76727feaf0.sock every 8 connection(s)
I20260926 18:00:04.968602 766 acceptor_pool.cc:254] collecting diagnostics on the listening RPC socket unix:/tmp/dist-test-taskINwiO_/test-tmp/rpc-test-a95b22e1a61344c9b4ec5d76727feaf0.sock every 8 connection(s)
W20260926 18:00:05.002696 762 connection.cc:196] Error closing socket: Network error: TlsSocket::Close: Broken pipe
[ OK ] Parameters/TestRpc.TestRpcContextClientDeadline/SSL_UnixSocket (44 ms)
[ RUN ] Parameters/TestRpc.TestApplicationFeatureFlagUnsupportedServer/SSL_UnixSocket
I20260926 18:00:05.015266 790 acceptor_pool.cc:254] collecting diagnostics on the listening RPC socket unix:/tmp/dist-test-taskINwiO_/test-tmp/rpc-test-a3106552d05944d0b8a60e0f4539aba5.sock every 8 connection(s)
I20260926 18:00:05.015295 791 acceptor_pool.cc:254] collecting diagnostics on the listening RPC socket unix:/tmp/dist-test-taskINwiO_/test-tmp/rpc-test-a3106552d05944d0b8a60e0f4539aba5.sock every 8 connection(s)
[ OK ] Parameters/TestRpc.TestApplicationFeatureFlagUnsupportedServer/SSL_UnixSocket (35 ms)
[ RUN ] Parameters/TestRpc.TestCancellationAsync/SSL_UnixSocket
I20260926 18:00:05.047245 815 acceptor_pool.cc:254] collecting diagnostics on the listening RPC socket unix:/tmp/dist-test-taskINwiO_/test-tmp/rpc-test-6867d20d090a44e59b88958d0b671957.sock every 8 connection(s)
I20260926 18:00:05.047277 816 acceptor_pool.cc:254] collecting diagnostics on the listening RPC socket unix:/tmp/dist-test-taskINwiO_/test-tmp/rpc-test-6867d20d090a44e59b88958d0b671957.sock every 8 connection(s)
I20260926 18:00:05.047444 383 rpc-test.cc:1716] Connecting to unix:/tmp/dist-test-taskINwiO_/test-tmp/rpc-test-6867d20d090a44e59b88958d0b671957.sock
I20260926 18:00:05.056061 383 test_util.cc:268] Using random seed: -1706594758
I20260926 18:00:05.071084 819 rpc-test-base.h:240] got call: sleep_micros: 500 pattern: 4294967295 num_repetitions: 2097152 sidecar_idx: 0
I20260926 18:00:05.082257 819 rpc-test-base.h:240] got call: sleep_micros: 500 pattern: 4294967295 num_repetitions: 2097152 sidecar_idx: 0
I20260926 18:00:05.093281 819 rpc-test-base.h:240] got call: sleep_micros: 500 pattern: 4294967295 num_repetitions: 2097152 sidecar_idx: 0
I20260926 18:00:05.104187 819 rpc-test-base.h:240] got call: sleep_micros: 500 pattern: 4294967295 num_repetitions: 2097152 sidecar_idx: 0
I20260926 18:00:05.115410 819 rpc-test-base.h:240] got call: sleep_micros: 500 pattern: 4294967295 num_repetitions: 2097152 sidecar_idx: 0
I20260926 18:00:05.126060 819 rpc-test-base.h:240] got call: sleep_micros: 500 pattern: 4294967295 num_repetitions: 2097152 sidecar_idx: 0
I20260926 18:00:05.136570 819 rpc-test-base.h:240] got call: sleep_micros: 500 pattern: 4294967295 num_repetitions: 2097152 sidecar_idx: 0
I20260926 18:00:05.149935 819 rpc-test-base.h:240] got call: sleep_micros: 500 pattern: 4294967295 num_repetitions: 2097152 sidecar_idx: 0
W20260926 18:00:05.151501 812 connection.cc:196] Error closing socket: Network error: TlsSocket::Close: Broken pipe
W20260926 18:00:05.152985 812 connection.cc:441] server connection from unix:<unnamed> torn down before Call kudu.rpc.GenericCalculatorService.SleepWithSidecar from unix:<unnamed> (request call id 9) could send its response
[ OK ] Parameters/TestRpc.TestCancellationAsync/SSL_UnixSocket (114 ms)
[ RUN ] Parameters/TestRpc.TestPerformanceBySocketType/SSL_UnixSocket
I20260926 18:00:05.166311 840 acceptor_pool.cc:254] collecting diagnostics on the listening RPC socket unix:/tmp/dist-test-taskINwiO_/test-tmp/rpc-test-ece91edfd3c24bea9bd163fe3c17e8a6.sock every 8 connection(s)
I20260926 18:00:05.166371 841 acceptor_pool.cc:254] collecting diagnostics on the listening RPC socket unix:/tmp/dist-test-taskINwiO_/test-tmp/rpc-test-ece91edfd3c24bea9bd163fe3c17e8a6.sock every 8 connection(s)
I20260926 18:00:05.166535 383 rpc-test.cc:1846] Connecting to unix:/tmp/dist-test-taskINwiO_/test-tmp/rpc-test-ece91edfd3c24bea9bd163fe3c17e8a6.sock
I20260926 18:00:06.512202 383 rpc-test.cc:1859] Sending 1024MB via ssl-enabled unix socket: real 1.323s user 1.508s sys 0.829s
I20260926 18:00:07.856427 383 rpc-test.cc:1859] Sending 1024MB via ssl-enabled unix socket: real 1.344s user 1.430s sys 0.962s
I20260926 18:00:09.160108 383 rpc-test.cc:1859] Sending 1024MB via ssl-enabled unix socket: real 1.304s user 1.387s sys 0.925s
I20260926 18:00:10.493417 383 rpc-test.cc:1859] Sending 1024MB via ssl-enabled unix socket: real 1.333s user 1.520s sys 0.858s
I20260926 18:00:11.833909 383 rpc-test.cc:1859] Sending 1024MB via ssl-enabled unix socket: real 1.340s user 1.437s sys 0.962s
[ OK ] Parameters/TestRpc.TestPerformanceBySocketType/SSL_UnixSocket (6681 ms)
[----------] 20 tests from Parameters/TestRpc (26626 ms total)
[----------] 1 test from Parameters/TestRpcSocketTxRxQueue
[ RUN ] Parameters/TestRpcSocketTxRxQueue.AcceptorRxQueueSizeMetric/0
I20260926 18:00:11.842003 865 acceptor_pool.cc:254] collecting diagnostics on the listening RPC socket 0.0.0.0:34933 every 1 connection(s)
I20260926 18:00:11.842057 866 acceptor_pool.cc:254] collecting diagnostics on the listening RPC socket 0.0.0.0:34933 every 1 connection(s)
W20260926 18:00:11.842695 861 negotiation.cc:337] Failed RPC negotiation. Trace:
0926 18:00:11.842504 (+ 0us) reactor.cc:625] Submitting negotiation task for server connection from 127.0.0.1:42032 (local address 127.0.0.1:34933)
0926 18:00:11.842578 (+ 74us) server_negotiation.cc:206] Beginning negotiation
0926 18:00:11.842583 (+ 5us) server_negotiation.cc:399] Waiting for connection header
0926 18:00:11.842665 (+ 82us) negotiation.cc:327] Negotiation complete: Network error: Server connection negotiation failed: server connection from 127.0.0.1:42032: BlockingRecv error: recv got EOF from 127.0.0.1:42032 (error 108)
Metrics: {"server-negotiator.queue_time_us":43}
[ OK ] Parameters/TestRpcSocketTxRxQueue.AcceptorRxQueueSizeMetric/0 (9 ms)
[----------] 1 test from Parameters/TestRpcSocketTxRxQueue (9 ms total)
[----------] Global test environment tear-down
[==========] 21 tests from 2 test suites ran. (26635 ms total)
[ PASSED ] 20 tests.
[ FAILED ] 1 test, listed below:
[ FAILED ] Parameters/TestRpc.TestCallWithChainCertAndChainCA/SSL_UnixSocket, where GetParam() = (true, true)
1 FAILED TEST