Parameters/TestRpc.TestCallWithChainCertAndRootCA/SSL_UnixSocket: /data0/somelongdirectorytoavoidrpathissues/src/kudu/src/kudu/rpc/rpc-test.cc:303: Failure
Failed
Bad status: Runtime error: could not verify certificate chain (error with cert: subject=CN = localhost, ST = sadfjas, C = AS, emailAddress = sdflkdsajf, O = lskdfjlsad, OU = sldfkja, issuer=C = AS, ST = ASDfkjdhf, L = lskdjf, O = saldfja, OU = skdjf, CN = localhost, emailAddress = sadjflkadsj): : certificate has expired
Google Test trace:
/data0/somelongdirectorytoavoidrpathissues/src/kudu/src/kudu/rpc/rpc-test.cc:300: Connecting to unix:/tmp/dist-test-task3k46RW/test-tmp/rpc-test-276d152a6dc84d6a91d7466e45677e4b.sock
I20260928 03:45:21.197000 6554 test_util.cc:175] -----------------------------------------------
I20260928 03:45:21.197201 6554 test_util.cc:176] Had fatal failures, leaving test files at /tmp/dist-test-task3k46RW/test-tmp/rpc-test.2.Parameters_TestRpc.TestCallWithChainCertAndRootCA_SSL_UnixSocket.1790567117739756-6554-0
Note: This is test shard 3 of 8.
[==========] Running 21 tests from 2 test suites.
[----------] Global test environment set-up.
[----------] 1 test from TestRpc
[ RUN ] TestRpc.TestNegotiationTimeout
WARNING: Logging before InitGoogleLogging() is written to STDERR
I20260928 03:45:17.922925 6554 rpc-test-base.h:595] status: Timed out: connection negotiation to 0.0.0.0:34165 for RPC Sleep timed out after 0.100s (ON_OUTBOUND_QUEUE), seconds elapsed: 0.101722
W20260928 03:45:20.928277 6564 negotiation.cc:337] Failed RPC negotiation. Trace:
0928 03:45:17.822073 (+ 0us) reactor.cc:625] Submitting negotiation task for client connection to 0.0.0.0:34165 (local address 127.0.0.1:48988)
0928 03:45:17.822742 (+ 669us) negotiation.cc:107] Waiting for socket to connect
0928 03:45:17.822786 (+ 44us) client_negotiation.cc:174] Beginning negotiation
0928 03:45:17.833950 (+ 11164us) client_negotiation.cc:252] Sending NEGOTIATE NegotiatePB request
0928 03:45:20.927221 (+3093271us) negotiation.cc:327] Negotiation complete: Timed out: Client connection negotiation failed: client connection to 0.0.0.0:34165: received 0 of 4 requested bytes
Metrics: {"client-negotiator.queue_time_us":203}
[ OK ] TestRpc.TestNegotiationTimeout (3144 ms)
[----------] 1 test from TestRpc (3145 ms total)
[----------] 20 tests from Parameters/TestRpc
[ RUN ] Parameters/TestRpc.TestAcceptorPoolStartStop/SSL_UnixSocket
I20260928 03:45:20.971534 6580 acceptor_pool.cc:254] collecting diagnostics on the listening RPC socket unix:/tmp/dist-test-task3k46RW/test-tmp/rpc-test-da3e69555d944a45a994f6f6c5d20392.sock every 8 connection(s)
I20260928 03:45:20.973152 6581 acceptor_pool.cc:254] collecting diagnostics on the listening RPC socket unix:/tmp/dist-test-task3k46RW/test-tmp/rpc-test-da3e69555d944a45a994f6f6c5d20392.sock every 8 connection(s)
I20260928 03:45:21.006767 6591 acceptor_pool.cc:254] collecting diagnostics on the listening RPC socket unix:/tmp/dist-test-task3k46RW/test-tmp/rpc-test-da3e69555d944a45a994f6f6c5d20392.sock every 8 connection(s)
I20260928 03:45:21.008174 6592 acceptor_pool.cc:254] collecting diagnostics on the listening RPC socket unix:/tmp/dist-test-task3k46RW/test-tmp/rpc-test-da3e69555d944a45a994f6f6c5d20392.sock every 8 connection(s)
I20260928 03:45:21.035127 6602 acceptor_pool.cc:254] collecting diagnostics on the listening RPC socket unix:/tmp/dist-test-task3k46RW/test-tmp/rpc-test-da3e69555d944a45a994f6f6c5d20392.sock every 8 connection(s)
I20260928 03:45:21.035784 6603 acceptor_pool.cc:254] collecting diagnostics on the listening RPC socket unix:/tmp/dist-test-task3k46RW/test-tmp/rpc-test-da3e69555d944a45a994f6f6c5d20392.sock every 8 connection(s)
I20260928 03:45:21.063395 6613 acceptor_pool.cc:254] collecting diagnostics on the listening RPC socket unix:/tmp/dist-test-task3k46RW/test-tmp/rpc-test-da3e69555d944a45a994f6f6c5d20392.sock every 8 connection(s)
I20260928 03:45:21.064090 6614 acceptor_pool.cc:254] collecting diagnostics on the listening RPC socket unix:/tmp/dist-test-task3k46RW/test-tmp/rpc-test-da3e69555d944a45a994f6f6c5d20392.sock every 8 connection(s)
I20260928 03:45:21.077332 6624 acceptor_pool.cc:254] collecting diagnostics on the listening RPC socket unix:/tmp/dist-test-task3k46RW/test-tmp/rpc-test-da3e69555d944a45a994f6f6c5d20392.sock every 8 connection(s)
I20260928 03:45:21.077960 6625 acceptor_pool.cc:254] collecting diagnostics on the listening RPC socket unix:/tmp/dist-test-task3k46RW/test-tmp/rpc-test-da3e69555d944a45a994f6f6c5d20392.sock every 8 connection(s)
[ OK ] Parameters/TestRpc.TestAcceptorPoolStartStop/SSL_UnixSocket (149 ms)
[ RUN ] Parameters/TestRpc.TestCall/SSL_UnixSocket
I20260928 03:45:21.096349 6637 acceptor_pool.cc:254] collecting diagnostics on the listening RPC socket unix:/tmp/dist-test-task3k46RW/test-tmp/rpc-test-3aea5528cad94457a70cab9a20184745.sock every 8 connection(s)
I20260928 03:45:21.098341 6638 acceptor_pool.cc:254] collecting diagnostics on the listening RPC socket unix:/tmp/dist-test-task3k46RW/test-tmp/rpc-test-3aea5528cad94457a70cab9a20184745.sock every 8 connection(s)
I20260928 03:45:21.103000 6554 rpc-test.cc:234] Connecting to unix:/tmp/dist-test-task3k46RW/test-tmp/rpc-test-3aea5528cad94457a70cab9a20184745.sock
W20260928 03:45:21.155068 6634 connection.cc:196] Error closing socket: Network error: TlsSocket::Close: Broken pipe
[ OK ] Parameters/TestRpc.TestCall/SSL_UnixSocket (78 ms)
[ RUN ] Parameters/TestRpc.TestCallWithChainCertAndRootCA/SSL_UnixSocket
I20260928 03:45:21.177623 6662 acceptor_pool.cc:254] collecting diagnostics on the listening RPC socket unix:/tmp/dist-test-task3k46RW/test-tmp/rpc-test-276d152a6dc84d6a91d7466e45677e4b.sock every 8 connection(s)
I20260928 03:45:21.178366 6663 acceptor_pool.cc:254] collecting diagnostics on the listening RPC socket unix:/tmp/dist-test-task3k46RW/test-tmp/rpc-test-276d152a6dc84d6a91d7466e45677e4b.sock every 8 connection(s)
/data0/somelongdirectorytoavoidrpathissues/src/kudu/src/kudu/rpc/rpc-test.cc:303: Failure
Failed
Bad status: Runtime error: could not verify certificate chain (error with cert: subject=CN = localhost, ST = sadfjas, C = AS, emailAddress = sdflkdsajf, O = lskdfjlsad, OU = sldfkja, issuer=C = AS, ST = ASDfkjdhf, L = lskdjf, O = saldfja, OU = skdjf, CN = localhost, emailAddress = sadjflkadsj): : certificate has expired
Google Test trace:
/data0/somelongdirectorytoavoidrpathissues/src/kudu/src/kudu/rpc/rpc-test.cc:300: Connecting to unix:/tmp/dist-test-task3k46RW/test-tmp/rpc-test-276d152a6dc84d6a91d7466e45677e4b.sock
I20260928 03:45:21.197000 6554 test_util.cc:175] -----------------------------------------------
I20260928 03:45:21.197201 6554 test_util.cc:176] Had fatal failures, leaving test files at /tmp/dist-test-task3k46RW/test-tmp/rpc-test.2.Parameters_TestRpc.TestCallWithChainCertAndRootCA_SSL_UnixSocket.1790567117739756-6554-0
[ FAILED ] Parameters/TestRpc.TestCallWithChainCertAndRootCA/SSL_UnixSocket, where GetParam() = (true, true) (37 ms)
[ RUN ] Parameters/TestRpc.TestCallWithBadPasswordProtectedKey/SSL_UnixSocket
[ OK ] Parameters/TestRpc.TestCallWithBadPasswordProtectedKey/SSL_UnixSocket (29 ms)
[ RUN ] Parameters/TestRpc.TestInvalidMethodCall/SSL_UnixSocket
I20260928 03:45:21.244869 6699 acceptor_pool.cc:254] collecting diagnostics on the listening RPC socket unix:/tmp/dist-test-task3k46RW/test-tmp/rpc-test-1fd0d939a1ba4a9ca03d2a3c4a495f9a.sock every 8 connection(s)
I20260928 03:45:21.245626 6700 acceptor_pool.cc:254] collecting diagnostics on the listening RPC socket unix:/tmp/dist-test-task3k46RW/test-tmp/rpc-test-1fd0d939a1ba4a9ca03d2a3c4a495f9a.sock every 8 connection(s)
I20260928 03:45:21.248620 6554 rpc-test.cc:406] Connecting to unix:/tmp/dist-test-task3k46RW/test-tmp/rpc-test-1fd0d939a1ba4a9ca03d2a3c4a495f9a.sock
[ OK ] Parameters/TestRpc.TestInvalidMethodCall/SSL_UnixSocket (52 ms)
[ RUN ] Parameters/TestRpc.TestHighFDs/SSL_UnixSocket
I20260928 03:45:21.473305 6724 acceptor_pool.cc:254] collecting diagnostics on the listening RPC socket unix:/tmp/dist-test-task3k46RW/test-tmp/rpc-test-5ce64f53926248acb35b691268266a65.sock every 8 connection(s)
I20260928 03:45:21.474012 6725 acceptor_pool.cc:254] collecting diagnostics on the listening RPC socket unix:/tmp/dist-test-task3k46RW/test-tmp/rpc-test-5ce64f53926248acb35b691268266a65.sock every 8 connection(s)
W20260928 03:45:21.509843 6721 connection.cc:196] Error closing socket: Network error: TlsSocket::Close: Broken pipe
[ OK ] Parameters/TestRpc.TestHighFDs/SSL_UnixSocket (242 ms)
[ RUN ] Parameters/TestRpc.TestConnectionAlwaysKeepalive/SSL_UnixSocket
I20260928 03:45:21.540130 6747 acceptor_pool.cc:254] collecting diagnostics on the listening RPC socket unix:/tmp/dist-test-task3k46RW/test-tmp/rpc-test-d8ded4b08fe944c9a19bead34ca59c70.sock every 8 connection(s)
I20260928 03:45:21.540841 6748 acceptor_pool.cc:254] collecting diagnostics on the listening RPC socket unix:/tmp/dist-test-task3k46RW/test-tmp/rpc-test-d8ded4b08fe944c9a19bead34ca59c70.sock every 8 connection(s)
I20260928 03:45:21.543886 6554 rpc-test.cc:532] Connecting to unix:/tmp/dist-test-task3k46RW/test-tmp/rpc-test-d8ded4b08fe944c9a19bead34ca59c70.sock
W20260928 03:45:24.574496 6746 connection.cc:196] Error closing socket: Network error: TlsSocket::Close: Broken pipe
[ OK ] Parameters/TestRpc.TestConnectionAlwaysKeepalive/SSL_UnixSocket (3056 ms)
[ RUN ] Parameters/TestRpc.TestReopenOutboundConnections/SSL_UnixSocket
I20260928 03:45:24.601821 6770 acceptor_pool.cc:254] collecting diagnostics on the listening RPC socket unix:/tmp/dist-test-task3k46RW/test-tmp/rpc-test-178ba344744a44e98777564478791e12.sock every 8 connection(s)
I20260928 03:45:24.602522 6771 acceptor_pool.cc:254] collecting diagnostics on the listening RPC socket unix:/tmp/dist-test-task3k46RW/test-tmp/rpc-test-178ba344744a44e98777564478791e12.sock every 8 connection(s)
I20260928 03:45:24.605525 6554 rpc-test.cc:658] Connecting to unix:/tmp/dist-test-task3k46RW/test-tmp/rpc-test-178ba344744a44e98777564478791e12.sock
W20260928 03:45:24.639812 6769 connection.cc:196] Error closing socket: Network error: TlsSocket::Close: Broken pipe
W20260928 03:45:24.648310 6769 connection.cc:196] Error closing socket: Network error: TlsSocket::Close: Broken pipe
W20260928 03:45:24.656739 6769 connection.cc:196] Error closing socket: Network error: TlsSocket::Close: Broken pipe
W20260928 03:45:24.665298 6769 connection.cc:196] Error closing socket: Network error: TlsSocket::Close: Broken pipe
W20260928 03:45:24.674208 6769 connection.cc:196] Error closing socket: Network error: TlsSocket::Close: Broken pipe
W20260928 03:45:24.682991 6769 connection.cc:196] Error closing socket: Network error: TlsSocket::Close: Broken pipe
W20260928 03:45:24.691735 6769 connection.cc:196] Error closing socket: Network error: TlsSocket::Close: Broken pipe
W20260928 03:45:24.700126 6769 connection.cc:196] Error closing socket: Network error: TlsSocket::Close: Broken pipe
W20260928 03:45:24.708958 6769 connection.cc:196] Error closing socket: Network error: TlsSocket::Close: Broken pipe
W20260928 03:45:24.717389 6769 connection.cc:196] Error closing socket: Network error: TlsSocket::Close: Broken pipe
W20260928 03:45:24.726279 6769 connection.cc:196] Error closing socket: Network error: TlsSocket::Close: Broken pipe
W20260928 03:45:24.735100 6769 connection.cc:196] Error closing socket: Network error: TlsSocket::Close: Broken pipe
W20260928 03:45:24.743777 6769 connection.cc:196] Error closing socket: Network error: TlsSocket::Close: Broken pipe
W20260928 03:45:24.752374 6769 connection.cc:196] Error closing socket: Network error: TlsSocket::Close: Broken pipe
W20260928 03:45:24.752468 6770 acceptor_pool.cc:285] unable to collect diagnostics on RPC socket unix:/tmp/dist-test-task3k46RW/test-tmp/rpc-test-178ba344744a44e98777564478791e12.sock: Not implemented: netlink diagnostics is currently supported only on IPv4 TCP sockets
W20260928 03:45:24.762785 6769 connection.cc:196] Error closing socket: Network error: TlsSocket::Close: Broken pipe
W20260928 03:45:24.771451 6769 connection.cc:196] Error closing socket: Network error: TlsSocket::Close: Broken pipe
W20260928 03:45:24.781682 6769 connection.cc:196] Error closing socket: Network error: TlsSocket::Close: Broken pipe
W20260928 03:45:24.791987 6769 connection.cc:196] Error closing socket: Network error: TlsSocket::Close: Broken pipe
W20260928 03:45:24.802093 6769 connection.cc:196] Error closing socket: Network error: TlsSocket::Close: Broken pipe
W20260928 03:45:24.812130 6769 connection.cc:196] Error closing socket: Network error: TlsSocket::Close: Broken pipe
W20260928 03:45:24.822402 6769 connection.cc:196] Error closing socket: Network error: TlsSocket::Close: Broken pipe
W20260928 03:45:24.832676 6769 connection.cc:196] Error closing socket: Network error: TlsSocket::Close: Broken pipe
W20260928 03:45:24.842484 6769 connection.cc:196] Error closing socket: Network error: TlsSocket::Close: Broken pipe
W20260928 03:45:24.852754 6769 connection.cc:196] Error closing socket: Network error: TlsSocket::Close: Broken pipe
W20260928 03:45:24.862926 6769 connection.cc:196] Error closing socket: Network error: TlsSocket::Close: Broken pipe
W20260928 03:45:24.872565 6769 connection.cc:196] Error closing socket: Network error: TlsSocket::Close: Broken pipe
W20260928 03:45:24.882270 6769 connection.cc:196] Error closing socket: Network error: TlsSocket::Close: Broken pipe
W20260928 03:45:24.891431 6769 connection.cc:196] Error closing socket: Network error: TlsSocket::Close: Broken pipe
W20260928 03:45:24.901760 6769 connection.cc:196] Error closing socket: Network error: TlsSocket::Close: Broken pipe
W20260928 03:45:24.911154 6769 connection.cc:196] Error closing socket: Network error: TlsSocket::Close: Broken pipe
W20260928 03:45:24.920416 6769 connection.cc:196] Error closing socket: Network error: TlsSocket::Close: Broken pipe
W20260928 03:45:24.930908 6769 connection.cc:196] Error closing socket: Network error: TlsSocket::Close: Broken pipe
[ OK ] Parameters/TestRpc.TestReopenOutboundConnections/SSL_UnixSocket (356 ms)
[ RUN ] Parameters/TestRpc.TestConnectionNetworkPlane/SSL_UnixSocket
I20260928 03:45:24.958690 6793 acceptor_pool.cc:254] collecting diagnostics on the listening RPC socket unix:/tmp/dist-test-task3k46RW/test-tmp/rpc-test-4288368bc45d4140a19d0061cacc8760.sock every 8 connection(s)
I20260928 03:45:24.959367 6794 acceptor_pool.cc:254] collecting diagnostics on the listening RPC socket unix:/tmp/dist-test-task3k46RW/test-tmp/rpc-test-4288368bc45d4140a19d0061cacc8760.sock every 8 connection(s)
I20260928 03:45:24.962438 6554 rpc-test.cc:772] Connecting to unix:/tmp/dist-test-task3k46RW/test-tmp/rpc-test-4288368bc45d4140a19d0061cacc8760.sock
W20260928 03:45:24.998982 6792 connection.cc:196] Error closing socket: Network error: TlsSocket::Close: Broken pipe
W20260928 03:45:24.999689 6792 connection.cc:196] Error closing socket: Network error: TlsSocket::Close: Broken pipe
[ OK ] Parameters/TestRpc.TestConnectionNetworkPlane/SSL_UnixSocket (68 ms)
[ RUN ] Parameters/TestRpc.TestTCPKeepalive/SSL_UnixSocket
I20260928 03:45:25.042891 6818 acceptor_pool.cc:254] collecting diagnostics on the listening RPC socket unix:/tmp/dist-test-task3k46RW/test-tmp/rpc-test-69d39941472d4ca3b87082f5e9e8d546.sock every 8 connection(s)
I20260928 03:45:25.043566 6819 acceptor_pool.cc:254] collecting diagnostics on the listening RPC socket unix:/tmp/dist-test-task3k46RW/test-tmp/rpc-test-69d39941472d4ca3b87082f5e9e8d546.sock every 8 connection(s)
I20260928 03:45:25.069970 6822 rpc-test-base.h:222] got call: sleep_micros: 8000000 deferred: true
I20260928 03:45:33.073971 6822 rpcz_store.cc:275] Call kudu.rpc.GenericCalculatorService.Sleep from unix:<unnamed> (request call id 0) took 8004 ms. Trace:
I20260928 03:45:33.074361 6822 rpcz_store.cc:276] 0928 03:45:25.069827 (+ 0us) service_pool.cc:170] Inserting onto call queue
0928 03:45:25.069920 (+ 93us) service_pool.cc:227] Handling call
0928 03:45:33.073775 (+8003855us) inbound_call.cc:173] Queueing success response
Metrics: {}
W20260928 03:45:33.080958 6815 connection.cc:196] Error closing socket: Network error: TlsSocket::Close: Broken pipe
[ OK ] Parameters/TestRpc.TestTCPKeepalive/SSL_UnixSocket (8083 ms)
[ RUN ] Parameters/TestRpc.TestMaxSmallSidecars/SSL_UnixSocket
I20260928 03:45:33.107585 6844 acceptor_pool.cc:254] collecting diagnostics on the listening RPC socket unix:/tmp/dist-test-task3k46RW/test-tmp/rpc-test-b4673187deb140a6843bee59f55bfab8.sock every 8 connection(s)
I20260928 03:45:33.108464 6845 acceptor_pool.cc:254] collecting diagnostics on the listening RPC socket unix:/tmp/dist-test-task3k46RW/test-tmp/rpc-test-b4673187deb140a6843bee59f55bfab8.sock every 8 connection(s)
W20260928 03:45:33.279531 6841 connection.cc:196] Error closing socket: Network error: TlsSocket::Close: Broken pipe
[ OK ] Parameters/TestRpc.TestMaxSmallSidecars/SSL_UnixSocket (196 ms)
[ RUN ] Parameters/TestRpc.TestCallTimeout/SSL_UnixSocket
I20260928 03:45:33.298983 6869 acceptor_pool.cc:254] collecting diagnostics on the listening RPC socket unix:/tmp/dist-test-task3k46RW/test-tmp/rpc-test-33df19bcbd9a4ccd8676b9f0562feee3.sock every 8 connection(s)
I20260928 03:45:33.299803 6870 acceptor_pool.cc:254] collecting diagnostics on the listening RPC socket unix:/tmp/dist-test-task3k46RW/test-tmp/rpc-test-33df19bcbd9a4ccd8676b9f0562feee3.sock every 8 connection(s)
I20260928 03:45:33.323693 6554 rpc-test-base.h:595] status: Timed out: connection negotiation to unix:/tmp/dist-test-task3k46RW/test-tmp/rpc-test-33df19bcbd9a4ccd8676b9f0562feee3.sock for RPC Sleep timed out after 0.000s (ON_OUTBOUND_QUEUE), seconds elapsed: 0.00295357
I20260928 03:45:33.329788 6873 rpc-test-base.h:222] got call: sleep_micros: 700000
I20260928 03:45:33.524497 6554 rpc-test-base.h:595] status: Timed out: Sleep RPC to unix:/tmp/dist-test-task3k46RW/test-tmp/rpc-test-33df19bcbd9a4ccd8676b9f0562feee3.sock timed out after 0.200s (SENT), seconds elapsed: 0.200467
I20260928 03:45:33.525836 6872 rpc-test-base.h:222] got call: sleep_micros: 2000000
W20260928 03:45:34.030494 6873 rpcz_store.cc:267] Call kudu.rpc.GenericCalculatorService.Sleep from unix:<unnamed> (request call id 1) took 700 ms (client timeout 200 ms). Trace:
W20260928 03:45:34.030905 6873 rpcz_store.cc:269] 0928 03:45:33.329652 (+ 0us) service_pool.cc:170] Inserting onto call queue
0928 03:45:33.329747 (+ 95us) service_pool.cc:227] Handling call
0928 03:45:34.030437 (+700690us) inbound_call.cc:173] Queueing success response
Metrics: {}
I20260928 03:45:35.027027 6554 rpc-test-base.h:595] status: Timed out: Sleep RPC to unix:/tmp/dist-test-task3k46RW/test-tmp/rpc-test-33df19bcbd9a4ccd8676b9f0562feee3.sock timed out after 1.500s (SENT), seconds elapsed: 1.50216
W20260928 03:45:35.526470 6872 rpcz_store.cc:267] Call kudu.rpc.GenericCalculatorService.Sleep from unix:<unnamed> (request call id 2) took 2000 ms (client timeout 1500 ms). Trace:
W20260928 03:45:35.526877 6872 rpcz_store.cc:269] 0928 03:45:33.525657 (+ 0us) service_pool.cc:170] Inserting onto call queue
0928 03:45:33.525779 (+ 122us) service_pool.cc:227] Handling call
0928 03:45:35.526416 (+2000637us) inbound_call.cc:173] Queueing success response
Metrics: {}
W20260928 03:45:35.527441 6866 connection.cc:441] server connection from unix:<unnamed> torn down before Call kudu.rpc.GenericCalculatorService.Sleep from unix:<unnamed> (request call id 2) could send its response
[ OK ] Parameters/TestRpc.TestCallTimeout/SSL_UnixSocket (2248 ms)
[ RUN ] Parameters/TestRpc.TestServerShutsDown/SSL_UnixSocket
I20260928 03:45:35.534435 6554 rpc-test.cc:1125] Connecting to 0.0.0.0:37131
W20260928 03:45:35.543521 6886 negotiation.cc:337] Failed RPC negotiation. Trace:
0928 03:45:35.542062 (+ 0us) reactor.cc:625] Submitting negotiation task for client connection to 0.0.0.0:37131 (local address 127.0.0.1:38426)
0928 03:45:35.542475 (+ 413us) negotiation.cc:107] Waiting for socket to connect
0928 03:45:35.542503 (+ 28us) client_negotiation.cc:174] Beginning negotiation
0928 03:45:35.542774 (+ 271us) client_negotiation.cc:252] Sending NEGOTIATE NegotiatePB request
0928 03:45:35.543002 (+ 228us) negotiation.cc:327] Negotiation complete: Network error: Client connection negotiation failed: client connection to 0.0.0.0:37131: BlockingWrite error: write error: Broken pipe (error 32)
Metrics: {"client-negotiator.queue_time_us":103}
[ OK ] Parameters/TestRpc.TestServerShutsDown/SSL_UnixSocket (13 ms)
[ RUN ] Parameters/TestRpc.TimedOutOnResponseMetric/SSL_UnixSocket
I20260928 03:45:35.561739 6903 acceptor_pool.cc:254] collecting diagnostics on the listening RPC socket unix:/tmp/dist-test-task3k46RW/test-tmp/rpc-test-5b5b2ae046d34871914e88365a5fdfd7.sock every 8 connection(s)
I20260928 03:45:35.562405 6904 acceptor_pool.cc:254] collecting diagnostics on the listening RPC socket unix:/tmp/dist-test-task3k46RW/test-tmp/rpc-test-5b5b2ae046d34871914e88365a5fdfd7.sock every 8 connection(s)
W20260928 03:45:35.798643 6907 rpcz_store.cc:267] Call kudu.rpc_test.CalculatorService.Sleep from unix:<unnamed> (request call id 3) took 50 ms (client timeout 25 ms). Trace:
W20260928 03:45:35.798938 6907 rpcz_store.cc:269] 0928 03:45:35.748004 (+ 0us) service_pool.cc:170] Inserting onto call queue
0928 03:45:35.748090 (+ 86us) service_pool.cc:227] Handling call
0928 03:45:35.798558 (+ 50468us) inbound_call.cc:173] Queueing success response
Related trace 'test_child':
Metrics: {"test_sleep_us":50000,"child_traces":[["test_child",{"related_trace_metric":1}]]}
W20260928 03:45:35.857934 6907 rpcz_store.cc:267] Call kudu.rpc_test.CalculatorService.Sleep from unix:<unnamed> (request call id 4) took 50 ms (client timeout 50 ms). Trace:
W20260928 03:45:35.858189 6907 rpcz_store.cc:269] 0928 03:45:35.807435 (+ 0us) service_pool.cc:170] Inserting onto call queue
0928 03:45:35.807546 (+ 111us) service_pool.cc:227] Handling call
0928 03:45:35.857880 (+ 50334us) inbound_call.cc:173] Queueing success response
Related trace 'test_child':
Metrics: {"test_sleep_us":50000,"child_traces":[["test_child",{"related_trace_metric":1}]]}
[ OK ] Parameters/TestRpc.TimedOutOnResponseMetric/SSL_UnixSocket (320 ms)
[ RUN ] Parameters/TestRpc.AcceptorDispatchingTimesMetric/SSL_UnixSocket
I20260928 03:45:35.878242 6928 acceptor_pool.cc:254] collecting diagnostics on the listening RPC socket 0.0.0.0:35963 every 8 connection(s)
I20260928 03:45:35.878885 6929 acceptor_pool.cc:254] collecting diagnostics on the listening RPC socket 0.0.0.0:35963 every 8 connection(s)
W20260928 03:45:35.884496 6924 negotiation.cc:337] Failed RPC negotiation. Trace:
0928 03:45:35.882497 (+ 0us) reactor.cc:625] Submitting negotiation task for server connection from 127.0.0.1:42030 (local address 127.0.0.1:35963)
0928 03:45:35.883210 (+ 713us) server_negotiation.cc:206] Beginning negotiation
0928 03:45:35.883250 (+ 40us) server_negotiation.cc:399] Waiting for connection header
0928 03:45:35.883625 (+ 375us) negotiation.cc:327] Negotiation complete: Network error: Server connection negotiation failed: server connection from 127.0.0.1:42030: BlockingRecv error: recv got EOF from 127.0.0.1:42030 (error 108)
Metrics: {"server-negotiator.queue_time_us":252}
[ OK ] Parameters/TestRpc.AcceptorDispatchingTimesMetric/SSL_UnixSocket (20 ms)
[ RUN ] Parameters/TestRpc.TestRpcCallbackDestroysMessenger/SSL_UnixSocket
[ OK ] Parameters/TestRpc.TestRpcCallbackDestroysMessenger/SSL_UnixSocket (18 ms)
[ RUN ] Parameters/TestRpc.TestApplicationFeatureFlag/SSL_UnixSocket
I20260928 03:45:35.946182 6953 acceptor_pool.cc:254] collecting diagnostics on the listening RPC socket unix:/tmp/dist-test-task3k46RW/test-tmp/rpc-test-ec8f66b7a22247efb586c8dabe3fa90f.sock every 8 connection(s)
I20260928 03:45:35.946913 6954 acceptor_pool.cc:254] collecting diagnostics on the listening RPC socket unix:/tmp/dist-test-task3k46RW/test-tmp/rpc-test-ec8f66b7a22247efb586c8dabe3fa90f.sock every 8 connection(s)
W20260928 03:45:35.974020 6950 messenger.cc:357] Unable to handle RPC call: Not implemented: call requires unsupported application feature flags: 99
[ OK ] Parameters/TestRpc.TestApplicationFeatureFlag/SSL_UnixSocket (75 ms)
[ RUN ] Parameters/TestRpc.TestCancellation/SSL_UnixSocket
I20260928 03:45:36.000209 6978 acceptor_pool.cc:254] collecting diagnostics on the listening RPC socket unix:/tmp/dist-test-task3k46RW/test-tmp/rpc-test-bf48c3dffcc2496d85e0785654c10cbe.sock every 8 connection(s)
I20260928 03:45:36.000937 6979 acceptor_pool.cc:254] collecting diagnostics on the listening RPC socket unix:/tmp/dist-test-task3k46RW/test-tmp/rpc-test-bf48c3dffcc2496d85e0785654c10cbe.sock every 8 connection(s)
I20260928 03:45:36.004046 6554 rpc-test.cc:1648] Connecting to unix:/tmp/dist-test-task3k46RW/test-tmp/rpc-test-bf48c3dffcc2496d85e0785654c10cbe.sock
I20260928 03:45:36.110711 6554 rpc-test-base.h:595] status: Aborted: Sleep RPC to unix:/tmp/dist-test-task3k46RW/test-tmp/rpc-test-bf48c3dffcc2496d85e0785654c10cbe.sock is cancelled in state READY, seconds elapsed: 0.000549226
I20260928 03:45:36.277917 6554 rpc-test-base.h:595] status: Aborted: Sleep RPC to unix:/tmp/dist-test-task3k46RW/test-tmp/rpc-test-bf48c3dffcc2496d85e0785654c10cbe.sock is cancelled in state SENT, seconds elapsed: 0.000684722
I20260928 03:45:36.278241 6981 rpc-test-base.h:222] got call: sleep_micros: 510000
I20260928 03:45:36.443112 6554 rpc-test-base.h:595] status: Aborted: Sleep RPC to unix:/tmp/dist-test-task3k46RW/test-tmp/rpc-test-bf48c3dffcc2496d85e0785654c10cbe.sock is cancelled in state SENT, seconds elapsed: 0.000718043
I20260928 03:45:36.443483 6980 rpc-test-base.h:222] got call: sleep_micros: 510000
I20260928 03:45:36.651820 6554 rpc-test-base.h:595] status: Aborted: Sleep RPC to unix:/tmp/dist-test-task3k46RW/test-tmp/rpc-test-bf48c3dffcc2496d85e0785654c10cbe.sock is cancelled in state SENT, seconds elapsed: 0.000831946
W20260928 03:45:36.663344 6982 rpcz_store.cc:267] Call kudu.rpc.GenericCalculatorService.Sleep from unix:<unnamed> (request call id 11) took 11 ms (client timeout 10 ms). Trace:
W20260928 03:45:36.663650 6982 rpcz_store.cc:269] 0928 03:45:36.651815 (+ 0us) service_pool.cc:170] Inserting onto call queue
0928 03:45:36.663036 (+ 11221us) service_pool.cc:214] Skipping call since client already timed out
0928 03:45:36.663167 (+ 131us) inbound_call.cc:173] Queueing failure response
Metrics: {}
I20260928 03:45:36.664196 6982 rpc-test-base.h:222] got call: sleep_micros: 1500000
W20260928 03:45:36.788725 6981 rpcz_store.cc:267] Call kudu.rpc.GenericCalculatorService.Sleep from unix:<unnamed> (request call id 3) took 510 ms (client timeout 10 ms). Trace:
W20260928 03:45:36.789021 6981 rpcz_store.cc:269] 0928 03:45:36.278081 (+ 0us) service_pool.cc:170] Inserting onto call queue
0928 03:45:36.278185 (+ 104us) service_pool.cc:227] Handling call
0928 03:45:36.788657 (+510472us) inbound_call.cc:173] Queueing success response
Metrics: {}
W20260928 03:45:36.954049 6980 rpcz_store.cc:267] Call kudu.rpc.GenericCalculatorService.Sleep from unix:<unnamed> (request call id 7) took 510 ms (client timeout 10 ms). Trace:
W20260928 03:45:36.954433 6980 rpcz_store.cc:269] 0928 03:45:36.443280 (+ 0us) service_pool.cc:170] Inserting onto call queue
0928 03:45:36.443430 (+ 150us) service_pool.cc:227] Handling call
0928 03:45:36.953995 (+510565us) inbound_call.cc:173] Queueing success response
Metrics: {}
I20260928 03:45:37.654505 6554 rpc-test-base.h:595] status: Timed out: Sleep RPC to unix:/tmp/dist-test-task3k46RW/test-tmp/rpc-test-bf48c3dffcc2496d85e0785654c10cbe.sock timed out after 1.000s (SENT), seconds elapsed: 1.00232
I20260928 03:45:37.655898 6980 rpc-test-base.h:222] got call: sleep_micros: 1500000
W20260928 03:45:38.164909 6982 rpcz_store.cc:267] Call kudu.rpc.GenericCalculatorService.Sleep from unix:<unnamed> (request call id 12) took 1512 ms (client timeout 1000 ms). Trace:
W20260928 03:45:38.165297 6982 rpcz_store.cc:269] 0928 03:45:36.652851 (+ 0us) service_pool.cc:170] Inserting onto call queue
0928 03:45:36.664149 (+ 11298us) service_pool.cc:227] Handling call
0928 03:45:38.164744 (+1500595us) inbound_call.cc:173] Queueing success response
Metrics: {}
I20260928 03:45:38.656062 6554 rpc-test-base.h:595] status: Timed out: Sleep RPC to unix:/tmp/dist-test-task3k46RW/test-tmp/rpc-test-bf48c3dffcc2496d85e0785654c10cbe.sock timed out after 1.000s (SENT), seconds elapsed: 1.00115
W20260928 03:45:38.657562 6975 messenger.cc:357] Unable to handle RPC call: Not implemented: call requires unsupported application feature flags: 99, 1
W20260928 03:45:38.658769 6975 messenger.cc:357] Unable to handle RPC call: Not implemented: call requires unsupported application feature flags: 99, 1
W20260928 03:45:38.875263 6975 connection.cc:196] Error closing socket: Network error: TlsSocket::Close: Broken pipe
W20260928 03:45:39.156476 6980 rpcz_store.cc:267] Call kudu.rpc.GenericCalculatorService.Sleep from unix:<unnamed> (request call id 13) took 1500 ms (client timeout 1000 ms). Trace:
W20260928 03:45:39.156781 6980 rpcz_store.cc:269] 0928 03:45:37.655625 (+ 0us) service_pool.cc:170] Inserting onto call queue
0928 03:45:37.655847 (+ 222us) service_pool.cc:227] Handling call
0928 03:45:39.156337 (+1500490us) inbound_call.cc:173] Queueing success response
Metrics: {}
W20260928 03:45:39.157312 6975 connection.cc:441] server connection from unix:<unnamed> torn down before Call kudu.rpc.GenericCalculatorService.Sleep from unix:<unnamed> (request call id 13) could send its response
[ OK ] Parameters/TestRpc.TestCancellation/SSL_UnixSocket (3183 ms)
[ RUN ] Parameters/TestRpc.TestCancellationMultiThreads/SSL_UnixSocket
I20260928 03:45:39.198179 7004 acceptor_pool.cc:254] collecting diagnostics on the listening RPC socket unix:/tmp/dist-test-task3k46RW/test-tmp/rpc-test-d0f457ce6eff40158f0b332d8538dbca.sock every 8 connection(s)
I20260928 03:45:39.199031 7005 acceptor_pool.cc:254] collecting diagnostics on the listening RPC socket unix:/tmp/dist-test-task3k46RW/test-tmp/rpc-test-d0f457ce6eff40158f0b332d8538dbca.sock every 8 connection(s)
I20260928 03:45:39.201908 6554 rpc-test.cc:1808] Connecting to unix:/tmp/dist-test-task3k46RW/test-tmp/rpc-test-d0f457ce6eff40158f0b332d8538dbca.sock
I20260928 03:45:39.333161 7018 test_util.cc:268] Using random seed: -431402044
I20260928 03:45:39.334203 7019 test_util.cc:268] Using random seed: -431400924
I20260928 03:45:39.335625 7020 test_util.cc:268] Using random seed: -431399605
I20260928 03:45:39.336722 7021 test_util.cc:268] Using random seed: -431398416
I20260928 03:45:39.338261 7022 test_util.cc:268] Using random seed: -431397051
I20260928 03:45:39.340090 7023 test_util.cc:268] Using random seed: -431395146
I20260928 03:45:39.341555 7024 test_util.cc:268] Using random seed: -431393723
I20260928 03:45:39.343382 7025 test_util.cc:268] Using random seed: -431391924
I20260928 03:45:39.344702 7026 test_util.cc:268] Using random seed: -431390549
I20260928 03:45:39.346230 7027 test_util.cc:268] Using random seed: -431389032
I20260928 03:45:39.348145 7028 test_util.cc:268] Using random seed: -431387102
I20260928 03:45:39.351226 7029 test_util.cc:268] Using random seed: -431384063
I20260928 03:45:39.353029 7030 test_util.cc:268] Using random seed: -431382262
I20260928 03:45:39.354462 7031 test_util.cc:268] Using random seed: -431380854
I20260928 03:45:39.355793 7032 test_util.cc:268] Using random seed: -431379451
I20260928 03:45:39.357048 7033 test_util.cc:268] Using random seed: -431378183
I20260928 03:45:39.358624 7034 test_util.cc:268] Using random seed: -431376671
I20260928 03:45:39.359879 7035 test_util.cc:268] Using random seed: -431375345
I20260928 03:45:39.361125 7036 test_util.cc:268] Using random seed: -431374088
I20260928 03:45:39.362707 7037 test_util.cc:268] Using random seed: -431372680
I20260928 03:45:39.364192 7038 test_util.cc:268] Using random seed: -431371093
I20260928 03:45:39.367905 7039 test_util.cc:268] Using random seed: -431367398
I20260928 03:45:39.369891 7040 test_util.cc:268] Using random seed: -431365407
I20260928 03:45:39.371419 7041 test_util.cc:268] Using random seed: -431363842
I20260928 03:45:39.372958 7042 test_util.cc:268] Using random seed: -431362343
I20260928 03:45:39.374626 7043 test_util.cc:268] Using random seed: -431360704
I20260928 03:45:39.376284 7044 test_util.cc:268] Using random seed: -431359016
I20260928 03:45:39.378028 7045 test_util.cc:268] Using random seed: -431357243
I20260928 03:45:39.379782 7046 test_util.cc:268] Using random seed: -431355573
I20260928 03:45:39.381404 7047 test_util.cc:268] Using random seed: -431353826
W20260928 03:45:58.302910 7001 connection.cc:196] Error closing socket: Network error: TlsSocket::Close: Broken pipe
[ OK ] Parameters/TestRpc.TestCancellationMultiThreads/SSL_UnixSocket (19153 ms)
[ RUN ] Parameters/TestRpc.TestCallId/SSL_UnixSocket
I20260928 03:45:58.366354 7061 acceptor_pool.cc:254] collecting diagnostics on the listening RPC socket unix:/tmp/dist-test-task3k46RW/test-tmp/rpc-test-38e0d2f7de5348cab07d59aff971a0c7.sock every 8 connection(s)
I20260928 03:45:58.367193 7062 acceptor_pool.cc:254] collecting diagnostics on the listening RPC socket unix:/tmp/dist-test-task3k46RW/test-tmp/rpc-test-38e0d2f7de5348cab07d59aff971a0c7.sock every 8 connection(s)
[ OK ] Parameters/TestRpc.TestCallId/SSL_UnixSocket (90 ms)
[----------] 20 tests from Parameters/TestRpc (37477 ms total)
[----------] Global test environment tear-down
[==========] 21 tests from 2 test suites ran. (40623 ms total)
[ PASSED ] 20 tests.
[ FAILED ] 1 test, listed below:
[ FAILED ] Parameters/TestRpc.TestCallWithChainCertAndRootCA/SSL_UnixSocket, where GetParam() = (true, true)
1 FAILED TEST
I20260928 03:45:58.425194 6554 logging.cc:424] LogThrottler /data0/somelongdirectorytoavoidrpathissues/src/kudu/src/kudu/rpc/acceptor_pool.cc:285: suppressed but not reported on 3 messages since previous log ~33 seconds ago