Diagnosed failure

Parameters/TestRpc.TestCallWithChainCertAndChainCA/SSL_UnixSocket: /data0/somelongdirectorytoavoidrpathissues/src/kudu/src/kudu/rpc/rpc-test.cc:270: Failure
Failed
Bad status: Runtime error: could not verify certificate chain (error with cert: subject=CN = localhost, ST = sadfjas, C = AS, emailAddress = sdflkdsajf, O = lskdfjlsad, OU = sldfkja, issuer=C = AS, ST = ASDfkjdhf, L = lskdjf, O = saldfja, OU = skdjf, CN = localhost, emailAddress = sadjflkadsj): : certificate has expired
Google Test trace:
/data0/somelongdirectorytoavoidrpathissues/src/kudu/src/kudu/rpc/rpc-test.cc:267: Connecting to unix:/tmp/dist-test-task3wW6sc/test-tmp/rpc-test-ddf89b7edc0a4b08b264b17d05fe79cf.sock
I20260925 22:40:02.576797  1194 test_util.cc:175] -----------------------------------------------
I20260925 22:40:02.576850  1194 test_util.cc:176] Had fatal failures, leaving test files at /tmp/dist-test-task3wW6sc/test-tmp/rpc-test.6.Parameters_TestRpc.TestCallWithChainCertAndChainCA_SSL_UnixSocket.1790376002479722-1194-0

Full log

Note: This is test shard 7 of 8.
[==========] Running 21 tests from 2 test suites.
[----------] Global test environment set-up.
[----------] 20 tests from Parameters/TestRpc
[ RUN      ] Parameters/TestRpc.TestMessengerCreateDestroy/SSL_UnixSocket
WARNING: Logging before InitGoogleLogging() is written to STDERR
I20260925 22:40:02.514968  1194 rpc-test.cc:169] started messenger TestCreateDestroy
[       OK ] Parameters/TestRpc.TestMessengerCreateDestroy/SSL_UnixSocket (30 ms)
[ RUN      ] Parameters/TestRpc.TestNegotiationDeadlock/SSL_UnixSocket
I20260925 22:40:02.542280  1214 acceptor_pool.cc:254] collecting diagnostics on the listening RPC socket unix:/tmp/dist-test-task3wW6sc/test-tmp/rpc-test-173cba770c5c4643b1838db92f622775.sock every 8 connection(s)
I20260925 22:40:02.542299  1215 acceptor_pool.cc:254] collecting diagnostics on the listening RPC socket unix:/tmp/dist-test-task3wW6sc/test-tmp/rpc-test-173cba770c5c4643b1838db92f622775.sock every 8 connection(s)
[       OK ] Parameters/TestRpc.TestNegotiationDeadlock/SSL_UnixSocket (35 ms)
[ RUN      ] Parameters/TestRpc.TestCallWithChainCertAndChainCA/SSL_UnixSocket
I20260925 22:40:02.571645  1230 acceptor_pool.cc:254] collecting diagnostics on the listening RPC socket unix:/tmp/dist-test-task3wW6sc/test-tmp/rpc-test-ddf89b7edc0a4b08b264b17d05fe79cf.sock every 8 connection(s)
I20260925 22:40:02.571697  1231 acceptor_pool.cc:254] collecting diagnostics on the listening RPC socket unix:/tmp/dist-test-task3wW6sc/test-tmp/rpc-test-ddf89b7edc0a4b08b264b17d05fe79cf.sock every 8 connection(s)
/data0/somelongdirectorytoavoidrpathissues/src/kudu/src/kudu/rpc/rpc-test.cc:270: Failure
Failed
Bad status: Runtime error: could not verify certificate chain (error with cert: subject=CN = localhost, ST = sadfjas, C = AS, emailAddress = sdflkdsajf, O = lskdfjlsad, OU = sldfkja, issuer=C = AS, ST = ASDfkjdhf, L = lskdjf, O = saldfja, OU = skdjf, CN = localhost, emailAddress = sadjflkadsj): : certificate has expired
Google Test trace:
/data0/somelongdirectorytoavoidrpathissues/src/kudu/src/kudu/rpc/rpc-test.cc:267: Connecting to unix:/tmp/dist-test-task3wW6sc/test-tmp/rpc-test-ddf89b7edc0a4b08b264b17d05fe79cf.sock
I20260925 22:40:02.576797  1194 test_util.cc:175] -----------------------------------------------
I20260925 22:40:02.576850  1194 test_util.cc:176] Had fatal failures, leaving test files at /tmp/dist-test-task3wW6sc/test-tmp/rpc-test.6.Parameters_TestRpc.TestCallWithChainCertAndChainCA_SSL_UnixSocket.1790376002479722-1194-0
[  FAILED  ] Parameters/TestRpc.TestCallWithChainCertAndChainCA/SSL_UnixSocket, where GetParam() = (true, true) (23 ms)
[ RUN      ] Parameters/TestRpc.TestCallWithPasswordProtectedKey/SSL_UnixSocket
I20260925 22:40:02.585665  1255 acceptor_pool.cc:254] collecting diagnostics on the listening RPC socket unix:/tmp/dist-test-task3wW6sc/test-tmp/rpc-test-4bd79be22bb04013a2dbca9436e6129c.sock every 8 connection(s)
I20260925 22:40:02.585707  1256 acceptor_pool.cc:254] collecting diagnostics on the listening RPC socket unix:/tmp/dist-test-task3wW6sc/test-tmp/rpc-test-4bd79be22bb04013a2dbca9436e6129c.sock every 8 connection(s)
W20260925 22:40:02.599313  1252 connection.cc:196] Error closing socket: Network error: TlsSocket::Close: Broken pipe
[       OK ] Parameters/TestRpc.TestCallWithPasswordProtectedKey/SSL_UnixSocket (23 ms)
[ RUN      ] Parameters/TestRpc.TestCallToBadServer/SSL_UnixSocket
I20260925 22:40:02.605695  1194 rpc-test.cc:394] Status: Network error: Client connection negotiation failed: client connection to 0.0.0.0:0: connect: Connection refused (error 111)
I20260925 22:40:02.606179  1194 rpc-test.cc:394] Status: Network error: Client connection negotiation failed: client connection to 0.0.0.0:0: connect: Connection refused (error 111)
I20260925 22:40:02.606606  1194 rpc-test.cc:394] Status: Network error: Client connection negotiation failed: client connection to 0.0.0.0:0: connect: Connection refused (error 111)
I20260925 22:40:02.607003  1194 rpc-test.cc:394] Status: Network error: Client connection negotiation failed: client connection to 0.0.0.0:0: connect: Connection refused (error 111)
I20260925 22:40:02.607384  1194 rpc-test.cc:394] Status: Network error: Client connection negotiation failed: client connection to 0.0.0.0:0: connect: Connection refused (error 111)
[       OK ] Parameters/TestRpc.TestCallToBadServer/SSL_UnixSocket (7 ms)
[ RUN      ] Parameters/TestRpc.TestWrongService/SSL_UnixSocket
I20260925 22:40:02.630478  1290 acceptor_pool.cc:254] collecting diagnostics on the listening RPC socket unix:/tmp/dist-test-task3wW6sc/test-tmp/rpc-test-5d235341bb5847d7ad87a82c09bd88eb.sock every 8 connection(s)
I20260925 22:40:02.630504  1291 acceptor_pool.cc:254] collecting diagnostics on the listening RPC socket unix:/tmp/dist-test-task3wW6sc/test-tmp/rpc-test-5d235341bb5847d7ad87a82c09bd88eb.sock every 8 connection(s)
I20260925 22:40:02.648509  1287 messenger.cc:345] service WrongServiceName not registered on TestServer
[       OK ] Parameters/TestRpc.TestWrongService/SSL_UnixSocket (42 ms)
[ RUN      ] Parameters/TestRpc.TestConnectionKeepalive/SSL_UnixSocket
I20260925 22:40:02.656203  1313 acceptor_pool.cc:254] collecting diagnostics on the listening RPC socket unix:/tmp/dist-test-task3wW6sc/test-tmp/rpc-test-024679393fa1436a9d1fd5466141d4d8.sock every 8 connection(s)
I20260925 22:40:02.656258  1314 acceptor_pool.cc:254] collecting diagnostics on the listening RPC socket unix:/tmp/dist-test-task3wW6sc/test-tmp/rpc-test-024679393fa1436a9d1fd5466141d4d8.sock every 8 connection(s)
I20260925 22:40:02.656558  1194 rpc-test.cc:488] Connecting to unix:/tmp/dist-test-task3wW6sc/test-tmp/rpc-test-024679393fa1436a9d1fd5466141d4d8.sock
W20260925 22:40:03.152554  1326 connection.cc:196] Error closing socket: Network error: TlsSocket::Close: Broken pipe
[       OK ] Parameters/TestRpc.TestConnectionKeepalive/SSL_UnixSocket (1034 ms)
[ RUN      ] Parameters/TestRpc.TestClientConnectionMetrics/SSL_UnixSocket
I20260925 22:40:03.709230  1338 acceptor_pool.cc:254] collecting diagnostics on the listening RPC socket unix:/tmp/dist-test-task3wW6sc/test-tmp/rpc-test-3d40bc2c6e334a45b5e53f5fe331e25c.sock every 8 connection(s)
I20260925 22:40:03.709266  1339 acceptor_pool.cc:254] collecting diagnostics on the listening RPC socket unix:/tmp/dist-test-task3wW6sc/test-tmp/rpc-test-3d40bc2c6e334a45b5e53f5fe331e25c.sock every 8 connection(s)
I20260925 22:40:03.709575  1194 rpc-test.cc:569] Connecting to unix:/tmp/dist-test-task3wW6sc/test-tmp/rpc-test-3d40bc2c6e334a45b5e53f5fe331e25c.sock
W20260925 22:40:13.920604  1335 connection.cc:196] Error closing socket: Network error: TlsSocket::Close: Broken pipe
[       OK ] Parameters/TestRpc.TestClientConnectionMetrics/SSL_UnixSocket (10236 ms)
[ RUN      ] Parameters/TestRpc.TestCredentialsPolicy/SSL_UnixSocket
I20260925 22:40:13.932811  1361 acceptor_pool.cc:254] collecting diagnostics on the listening RPC socket unix:/tmp/dist-test-task3wW6sc/test-tmp/rpc-test-25b4330410fb427e9a38478a4aa3fa4b.sock every 8 connection(s)
I20260925 22:40:13.932858  1362 acceptor_pool.cc:254] collecting diagnostics on the listening RPC socket unix:/tmp/dist-test-task3wW6sc/test-tmp/rpc-test-25b4330410fb427e9a38478a4aa3fa4b.sock every 8 connection(s)
I20260925 22:40:13.933115  1194 rpc-test.cc:700] Connecting to unix:/tmp/dist-test-task3wW6sc/test-tmp/rpc-test-25b4330410fb427e9a38478a4aa3fa4b.sock
W20260925 22:40:13.953099  1360 connection.cc:196] Error closing socket: Network error: TlsSocket::Close: Broken pipe
W20260925 22:40:13.957719  1360 connection.cc:196] Error closing socket: Network error: TlsSocket::Close: Broken pipe
[       OK ] Parameters/TestRpc.TestCredentialsPolicy/SSL_UnixSocket (36 ms)
[ RUN      ] Parameters/TestRpc.TestCallLongerThanKeepalive/SSL_UnixSocket
I20260925 22:40:13.971818  1386 acceptor_pool.cc:254] collecting diagnostics on the listening RPC socket unix:/tmp/dist-test-task3wW6sc/test-tmp/rpc-test-008a0834841b421db6df23cfccb146ba.sock every 8 connection(s)
I20260925 22:40:13.971861  1387 acceptor_pool.cc:254] collecting diagnostics on the listening RPC socket unix:/tmp/dist-test-task3wW6sc/test-tmp/rpc-test-008a0834841b421db6df23cfccb146ba.sock every 8 connection(s)
I20260925 22:40:13.980379  1390 rpc-test-base.h:222] got call: sleep_micros: 3000000 deferred: true
I20260925 22:40:16.981226  1390 rpcz_store.cc:275] Call kudu.rpc.GenericCalculatorService.Sleep from unix:<unnamed> (request call id 0) took 3000 ms. Trace:
I20260925 22:40:16.981341  1390 rpcz_store.cc:276] 0925 22:40:13.980306 (+     0us) service_pool.cc:170] Inserting onto call queue
0925 22:40:13.980361 (+    55us) service_pool.cc:227] Handling call
0925 22:40:16.981205 (+3000844us) inbound_call.cc:173] Queueing success response
Metrics: {}
W20260925 22:40:16.982930  1383 connection.cc:196] Error closing socket: Network error: TlsSocket::Close: Broken pipe
[       OK ] Parameters/TestRpc.TestCallLongerThanKeepalive/SSL_UnixSocket (3025 ms)
[ RUN      ] Parameters/TestRpc.TestRpcSidecar/SSL_UnixSocket
I20260925 22:40:17.025512  1411 acceptor_pool.cc:254] collecting diagnostics on the listening RPC socket unix:/tmp/dist-test-task3wW6sc/test-tmp/rpc-test-12c6ef580ed34b04964b4d3bf6671804.sock every 8 connection(s)
I20260925 22:40:17.025535  1412 acceptor_pool.cc:254] collecting diagnostics on the listening RPC socket unix:/tmp/dist-test-task3wW6sc/test-tmp/rpc-test-12c6ef580ed34b04964b4d3bf6671804.sock every 8 connection(s)
W20260925 22:40:17.079351  1408 connection.cc:196] Error closing socket: Network error: TlsSocket::Close: Broken pipe
[       OK ] Parameters/TestRpc.TestRpcSidecar/SSL_UnixSocket (96 ms)
[ RUN      ] Parameters/TestRpc.TestRpcSidecarLimits/SSL_UnixSocket
I20260925 22:40:18.815415  1436 acceptor_pool.cc:254] collecting diagnostics on the listening RPC socket unix:/tmp/dist-test-task3wW6sc/test-tmp/rpc-test-cfe5dc29a1cf4ff6844178e2548413dc.sock every 8 connection(s)
I20260925 22:40:18.815450  1437 acceptor_pool.cc:254] collecting diagnostics on the listening RPC socket unix:/tmp/dist-test-task3wW6sc/test-tmp/rpc-test-cfe5dc29a1cf4ff6844178e2548413dc.sock every 8 connection(s)
W20260925 22:40:18.834391  1194 serialization.cc:72] Serialized kudu.rpc_test.PushStringsRequestPB (2147483654 bytes) is larger than the maximum configured RPC message size (52428800 bytes). Sending anyway, but peer may reject the data.
W20260925 22:40:18.838428  1433 connection.cc:535] server connection from unix:<unnamed> recv error: Network error: RPC frame had a length of 2147483714, but we only support messages up to 52428800 bytes long.
W20260925 22:40:18.838495  1433 connection.cc:158] shutting down server connection from unix:<unnamed> with pending inbound data: 4/2147483714 bytes received; last active 0 ns ago: status Network error: RPC frame had a length of 2147483714, but we only support messages up to 52428800 bytes long.
W20260925 22:40:18.838757  1449 connection.cc:196] Error closing socket: Network error: TlsSocket::Close: Broken pipe
I20260925 22:40:18.866434  1461 acceptor_pool.cc:254] collecting diagnostics on the listening RPC socket unix:/tmp/dist-test-task3wW6sc/test-tmp/rpc-test-cfe5dc29a1cf4ff6844178e2548413dc.sock every 8 connection(s)
I20260925 22:40:18.866477  1462 acceptor_pool.cc:254] collecting diagnostics on the listening RPC socket unix:/tmp/dist-test-task3wW6sc/test-tmp/rpc-test-cfe5dc29a1cf4ff6844178e2548413dc.sock every 8 connection(s)
W20260925 22:40:23.612851  1458 connection.cc:577] server connection from unix:<unnamed>: received bad data: 'Corruption: Invalid packet: message had a length of 2147483710, but we only support messages up to 2147483647 bytes
'
W20260925 22:40:23.613276  1474 connection.cc:196] Error closing socket: Network error: TlsSocket::Close: Broken pipe
[       OK ] Parameters/TestRpc.TestRpcSidecarLimits/SSL_UnixSocket (6535 ms)
[ RUN      ] Parameters/TestRpc.TestCallTimeoutDoesntAffectNegotiation/SSL_UnixSocket
I20260925 22:40:23.633311  1486 acceptor_pool.cc:254] collecting diagnostics on the listening RPC socket unix:/tmp/dist-test-task3wW6sc/test-tmp/rpc-test-3153f925cd814726b8b2cd97453660a3.sock every 8 connection(s)
I20260925 22:40:23.633455  1487 acceptor_pool.cc:254] collecting diagnostics on the listening RPC socket unix:/tmp/dist-test-task3wW6sc/test-tmp/rpc-test-3153f925cd814726b8b2cd97453660a3.sock every 8 connection(s)
W20260925 22:40:23.648788  1482 negotiation.cc:266] Injecting 500ms delay in negotiation
I20260925 22:40:23.699349  1194 rpc-test-base.h:595] status: Timed out: connection negotiation to unix:/tmp/dist-test-task3wW6sc/test-tmp/rpc-test-3153f925cd814726b8b2cd97453660a3.sock for RPC Sleep timed out after 0.050s (ON_OUTBOUND_QUEUE), seconds elapsed: 0.0510009
W20260925 22:40:24.154268  1483 connection.cc:196] Error closing socket: Network error: TlsSocket::Close: Broken pipe
[       OK ] Parameters/TestRpc.TestCallTimeoutDoesntAffectNegotiation/SSL_UnixSocket (539 ms)
[ RUN      ] Parameters/TestRpc.TestRpcHandlerLatencyMetric/SSL_UnixSocket
I20260925 22:40:24.161784  1511 acceptor_pool.cc:254] collecting diagnostics on the listening RPC socket unix:/tmp/dist-test-task3wW6sc/test-tmp/rpc-test-907bdaea36424512a580f68e7136e889.sock every 8 connection(s)
I20260925 22:40:24.161826  1512 acceptor_pool.cc:254] collecting diagnostics on the listening RPC socket unix:/tmp/dist-test-task3wW6sc/test-tmp/rpc-test-907bdaea36424512a580f68e7136e889.sock every 8 connection(s)
I20260925 22:40:24.206188  1194 rpc-test.cc:1236] Sleep() min lat: 20397
I20260925 22:40:24.206278  1194 rpc-test.cc:1237] Sleep() mean lat: 20397
I20260925 22:40:24.206321  1194 rpc-test.cc:1238] Sleep() max lat: 20397
I20260925 22:40:24.206344  1194 rpc-test.cc:1239] Sleep() #calls: 1
[       OK ] Parameters/TestRpc.TestRpcHandlerLatencyMetric/SSL_UnixSocket (53 ms)
[ RUN      ] Parameters/TestRpc.TimedOutOnResponseMetricServiceQueue/SSL_UnixSocket
I20260925 22:40:24.224531  1537 acceptor_pool.cc:254] collecting diagnostics on the listening RPC socket unix:/tmp/dist-test-task3wW6sc/test-tmp/rpc-test-b4b173c3ecaf4a50ad204db48c687b7d.sock every 8 connection(s)
I20260925 22:40:24.224572  1538 acceptor_pool.cc:254] collecting diagnostics on the listening RPC socket unix:/tmp/dist-test-task3wW6sc/test-tmp/rpc-test-b4b173c3ecaf4a50ad204db48c687b7d.sock every 8 connection(s)
W20260925 22:40:24.295992  1539 rpcz_store.cc:267] Call kudu.rpc_test.CalculatorService.Sleep from unix:<unnamed> (request call id 2) took 20 ms (client timeout 20 ms). Trace:
W20260925 22:40:24.296113  1539 rpcz_store.cc:269] 0925 22:40:24.275657 (+     0us) service_pool.cc:170] Inserting onto call queue
0925 22:40:24.295951 (+ 20294us) service_pool.cc:214] Skipping call since client already timed out
0925 22:40:24.295977 (+    26us) inbound_call.cc:173] Queueing failure response
Metrics: {}
[       OK ] Parameters/TestRpc.TimedOutOnResponseMetricServiceQueue/SSL_UnixSocket (89 ms)
[ RUN      ] Parameters/TestRpc.RpcPendingConnectionsMetric/SSL_UnixSocket
I20260925 22:40:24.300392  1560 acceptor_pool.cc:254] collecting diagnostics on the listening RPC socket 0.0.0.0:44269 every 8 connection(s)
I20260925 22:40:24.300457  1561 acceptor_pool.cc:254] collecting diagnostics on the listening RPC socket 0.0.0.0:44269 every 8 connection(s)
W20260925 22:40:24.311717  1556 negotiation.cc:337] Failed RPC negotiation. Trace:
0925 22:40:24.311081 (+     0us) reactor.cc:625] Submitting negotiation task for server connection from 127.0.0.1:41196 (local address 127.0.0.1:44269)
0925 22:40:24.311279 (+   198us) server_negotiation.cc:206] Beginning negotiation
0925 22:40:24.311286 (+     7us) server_negotiation.cc:399] Waiting for connection header
0925 22:40:24.311436 (+   150us) negotiation.cc:327] Negotiation complete: Network error: Server connection negotiation failed: server connection from 127.0.0.1:41196: BlockingRecv error: recv got EOF from 127.0.0.1:41196 (error 108)
Metrics: {"server-negotiator.queue_time_us":57}
[       OK ] Parameters/TestRpc.RpcPendingConnectionsMetric/SSL_UnixSocket (24 ms)
[ RUN      ] Parameters/TestRpc.TestRpcContextClientDeadline/SSL_UnixSocket
I20260925 22:40:24.349856  1577 acceptor_pool.cc:254] collecting diagnostics on the listening RPC socket unix:/tmp/dist-test-task3wW6sc/test-tmp/rpc-test-feeeccc341bc4d158dcdc15fb5e97ece.sock every 8 connection(s)
I20260925 22:40:24.349903  1576 acceptor_pool.cc:254] collecting diagnostics on the listening RPC socket unix:/tmp/dist-test-task3wW6sc/test-tmp/rpc-test-feeeccc341bc4d158dcdc15fb5e97ece.sock every 8 connection(s)
[       OK ] Parameters/TestRpc.TestRpcContextClientDeadline/SSL_UnixSocket (64 ms)
[ RUN      ] Parameters/TestRpc.TestApplicationFeatureFlagUnsupportedServer/SSL_UnixSocket
I20260925 22:40:24.407033  1601 acceptor_pool.cc:254] collecting diagnostics on the listening RPC socket unix:/tmp/dist-test-task3wW6sc/test-tmp/rpc-test-9a1bb95dbd5b4bb4b1a8ee3993235264.sock every 8 connection(s)
I20260925 22:40:24.407070  1602 acceptor_pool.cc:254] collecting diagnostics on the listening RPC socket unix:/tmp/dist-test-task3wW6sc/test-tmp/rpc-test-9a1bb95dbd5b4bb4b1a8ee3993235264.sock every 8 connection(s)
[       OK ] Parameters/TestRpc.TestApplicationFeatureFlagUnsupportedServer/SSL_UnixSocket (37 ms)
[ RUN      ] Parameters/TestRpc.TestCancellationAsync/SSL_UnixSocket
I20260925 22:40:24.450443  1627 acceptor_pool.cc:254] collecting diagnostics on the listening RPC socket unix:/tmp/dist-test-task3wW6sc/test-tmp/rpc-test-76bac0024c51440f83e92b1e8f9865a6.sock every 8 connection(s)
I20260925 22:40:24.450436  1626 acceptor_pool.cc:254] collecting diagnostics on the listening RPC socket unix:/tmp/dist-test-task3wW6sc/test-tmp/rpc-test-76bac0024c51440f83e92b1e8f9865a6.sock every 8 connection(s)
I20260925 22:40:24.450721  1194 rpc-test.cc:1716] Connecting to unix:/tmp/dist-test-task3wW6sc/test-tmp/rpc-test-76bac0024c51440f83e92b1e8f9865a6.sock
I20260925 22:40:24.459991  1194 test_util.cc:268] Using random seed: 1727253204
I20260925 22:40:24.481002  1630 rpc-test-base.h:240] got call: sleep_micros: 500 pattern: 4294967295 num_repetitions: 2097152 sidecar_idx: 0
I20260925 22:40:24.498929  1629 rpc-test-base.h:240] got call: sleep_micros: 500 pattern: 4294967295 num_repetitions: 2097152 sidecar_idx: 0
I20260925 22:40:24.515054  1630 rpc-test-base.h:240] got call: sleep_micros: 500 pattern: 4294967295 num_repetitions: 2097152 sidecar_idx: 0
I20260925 22:40:24.530815  1629 rpc-test-base.h:240] got call: sleep_micros: 500 pattern: 4294967295 num_repetitions: 2097152 sidecar_idx: 0
I20260925 22:40:24.546909  1630 rpc-test-base.h:240] got call: sleep_micros: 500 pattern: 4294967295 num_repetitions: 2097152 sidecar_idx: 0
I20260925 22:40:24.562378  1629 rpc-test-base.h:240] got call: sleep_micros: 500 pattern: 4294967295 num_repetitions: 2097152 sidecar_idx: 0
I20260925 22:40:24.578069  1630 rpc-test-base.h:240] got call: sleep_micros: 500 pattern: 4294967295 num_repetitions: 2097152 sidecar_idx: 0
I20260925 22:40:24.593665  1629 rpc-test-base.h:240] got call: sleep_micros: 500 pattern: 4294967295 num_repetitions: 2097152 sidecar_idx: 0
W20260925 22:40:24.595522  1623 connection.cc:196] Error closing socket: Network error: TlsSocket::Close: Broken pipe
W20260925 22:40:24.601447  1623 connection.cc:441] server connection from unix:<unnamed> torn down before Call kudu.rpc.GenericCalculatorService.SleepWithSidecar from unix:<unnamed> (request call id 8) could send its response
W20260925 22:40:24.611869  1623 connection.cc:441] server connection from unix:<unnamed> torn down before Call kudu.rpc.GenericCalculatorService.SleepWithSidecar from unix:<unnamed> (request call id 9) could send its response
[       OK ] Parameters/TestRpc.TestCancellationAsync/SSL_UnixSocket (188 ms)
[ RUN      ] Parameters/TestRpc.TestPerformanceBySocketType/SSL_UnixSocket
I20260925 22:40:24.631889  1651 acceptor_pool.cc:254] collecting diagnostics on the listening RPC socket unix:/tmp/dist-test-task3wW6sc/test-tmp/rpc-test-9888587975b64f2da3d962d30cb7d9a9.sock every 8 connection(s)
I20260925 22:40:24.631914  1652 acceptor_pool.cc:254] collecting diagnostics on the listening RPC socket unix:/tmp/dist-test-task3wW6sc/test-tmp/rpc-test-9888587975b64f2da3d962d30cb7d9a9.sock every 8 connection(s)
I20260925 22:40:24.632242  1194 rpc-test.cc:1846] Connecting to unix:/tmp/dist-test-task3wW6sc/test-tmp/rpc-test-9888587975b64f2da3d962d30cb7d9a9.sock
I20260925 22:40:26.288897  1194 rpc-test.cc:1859] Sending 1024MB via ssl-enabled unix socket: real 1.616s	user 2.039s	sys 0.900s
I20260925 22:40:27.860100  1194 rpc-test.cc:1859] Sending 1024MB via ssl-enabled unix socket: real 1.571s	user 1.992s	sys 0.856s
I20260925 22:40:29.475739  1194 rpc-test.cc:1859] Sending 1024MB via ssl-enabled unix socket: real 1.616s	user 2.055s	sys 0.864s
I20260925 22:40:31.055017  1194 rpc-test.cc:1859] Sending 1024MB via ssl-enabled unix socket: real 1.579s	user 1.994s	sys 0.869s
I20260925 22:40:32.586594  1194 rpc-test.cc:1859] Sending 1024MB via ssl-enabled unix socket: real 1.531s	user 1.900s	sys 0.876s
W20260925 22:40:32.587466  1648 connection.cc:196] Error closing socket: Network error: TlsSocket::Close: Broken pipe
[       OK ] Parameters/TestRpc.TestPerformanceBySocketType/SSL_UnixSocket (7975 ms)
[----------] 20 tests from Parameters/TestRpc (30102 ms total)

[----------] 1 test from Parameters/TestRpcSocketTxRxQueue
[ RUN      ] Parameters/TestRpcSocketTxRxQueue.AcceptorRxQueueSizeMetric/0
I20260925 22:40:32.590814  1676 acceptor_pool.cc:254] collecting diagnostics on the listening RPC socket 0.0.0.0:33379 every 1 connection(s)
I20260925 22:40:32.590906  1677 acceptor_pool.cc:254] collecting diagnostics on the listening RPC socket 0.0.0.0:33379 every 1 connection(s)
W20260925 22:40:32.591734  1672 negotiation.cc:337] Failed RPC negotiation. Trace:
0925 22:40:32.591467 (+     0us) reactor.cc:625] Submitting negotiation task for server connection from 127.0.0.1:50890 (local address 127.0.0.1:33379)
0925 22:40:32.591567 (+   100us) server_negotiation.cc:206] Beginning negotiation
0925 22:40:32.591570 (+     3us) server_negotiation.cc:399] Waiting for connection header
0925 22:40:32.591666 (+    96us) negotiation.cc:327] Negotiation complete: Network error: Server connection negotiation failed: server connection from 127.0.0.1:50890: BlockingRecv error: recv got EOF from 127.0.0.1:50890 (error 108)
Metrics: {"server-negotiator.queue_time_us":38}
[       OK ] Parameters/TestRpcSocketTxRxQueue.AcceptorRxQueueSizeMetric/0 (5 ms)
[----------] 1 test from Parameters/TestRpcSocketTxRxQueue (5 ms total)

[----------] Global test environment tear-down
[==========] 21 tests from 2 test suites ran. (30107 ms total)
[  PASSED  ] 20 tests.
[  FAILED  ] 1 test, listed below:
[  FAILED  ] Parameters/TestRpc.TestCallWithChainCertAndChainCA/SSL_UnixSocket, where GetParam() = (true, true)

 1 FAILED TEST