Diagnosed failure

Parameters/TestRpc.TestCallWithChainCertAndRootCA/SSL_UnixSocket: /data0/somelongdirectorytoavoidrpathissues/src/kudu/src/kudu/rpc/rpc-test.cc:303: Failure
Failed
Bad status: Runtime error: could not verify certificate chain (error with cert: subject=CN = localhost, ST = sadfjas, C = AS, emailAddress = sdflkdsajf, O = lskdfjlsad, OU = sldfkja, issuer=C = AS, ST = ASDfkjdhf, L = lskdjf, O = saldfja, OU = skdjf, CN = localhost, emailAddress = sadjflkadsj): : certificate has expired
Google Test trace:
/data0/somelongdirectorytoavoidrpathissues/src/kudu/src/kudu/rpc/rpc-test.cc:300: Connecting to unix:/tmp/dist-test-taskAUj714/test-tmp/rpc-test-6cecec53cff0410cb5f862f34381a50f.sock
I20260929 14:21:11.633777 16187 test_util.cc:175] -----------------------------------------------
I20260929 14:21:11.633952 16187 test_util.cc:176] Had fatal failures, leaving test files at /tmp/dist-test-taskAUj714/test-tmp/rpc-test.2.Parameters_TestRpc.TestCallWithChainCertAndRootCA_SSL_UnixSocket.1790691668092926-16187-0

Full log

Note: This is test shard 3 of 8.
[==========] Running 21 tests from 2 test suites.
[----------] Global test environment set-up.
[----------] 1 test from TestRpc
[ RUN      ] TestRpc.TestNegotiationTimeout
WARNING: Logging before InitGoogleLogging() is written to STDERR
I20260929 14:21:08.285598 16187 rpc-test-base.h:595] status: Timed out: connection negotiation to 0.0.0.0:45309 for RPC Sleep timed out after 0.100s (ON_OUTBOUND_QUEUE), seconds elapsed: 0.101834
W20260929 14:21:11.277678 16197 negotiation.cc:337] Failed RPC negotiation. Trace:
0929 14:21:08.184619 (+     0us) reactor.cc:625] Submitting negotiation task for client connection to 0.0.0.0:45309 (local address 127.0.0.1:52938)
0929 14:21:08.185288 (+   669us) negotiation.cc:107] Waiting for socket to connect
0929 14:21:08.185335 (+    47us) client_negotiation.cc:174] Beginning negotiation
0929 14:21:08.197754 (+ 12419us) client_negotiation.cc:252] Sending NEGOTIATE NegotiatePB request
0929 14:21:11.276156 (+3078402us) negotiation.cc:327] Negotiation complete: Timed out: Client connection negotiation failed: client connection to 0.0.0.0:45309: received 0 of 4 requested bytes
Metrics: {"client-negotiator.queue_time_us":220}
[       OK ] TestRpc.TestNegotiationTimeout (3136 ms)
[----------] 1 test from TestRpc (3136 ms total)

[----------] 20 tests from Parameters/TestRpc
[ RUN      ] Parameters/TestRpc.TestAcceptorPoolStartStop/SSL_UnixSocket
I20260929 14:21:11.309446 16214 acceptor_pool.cc:254] collecting diagnostics on the listening RPC socket unix:/tmp/dist-test-taskAUj714/test-tmp/rpc-test-61fd09c2482e4611b3eac27588134f30.sock every 8 connection(s)
I20260929 14:21:11.312449 16215 acceptor_pool.cc:254] collecting diagnostics on the listening RPC socket unix:/tmp/dist-test-taskAUj714/test-tmp/rpc-test-61fd09c2482e4611b3eac27588134f30.sock every 8 connection(s)
I20260929 14:21:11.366549 16225 acceptor_pool.cc:254] collecting diagnostics on the listening RPC socket unix:/tmp/dist-test-taskAUj714/test-tmp/rpc-test-61fd09c2482e4611b3eac27588134f30.sock every 8 connection(s)
I20260929 14:21:11.368158 16226 acceptor_pool.cc:254] collecting diagnostics on the listening RPC socket unix:/tmp/dist-test-taskAUj714/test-tmp/rpc-test-61fd09c2482e4611b3eac27588134f30.sock every 8 connection(s)
I20260929 14:21:11.414047 16236 acceptor_pool.cc:254] collecting diagnostics on the listening RPC socket unix:/tmp/dist-test-taskAUj714/test-tmp/rpc-test-61fd09c2482e4611b3eac27588134f30.sock every 8 connection(s)
I20260929 14:21:11.414811 16237 acceptor_pool.cc:254] collecting diagnostics on the listening RPC socket unix:/tmp/dist-test-taskAUj714/test-tmp/rpc-test-61fd09c2482e4611b3eac27588134f30.sock every 8 connection(s)
I20260929 14:21:11.438617 16247 acceptor_pool.cc:254] collecting diagnostics on the listening RPC socket unix:/tmp/dist-test-taskAUj714/test-tmp/rpc-test-61fd09c2482e4611b3eac27588134f30.sock every 8 connection(s)
I20260929 14:21:11.439406 16248 acceptor_pool.cc:254] collecting diagnostics on the listening RPC socket unix:/tmp/dist-test-taskAUj714/test-tmp/rpc-test-61fd09c2482e4611b3eac27588134f30.sock every 8 connection(s)
I20260929 14:21:11.482517 16258 acceptor_pool.cc:254] collecting diagnostics on the listening RPC socket unix:/tmp/dist-test-taskAUj714/test-tmp/rpc-test-61fd09c2482e4611b3eac27588134f30.sock every 8 connection(s)
I20260929 14:21:11.483306 16259 acceptor_pool.cc:254] collecting diagnostics on the listening RPC socket unix:/tmp/dist-test-taskAUj714/test-tmp/rpc-test-61fd09c2482e4611b3eac27588134f30.sock every 8 connection(s)
[       OK ] Parameters/TestRpc.TestAcceptorPoolStartStop/SSL_UnixSocket (204 ms)
[ RUN      ] Parameters/TestRpc.TestCall/SSL_UnixSocket
I20260929 14:21:11.511983 16271 acceptor_pool.cc:254] collecting diagnostics on the listening RPC socket unix:/tmp/dist-test-taskAUj714/test-tmp/rpc-test-35b44fbb51b7487799208ec94ec46c60.sock every 8 connection(s)
I20260929 14:21:11.514328 16272 acceptor_pool.cc:254] collecting diagnostics on the listening RPC socket unix:/tmp/dist-test-taskAUj714/test-tmp/rpc-test-35b44fbb51b7487799208ec94ec46c60.sock every 8 connection(s)
I20260929 14:21:11.519985 16187 rpc-test.cc:234] Connecting to unix:/tmp/dist-test-taskAUj714/test-tmp/rpc-test-35b44fbb51b7487799208ec94ec46c60.sock
W20260929 14:21:11.578745 16268 connection.cc:196] Error closing socket: Network error: TlsSocket::Close: Broken pipe
[       OK ] Parameters/TestRpc.TestCall/SSL_UnixSocket (96 ms)
[ RUN      ] Parameters/TestRpc.TestCallWithChainCertAndRootCA/SSL_UnixSocket
I20260929 14:21:11.612774 16296 acceptor_pool.cc:254] collecting diagnostics on the listening RPC socket unix:/tmp/dist-test-taskAUj714/test-tmp/rpc-test-6cecec53cff0410cb5f862f34381a50f.sock every 8 connection(s)
I20260929 14:21:11.613583 16297 acceptor_pool.cc:254] collecting diagnostics on the listening RPC socket unix:/tmp/dist-test-taskAUj714/test-tmp/rpc-test-6cecec53cff0410cb5f862f34381a50f.sock every 8 connection(s)
/data0/somelongdirectorytoavoidrpathissues/src/kudu/src/kudu/rpc/rpc-test.cc:303: Failure
Failed
Bad status: Runtime error: could not verify certificate chain (error with cert: subject=CN = localhost, ST = sadfjas, C = AS, emailAddress = sdflkdsajf, O = lskdfjlsad, OU = sldfkja, issuer=C = AS, ST = ASDfkjdhf, L = lskdjf, O = saldfja, OU = skdjf, CN = localhost, emailAddress = sadjflkadsj): : certificate has expired
Google Test trace:
/data0/somelongdirectorytoavoidrpathissues/src/kudu/src/kudu/rpc/rpc-test.cc:300: Connecting to unix:/tmp/dist-test-taskAUj714/test-tmp/rpc-test-6cecec53cff0410cb5f862f34381a50f.sock
I20260929 14:21:11.633777 16187 test_util.cc:175] -----------------------------------------------
I20260929 14:21:11.633952 16187 test_util.cc:176] Had fatal failures, leaving test files at /tmp/dist-test-taskAUj714/test-tmp/rpc-test.2.Parameters_TestRpc.TestCallWithChainCertAndRootCA_SSL_UnixSocket.1790691668092926-16187-0
[  FAILED  ] Parameters/TestRpc.TestCallWithChainCertAndRootCA/SSL_UnixSocket, where GetParam() = (true, true) (50 ms)
[ RUN      ] Parameters/TestRpc.TestCallWithBadPasswordProtectedKey/SSL_UnixSocket
[       OK ] Parameters/TestRpc.TestCallWithBadPasswordProtectedKey/SSL_UnixSocket (34 ms)
[ RUN      ] Parameters/TestRpc.TestInvalidMethodCall/SSL_UnixSocket
I20260929 14:21:11.696947 16333 acceptor_pool.cc:254] collecting diagnostics on the listening RPC socket unix:/tmp/dist-test-taskAUj714/test-tmp/rpc-test-05a70afcc9e64c91b142f1039e836d37.sock every 8 connection(s)
I20260929 14:21:11.697799 16334 acceptor_pool.cc:254] collecting diagnostics on the listening RPC socket unix:/tmp/dist-test-taskAUj714/test-tmp/rpc-test-05a70afcc9e64c91b142f1039e836d37.sock every 8 connection(s)
I20260929 14:21:11.701448 16187 rpc-test.cc:406] Connecting to unix:/tmp/dist-test-taskAUj714/test-tmp/rpc-test-05a70afcc9e64c91b142f1039e836d37.sock
W20260929 14:21:11.744575 16330 connection.cc:196] Error closing socket: Network error: TlsSocket::Close: Broken pipe
[       OK ] Parameters/TestRpc.TestInvalidMethodCall/SSL_UnixSocket (81 ms)
[ RUN      ] Parameters/TestRpc.TestHighFDs/SSL_UnixSocket
I20260929 14:21:11.982352 16359 acceptor_pool.cc:254] collecting diagnostics on the listening RPC socket unix:/tmp/dist-test-taskAUj714/test-tmp/rpc-test-4d13b79a9a2f426e8d8ca7b09b796091.sock every 8 connection(s)
I20260929 14:21:11.983210 16360 acceptor_pool.cc:254] collecting diagnostics on the listening RPC socket unix:/tmp/dist-test-taskAUj714/test-tmp/rpc-test-4d13b79a9a2f426e8d8ca7b09b796091.sock every 8 connection(s)
W20260929 14:21:12.037657 16356 connection.cc:196] Error closing socket: Network error: TlsSocket::Close: Broken pipe
[       OK ] Parameters/TestRpc.TestHighFDs/SSL_UnixSocket (301 ms)
[ RUN      ] Parameters/TestRpc.TestConnectionAlwaysKeepalive/SSL_UnixSocket
I20260929 14:21:12.073622 16382 acceptor_pool.cc:254] collecting diagnostics on the listening RPC socket unix:/tmp/dist-test-taskAUj714/test-tmp/rpc-test-e8e153a7766a40dc8190ff8d7b6f1163.sock every 8 connection(s)
I20260929 14:21:12.074354 16383 acceptor_pool.cc:254] collecting diagnostics on the listening RPC socket unix:/tmp/dist-test-taskAUj714/test-tmp/rpc-test-e8e153a7766a40dc8190ff8d7b6f1163.sock every 8 connection(s)
I20260929 14:21:12.077652 16187 rpc-test.cc:532] Connecting to unix:/tmp/dist-test-taskAUj714/test-tmp/rpc-test-e8e153a7766a40dc8190ff8d7b6f1163.sock
[       OK ] Parameters/TestRpc.TestConnectionAlwaysKeepalive/SSL_UnixSocket (3065 ms)
[ RUN      ] Parameters/TestRpc.TestReopenOutboundConnections/SSL_UnixSocket
I20260929 14:21:15.148562 16405 acceptor_pool.cc:254] collecting diagnostics on the listening RPC socket unix:/tmp/dist-test-taskAUj714/test-tmp/rpc-test-a10e0c2585444d3cb8f8c473538ff517.sock every 8 connection(s)
I20260929 14:21:15.149299 16406 acceptor_pool.cc:254] collecting diagnostics on the listening RPC socket unix:/tmp/dist-test-taskAUj714/test-tmp/rpc-test-a10e0c2585444d3cb8f8c473538ff517.sock every 8 connection(s)
I20260929 14:21:15.152663 16187 rpc-test.cc:658] Connecting to unix:/tmp/dist-test-taskAUj714/test-tmp/rpc-test-a10e0c2585444d3cb8f8c473538ff517.sock
W20260929 14:21:15.184180 16404 connection.cc:196] Error closing socket: Network error: TlsSocket::Close: Broken pipe
W20260929 14:21:15.194276 16404 connection.cc:196] Error closing socket: Network error: TlsSocket::Close: Broken pipe
W20260929 14:21:15.204679 16404 connection.cc:196] Error closing socket: Network error: TlsSocket::Close: Broken pipe
W20260929 14:21:15.225338 16404 connection.cc:196] Error closing socket: Network error: TlsSocket::Close: Broken pipe
W20260929 14:21:15.235577 16404 connection.cc:196] Error closing socket: Network error: TlsSocket::Close: Broken pipe
W20260929 14:21:15.245997 16404 connection.cc:196] Error closing socket: Network error: TlsSocket::Close: Broken pipe
W20260929 14:21:15.256959 16404 connection.cc:196] Error closing socket: Network error: TlsSocket::Close: Broken pipe
W20260929 14:21:15.267412 16404 connection.cc:196] Error closing socket: Network error: TlsSocket::Close: Broken pipe
W20260929 14:21:15.278607 16404 connection.cc:196] Error closing socket: Network error: TlsSocket::Close: Broken pipe
W20260929 14:21:15.288990 16404 connection.cc:196] Error closing socket: Network error: TlsSocket::Close: Broken pipe
W20260929 14:21:15.298765 16404 connection.cc:196] Error closing socket: Network error: TlsSocket::Close: Broken pipe
W20260929 14:21:15.308815 16404 connection.cc:196] Error closing socket: Network error: TlsSocket::Close: Broken pipe
W20260929 14:21:15.319105 16404 connection.cc:196] Error closing socket: Network error: TlsSocket::Close: Broken pipe
W20260929 14:21:15.319084 16405 acceptor_pool.cc:285] unable to collect diagnostics on RPC socket unix:/tmp/dist-test-taskAUj714/test-tmp/rpc-test-a10e0c2585444d3cb8f8c473538ff517.sock: Not implemented: netlink diagnostics is currently supported only on IPv4 TCP sockets
W20260929 14:21:15.329696 16404 connection.cc:196] Error closing socket: Network error: TlsSocket::Close: Broken pipe
W20260929 14:21:15.340276 16404 connection.cc:196] Error closing socket: Network error: TlsSocket::Close: Broken pipe
W20260929 14:21:15.350150 16404 connection.cc:196] Error closing socket: Network error: TlsSocket::Close: Broken pipe
W20260929 14:21:15.360260 16404 connection.cc:196] Error closing socket: Network error: TlsSocket::Close: Broken pipe
W20260929 14:21:15.369983 16404 connection.cc:196] Error closing socket: Network error: TlsSocket::Close: Broken pipe
W20260929 14:21:15.380272 16404 connection.cc:196] Error closing socket: Network error: TlsSocket::Close: Broken pipe
W20260929 14:21:15.390887 16404 connection.cc:196] Error closing socket: Network error: TlsSocket::Close: Broken pipe
W20260929 14:21:15.401079 16404 connection.cc:196] Error closing socket: Network error: TlsSocket::Close: Broken pipe
W20260929 14:21:15.411863 16404 connection.cc:196] Error closing socket: Network error: TlsSocket::Close: Broken pipe
W20260929 14:21:15.423193 16404 connection.cc:196] Error closing socket: Network error: TlsSocket::Close: Broken pipe
W20260929 14:21:15.433979 16404 connection.cc:196] Error closing socket: Network error: TlsSocket::Close: Broken pipe
W20260929 14:21:15.444981 16404 connection.cc:196] Error closing socket: Network error: TlsSocket::Close: Broken pipe
W20260929 14:21:15.455933 16404 connection.cc:196] Error closing socket: Network error: TlsSocket::Close: Broken pipe
W20260929 14:21:15.466048 16404 connection.cc:196] Error closing socket: Network error: TlsSocket::Close: Broken pipe
W20260929 14:21:15.476063 16404 connection.cc:196] Error closing socket: Network error: TlsSocket::Close: Broken pipe
W20260929 14:21:15.485795 16404 connection.cc:196] Error closing socket: Network error: TlsSocket::Close: Broken pipe
W20260929 14:21:15.495740 16404 connection.cc:196] Error closing socket: Network error: TlsSocket::Close: Broken pipe
[       OK ] Parameters/TestRpc.TestReopenOutboundConnections/SSL_UnixSocket (394 ms)
[ RUN      ] Parameters/TestRpc.TestConnectionNetworkPlane/SSL_UnixSocket
I20260929 14:21:15.531070 16428 acceptor_pool.cc:254] collecting diagnostics on the listening RPC socket unix:/tmp/dist-test-taskAUj714/test-tmp/rpc-test-3141f80ce2cf4a5292d9cb4c638d0b1d.sock every 8 connection(s)
I20260929 14:21:15.531827 16429 acceptor_pool.cc:254] collecting diagnostics on the listening RPC socket unix:/tmp/dist-test-taskAUj714/test-tmp/rpc-test-3141f80ce2cf4a5292d9cb4c638d0b1d.sock every 8 connection(s)
I20260929 14:21:15.535096 16187 rpc-test.cc:772] Connecting to unix:/tmp/dist-test-taskAUj714/test-tmp/rpc-test-3141f80ce2cf4a5292d9cb4c638d0b1d.sock
W20260929 14:21:15.575506 16427 connection.cc:196] Error closing socket: Network error: TlsSocket::Close: Broken pipe
W20260929 14:21:15.576263 16427 connection.cc:196] Error closing socket: Network error: TlsSocket::Close: Broken pipe
[       OK ] Parameters/TestRpc.TestConnectionNetworkPlane/SSL_UnixSocket (69 ms)
[ RUN      ] Parameters/TestRpc.TestTCPKeepalive/SSL_UnixSocket
I20260929 14:21:15.601704 16453 acceptor_pool.cc:254] collecting diagnostics on the listening RPC socket unix:/tmp/dist-test-taskAUj714/test-tmp/rpc-test-0d4dc7f3688c4b51bf98a4888b5f958a.sock every 8 connection(s)
I20260929 14:21:15.602388 16454 acceptor_pool.cc:254] collecting diagnostics on the listening RPC socket unix:/tmp/dist-test-taskAUj714/test-tmp/rpc-test-0d4dc7f3688c4b51bf98a4888b5f958a.sock every 8 connection(s)
I20260929 14:21:15.635593 16457 rpc-test-base.h:222] got call: sleep_micros: 8000000 deferred: true
I20260929 14:21:23.639875 16457 rpcz_store.cc:275] Call kudu.rpc.GenericCalculatorService.Sleep from unix:<unnamed> (request call id 0) took 8004 ms. Trace:
I20260929 14:21:23.640290 16457 rpcz_store.cc:276] 0929 14:21:15.635380 (+     0us) service_pool.cc:170] Inserting onto call queue
0929 14:21:15.635535 (+   155us) service_pool.cc:227] Handling call
0929 14:21:23.639694 (+8004159us) inbound_call.cc:173] Queueing success response
Metrics: {}
[       OK ] Parameters/TestRpc.TestTCPKeepalive/SSL_UnixSocket (8072 ms)
[ RUN      ] Parameters/TestRpc.TestMaxSmallSidecars/SSL_UnixSocket
I20260929 14:21:23.674358 16479 acceptor_pool.cc:254] collecting diagnostics on the listening RPC socket unix:/tmp/dist-test-taskAUj714/test-tmp/rpc-test-30b8327050474101aa3d205824ba6e82.sock every 8 connection(s)
I20260929 14:21:23.675156 16480 acceptor_pool.cc:254] collecting diagnostics on the listening RPC socket unix:/tmp/dist-test-taskAUj714/test-tmp/rpc-test-30b8327050474101aa3d205824ba6e82.sock every 8 connection(s)
W20260929 14:21:23.853283 16476 connection.cc:196] Error closing socket: Network error: TlsSocket::Close: Broken pipe
[       OK ] Parameters/TestRpc.TestMaxSmallSidecars/SSL_UnixSocket (204 ms)
[ RUN      ] Parameters/TestRpc.TestCallTimeout/SSL_UnixSocket
I20260929 14:21:23.879397 16505 acceptor_pool.cc:254] collecting diagnostics on the listening RPC socket unix:/tmp/dist-test-taskAUj714/test-tmp/rpc-test-38c385bfdfdf4c359b8b79e4bfbbe7e8.sock every 8 connection(s)
I20260929 14:21:23.880214 16506 acceptor_pool.cc:254] collecting diagnostics on the listening RPC socket unix:/tmp/dist-test-taskAUj714/test-tmp/rpc-test-38c385bfdfdf4c359b8b79e4bfbbe7e8.sock every 8 connection(s)
I20260929 14:21:23.900674 16187 rpc-test-base.h:595] status: Timed out: connection negotiation to unix:/tmp/dist-test-taskAUj714/test-tmp/rpc-test-38c385bfdfdf4c359b8b79e4bfbbe7e8.sock for RPC Sleep timed out after 0.000s (ON_OUTBOUND_QUEUE), seconds elapsed: 0.00254843
I20260929 14:21:23.908567 16509 rpc-test-base.h:222] got call: sleep_micros: 700000
I20260929 14:21:24.102355 16187 rpc-test-base.h:595] status: Timed out: Sleep RPC to unix:/tmp/dist-test-taskAUj714/test-tmp/rpc-test-38c385bfdfdf4c359b8b79e4bfbbe7e8.sock timed out after 0.200s (SENT), seconds elapsed: 0.201353
I20260929 14:21:24.103977 16508 rpc-test-base.h:222] got call: sleep_micros: 2000000
W20260929 14:21:24.609269 16509 rpcz_store.cc:267] Call kudu.rpc.GenericCalculatorService.Sleep from unix:<unnamed> (request call id 1) took 700 ms (client timeout 200 ms). Trace:
W20260929 14:21:24.609776 16509 rpcz_store.cc:269] 0929 14:21:23.908406 (+     0us) service_pool.cc:170] Inserting onto call queue
0929 14:21:23.908516 (+   110us) service_pool.cc:227] Handling call
0929 14:21:24.609211 (+700695us) inbound_call.cc:173] Queueing success response
Metrics: {}
I20260929 14:21:25.605291 16187 rpc-test-base.h:595] status: Timed out: Sleep RPC to unix:/tmp/dist-test-taskAUj714/test-tmp/rpc-test-38c385bfdfdf4c359b8b79e4bfbbe7e8.sock timed out after 1.500s (SENT), seconds elapsed: 1.50255
W20260929 14:21:26.104611 16508 rpcz_store.cc:267] Call kudu.rpc.GenericCalculatorService.Sleep from unix:<unnamed> (request call id 2) took 2001 ms (client timeout 1500 ms). Trace:
W20260929 14:21:26.105033 16508 rpcz_store.cc:269] 0929 14:21:24.103643 (+     0us) service_pool.cc:170] Inserting onto call queue
0929 14:21:24.103800 (+   157us) service_pool.cc:227] Handling call
0929 14:21:26.104538 (+2000738us) inbound_call.cc:173] Queueing success response
Metrics: {}
W20260929 14:21:26.105667 16502 connection.cc:441] server connection from unix:<unnamed> torn down before Call kudu.rpc.GenericCalculatorService.Sleep from unix:<unnamed> (request call id 2) could send its response
[       OK ] Parameters/TestRpc.TestCallTimeout/SSL_UnixSocket (2252 ms)
[ RUN      ] Parameters/TestRpc.TestServerShutsDown/SSL_UnixSocket
I20260929 14:21:26.113088 16187 rpc-test.cc:1125] Connecting to 0.0.0.0:37911
W20260929 14:21:26.124003 16522 negotiation.cc:337] Failed RPC negotiation. Trace:
0929 14:21:26.122408 (+     0us) reactor.cc:625] Submitting negotiation task for client connection to 0.0.0.0:37911 (local address 127.0.0.1:37362)
0929 14:21:26.122902 (+   494us) negotiation.cc:107] Waiting for socket to connect
0929 14:21:26.122934 (+    32us) client_negotiation.cc:174] Beginning negotiation
0929 14:21:26.123152 (+   218us) client_negotiation.cc:252] Sending NEGOTIATE NegotiatePB request
0929 14:21:26.123400 (+   248us) negotiation.cc:327] Negotiation complete: Network error: Client connection negotiation failed: client connection to 0.0.0.0:37911: BlockingWrite error: write error: Broken pipe (error 32)
Metrics: {"client-negotiator.queue_time_us":133}
[       OK ] Parameters/TestRpc.TestServerShutsDown/SSL_UnixSocket (15 ms)
[ RUN      ] Parameters/TestRpc.TimedOutOnResponseMetric/SSL_UnixSocket
I20260929 14:21:26.158541 16539 acceptor_pool.cc:254] collecting diagnostics on the listening RPC socket unix:/tmp/dist-test-taskAUj714/test-tmp/rpc-test-0fa01ffa57f649ff99883f6db8fa3b04.sock every 8 connection(s)
I20260929 14:21:26.159291 16540 acceptor_pool.cc:254] collecting diagnostics on the listening RPC socket unix:/tmp/dist-test-taskAUj714/test-tmp/rpc-test-0fa01ffa57f649ff99883f6db8fa3b04.sock every 8 connection(s)
W20260929 14:21:26.402848 16543 rpcz_store.cc:267] Call kudu.rpc_test.CalculatorService.Sleep from unix:<unnamed> (request call id 3) took 50 ms (client timeout 25 ms). Trace:
W20260929 14:21:26.403262 16543 rpcz_store.cc:269] 0929 14:21:26.352163 (+     0us) service_pool.cc:170] Inserting onto call queue
0929 14:21:26.352276 (+   113us) service_pool.cc:227] Handling call
0929 14:21:26.402746 (+ 50470us) inbound_call.cc:173] Queueing success response
Related trace 'test_child':
Metrics: {"test_sleep_us":50000,"child_traces":[["test_child",{"related_trace_metric":1}]]}
W20260929 14:21:26.462652 16543 rpcz_store.cc:267] Call kudu.rpc_test.CalculatorService.Sleep from unix:<unnamed> (request call id 4) took 50 ms (client timeout 50 ms). Trace:
W20260929 14:21:26.462944 16543 rpcz_store.cc:269] 0929 14:21:26.412075 (+     0us) service_pool.cc:170] Inserting onto call queue
0929 14:21:26.412204 (+   129us) service_pool.cc:227] Handling call
0929 14:21:26.462584 (+ 50380us) inbound_call.cc:173] Queueing success response
Related trace 'test_child':
Metrics: {"test_sleep_us":50000,"child_traces":[["test_child",{"related_trace_metric":1}]]}
W20260929 14:21:26.466388 16536 connection.cc:196] Error closing socket: Network error: TlsSocket::Close: Broken pipe
[       OK ] Parameters/TestRpc.TimedOutOnResponseMetric/SSL_UnixSocket (344 ms)
[ RUN      ] Parameters/TestRpc.AcceptorDispatchingTimesMetric/SSL_UnixSocket
I20260929 14:21:26.484156 16564 acceptor_pool.cc:254] collecting diagnostics on the listening RPC socket 0.0.0.0:36519 every 8 connection(s)
I20260929 14:21:26.484900 16565 acceptor_pool.cc:254] collecting diagnostics on the listening RPC socket 0.0.0.0:36519 every 8 connection(s)
W20260929 14:21:26.490031 16560 negotiation.cc:337] Failed RPC negotiation. Trace:
0929 14:21:26.488804 (+     0us) reactor.cc:625] Submitting negotiation task for server connection from 127.0.0.1:35770 (local address 127.0.0.1:36519)
0929 14:21:26.489241 (+   437us) server_negotiation.cc:206] Beginning negotiation
0929 14:21:26.489258 (+    17us) server_negotiation.cc:399] Waiting for connection header
0929 14:21:26.489494 (+   236us) negotiation.cc:327] Negotiation complete: Network error: Server connection negotiation failed: server connection from 127.0.0.1:35770: BlockingRecv error: recv got EOF from 127.0.0.1:35770 (error 108)
Metrics: {"server-negotiator.queue_time_us":144}
[       OK ] Parameters/TestRpc.AcceptorDispatchingTimesMetric/SSL_UnixSocket (23 ms)
[ RUN      ] Parameters/TestRpc.TestRpcCallbackDestroysMessenger/SSL_UnixSocket
[       OK ] Parameters/TestRpc.TestRpcCallbackDestroysMessenger/SSL_UnixSocket (24 ms)
[ RUN      ] Parameters/TestRpc.TestApplicationFeatureFlag/SSL_UnixSocket
I20260929 14:21:26.539216 16589 acceptor_pool.cc:254] collecting diagnostics on the listening RPC socket unix:/tmp/dist-test-taskAUj714/test-tmp/rpc-test-2eee04de32b542fa906f0adb9c19f846.sock every 8 connection(s)
I20260929 14:21:26.539991 16590 acceptor_pool.cc:254] collecting diagnostics on the listening RPC socket unix:/tmp/dist-test-taskAUj714/test-tmp/rpc-test-2eee04de32b542fa906f0adb9c19f846.sock every 8 connection(s)
W20260929 14:21:26.577049 16586 messenger.cc:357] Unable to handle RPC call: Not implemented: call requires unsupported application feature flags: 99
W20260929 14:21:26.580267 16586 connection.cc:196] Error closing socket: Network error: TlsSocket::Close: Broken pipe
[       OK ] Parameters/TestRpc.TestApplicationFeatureFlag/SSL_UnixSocket (66 ms)
[ RUN      ] Parameters/TestRpc.TestCancellation/SSL_UnixSocket
I20260929 14:21:26.615216 16614 acceptor_pool.cc:254] collecting diagnostics on the listening RPC socket unix:/tmp/dist-test-taskAUj714/test-tmp/rpc-test-3fac9a0f579e4b5f98a52abea7b9e835.sock every 8 connection(s)
I20260929 14:21:26.616007 16615 acceptor_pool.cc:254] collecting diagnostics on the listening RPC socket unix:/tmp/dist-test-taskAUj714/test-tmp/rpc-test-3fac9a0f579e4b5f98a52abea7b9e835.sock every 8 connection(s)
I20260929 14:21:26.619123 16187 rpc-test.cc:1648] Connecting to unix:/tmp/dist-test-taskAUj714/test-tmp/rpc-test-3fac9a0f579e4b5f98a52abea7b9e835.sock
I20260929 14:21:26.736940 16187 rpc-test-base.h:595] status: Aborted: Sleep RPC to unix:/tmp/dist-test-taskAUj714/test-tmp/rpc-test-3fac9a0f579e4b5f98a52abea7b9e835.sock is cancelled in state READY, seconds elapsed: 0.000411965
I20260929 14:21:26.942310 16187 rpc-test-base.h:595] status: Aborted: Sleep RPC to unix:/tmp/dist-test-taskAUj714/test-tmp/rpc-test-3fac9a0f579e4b5f98a52abea7b9e835.sock is cancelled in state SENT, seconds elapsed: 0.00100863
I20260929 14:21:26.942698 16617 rpc-test-base.h:222] got call: sleep_micros: 510000
I20260929 14:21:27.129722 16187 rpc-test-base.h:595] status: Aborted: Sleep RPC to unix:/tmp/dist-test-taskAUj714/test-tmp/rpc-test-3fac9a0f579e4b5f98a52abea7b9e835.sock is cancelled in state SENT, seconds elapsed: 0.000960095
I20260929 14:21:27.129896 16616 rpc-test-base.h:222] got call: sleep_micros: 510000
I20260929 14:21:27.326036 16187 rpc-test-base.h:595] status: Aborted: Sleep RPC to unix:/tmp/dist-test-taskAUj714/test-tmp/rpc-test-3fac9a0f579e4b5f98a52abea7b9e835.sock is cancelled in state SENT, seconds elapsed: 0.000675328
W20260929 14:21:27.336910 16618 rpcz_store.cc:267] Call kudu.rpc.GenericCalculatorService.Sleep from unix:<unnamed> (request call id 11) took 10 ms (client timeout 10 ms). Trace:
W20260929 14:21:27.337216 16618 rpcz_store.cc:269] 0929 14:21:27.326184 (+     0us) service_pool.cc:170] Inserting onto call queue
0929 14:21:27.336614 (+ 10430us) service_pool.cc:214] Skipping call since client already timed out
0929 14:21:27.336724 (+   110us) inbound_call.cc:173] Queueing failure response
Metrics: {}
I20260929 14:21:27.337793 16618 rpc-test-base.h:222] got call: sleep_micros: 1500000
W20260929 14:21:27.453397 16617 rpcz_store.cc:267] Call kudu.rpc.GenericCalculatorService.Sleep from unix:<unnamed> (request call id 3) took 511 ms (client timeout 10 ms). Trace:
W20260929 14:21:27.453751 16617 rpcz_store.cc:269] 0929 14:21:26.942325 (+     0us) service_pool.cc:170] Inserting onto call queue
0929 14:21:26.942512 (+   187us) service_pool.cc:227] Handling call
0929 14:21:27.453275 (+510763us) inbound_call.cc:173] Queueing success response
Metrics: {}
W20260929 14:21:27.640511 16616 rpcz_store.cc:267] Call kudu.rpc.GenericCalculatorService.Sleep from unix:<unnamed> (request call id 7) took 510 ms (client timeout 10 ms). Trace:
W20260929 14:21:27.640872 16616 rpcz_store.cc:269] 0929 14:21:27.129692 (+     0us) service_pool.cc:170] Inserting onto call queue
0929 14:21:27.129835 (+   143us) service_pool.cc:227] Handling call
0929 14:21:27.640451 (+510616us) inbound_call.cc:173] Queueing success response
Metrics: {}
I20260929 14:21:28.328663 16187 rpc-test-base.h:595] status: Timed out: Sleep RPC to unix:/tmp/dist-test-taskAUj714/test-tmp/rpc-test-3fac9a0f579e4b5f98a52abea7b9e835.sock timed out after 1.000s (SENT), seconds elapsed: 1.00218
I20260929 14:21:28.330616 16616 rpc-test-base.h:222] got call: sleep_micros: 1500000
W20260929 14:21:28.838510 16618 rpcz_store.cc:267] Call kudu.rpc.GenericCalculatorService.Sleep from unix:<unnamed> (request call id 12) took 1511 ms (client timeout 1000 ms). Trace:
W20260929 14:21:28.838853 16618 rpcz_store.cc:269] 0929 14:21:27.327057 (+     0us) service_pool.cc:170] Inserting onto call queue
0929 14:21:27.337754 (+ 10697us) service_pool.cc:227] Handling call
0929 14:21:28.838366 (+1500612us) inbound_call.cc:173] Queueing success response
Metrics: {}
I20260929 14:21:29.331528 16187 rpc-test-base.h:595] status: Timed out: Sleep RPC to unix:/tmp/dist-test-taskAUj714/test-tmp/rpc-test-3fac9a0f579e4b5f98a52abea7b9e835.sock timed out after 1.000s (SENT), seconds elapsed: 1.00239
W20260929 14:21:29.333096 16611 messenger.cc:357] Unable to handle RPC call: Not implemented: call requires unsupported application feature flags: 99, 1
W20260929 14:21:29.334649 16611 messenger.cc:357] Unable to handle RPC call: Not implemented: call requires unsupported application feature flags: 99, 1
W20260929 14:21:29.571713 16611 connection.cc:196] Error closing socket: Network error: TlsSocket::Close: Broken pipe
W20260929 14:21:29.831269 16616 rpcz_store.cc:267] Call kudu.rpc.GenericCalculatorService.Sleep from unix:<unnamed> (request call id 13) took 1501 ms (client timeout 1000 ms). Trace:
W20260929 14:21:29.831745 16616 rpcz_store.cc:269] 0929 14:21:28.330250 (+     0us) service_pool.cc:170] Inserting onto call queue
0929 14:21:28.330494 (+   244us) service_pool.cc:227] Handling call
0929 14:21:29.831207 (+1500713us) inbound_call.cc:173] Queueing success response
Metrics: {}
W20260929 14:21:29.832382 16611 connection.cc:441] server connection from unix:<unnamed> torn down before Call kudu.rpc.GenericCalculatorService.Sleep from unix:<unnamed> (request call id 13) could send its response
[       OK ] Parameters/TestRpc.TestCancellation/SSL_UnixSocket (3254 ms)
[ RUN      ] Parameters/TestRpc.TestCancellationMultiThreads/SSL_UnixSocket
I20260929 14:21:29.876807 16641 acceptor_pool.cc:254] collecting diagnostics on the listening RPC socket unix:/tmp/dist-test-taskAUj714/test-tmp/rpc-test-f93586bf8d434c6ba404c4709a1831b4.sock every 8 connection(s)
I20260929 14:21:29.877694 16642 acceptor_pool.cc:254] collecting diagnostics on the listening RPC socket unix:/tmp/dist-test-taskAUj714/test-tmp/rpc-test-f93586bf8d434c6ba404c4709a1831b4.sock every 8 connection(s)
I20260929 14:21:29.880936 16187 rpc-test.cc:1808] Connecting to unix:/tmp/dist-test-taskAUj714/test-tmp/rpc-test-f93586bf8d434c6ba404c4709a1831b4.sock
I20260929 14:21:30.050196 16655 test_util.cc:268] Using random seed: -434736602
I20260929 14:21:30.051301 16656 test_util.cc:268] Using random seed: -434735413
I20260929 14:21:30.052757 16657 test_util.cc:268] Using random seed: -434733962
I20260929 14:21:30.054261 16659 test_util.cc:268] Using random seed: -434732543
I20260929 14:21:30.055851 16660 test_util.cc:268] Using random seed: -434730974
I20260929 14:21:30.057228 16661 test_util.cc:268] Using random seed: -434729589
I20260929 14:21:30.059489 16662 test_util.cc:268] Using random seed: -434727394
I20260929 14:21:30.061331 16663 test_util.cc:268] Using random seed: -434725532
I20260929 14:21:30.063117 16664 test_util.cc:268] Using random seed: -434723710
I20260929 14:21:30.064339 16665 test_util.cc:268] Using random seed: -434722473
I20260929 14:21:30.066152 16666 test_util.cc:268] Using random seed: -434720663
I20260929 14:21:30.068171 16667 test_util.cc:268] Using random seed: -434718669
I20260929 14:21:30.072084 16668 test_util.cc:268] Using random seed: -434714840
I20260929 14:21:30.072991 16669 test_util.cc:268] Using random seed: -434713878
I20260929 14:21:30.076736 16670 test_util.cc:268] Using random seed: -434710105
I20260929 14:21:30.079097 16671 test_util.cc:268] Using random seed: -434707755
I20260929 14:21:30.081338 16672 test_util.cc:268] Using random seed: -434705974
I20260929 14:21:30.084802 16673 test_util.cc:268] Using random seed: -434702515
I20260929 14:21:30.086521 16674 test_util.cc:268] Using random seed: -434700371
I20260929 14:21:30.088471 16675 test_util.cc:268] Using random seed: -434698369
I20260929 14:21:30.090492 16676 test_util.cc:268] Using random seed: -434696350
I20260929 14:21:30.092622 16677 test_util.cc:268] Using random seed: -434694251
I20260929 14:21:30.095124 16678 test_util.cc:268] Using random seed: -434691748
I20260929 14:21:30.097285 16679 test_util.cc:268] Using random seed: -434689614
I20260929 14:21:30.099432 16680 test_util.cc:268] Using random seed: -434687424
I20260929 14:21:30.101615 16681 test_util.cc:268] Using random seed: -434685350
I20260929 14:21:30.103609 16682 test_util.cc:268] Using random seed: -434683598
I20260929 14:21:30.105281 16683 test_util.cc:268] Using random seed: -434681592
I20260929 14:21:30.108281 16684 test_util.cc:268] Using random seed: -434678646
I20260929 14:21:30.110335 16685 test_util.cc:268] Using random seed: -434676549
W20260929 14:21:50.426353 16638 connection.cc:196] Error closing socket: Network error: TlsSocket::Close: Broken pipe
[       OK ] Parameters/TestRpc.TestCancellationMultiThreads/SSL_UnixSocket (20604 ms)
[ RUN      ] Parameters/TestRpc.TestCallId/SSL_UnixSocket
I20260929 14:21:50.471807 16699 acceptor_pool.cc:254] collecting diagnostics on the listening RPC socket unix:/tmp/dist-test-taskAUj714/test-tmp/rpc-test-200dbca7a11c4f3bb548d4ceda696f36.sock every 8 connection(s)
I20260929 14:21:50.472692 16700 acceptor_pool.cc:254] collecting diagnostics on the listening RPC socket unix:/tmp/dist-test-taskAUj714/test-tmp/rpc-test-200dbca7a11c4f3bb548d4ceda696f36.sock every 8 connection(s)
[       OK ] Parameters/TestRpc.TestCallId/SSL_UnixSocket (96 ms)
[----------] 20 tests from Parameters/TestRpc (39259 ms total)

[----------] Global test environment tear-down
[==========] 21 tests from 2 test suites ran. (42396 ms total)
[  PASSED  ] 20 tests.
[  FAILED  ] 1 test, listed below:
[  FAILED  ] Parameters/TestRpc.TestCallWithChainCertAndRootCA/SSL_UnixSocket, where GetParam() = (true, true)

 1 FAILED TEST
I20260929 14:21:50.559751 16187 logging.cc:424] LogThrottler /data0/somelongdirectorytoavoidrpathissues/src/kudu/src/kudu/rpc/acceptor_pool.cc:285: suppressed but not reported on 3 messages since previous log ~35 seconds ago