Diagnosed failure

Parameters/TestRpc.TestCallWithChainCertAndChainCA/SSL_UnixSocket: /data0/somelongdirectorytoavoidrpathissues/src/kudu/src/kudu/rpc/rpc-test.cc:270: Failure
Failed
Bad status: Runtime error: could not verify certificate chain (error with cert: subject=CN = localhost, ST = sadfjas, C = AS, emailAddress = sdflkdsajf, O = lskdfjlsad, OU = sldfkja, issuer=C = AS, ST = ASDfkjdhf, L = lskdjf, O = saldfja, OU = skdjf, CN = localhost, emailAddress = sadjflkadsj): : certificate has expired
Google Test trace:
/data0/somelongdirectorytoavoidrpathissues/src/kudu/src/kudu/rpc/rpc-test.cc:267: Connecting to unix:/tmp/dist-test-taski8pofg/test-tmp/rpc-test-ebbffbf9d34645348909143ef6324b21.sock
I20260926 13:41:58.076793   384 test_util.cc:175] -----------------------------------------------
I20260926 13:41:58.076861   384 test_util.cc:176] Had fatal failures, leaving test files at /tmp/dist-test-taski8pofg/test-tmp/rpc-test.6.Parameters_TestRpc.TestCallWithChainCertAndChainCA_SSL_UnixSocket.1790430118025412-384-0

Full log

Note: This is test shard 7 of 8.
[==========] Running 21 tests from 2 test suites.
[----------] Global test environment set-up.
[----------] 20 tests from Parameters/TestRpc
[ RUN      ] Parameters/TestRpc.TestMessengerCreateDestroy/SSL_UnixSocket
WARNING: Logging before InitGoogleLogging() is written to STDERR
I20260926 13:41:58.046785   384 rpc-test.cc:169] started messenger TestCreateDestroy
[       OK ] Parameters/TestRpc.TestMessengerCreateDestroy/SSL_UnixSocket (16 ms)
[ RUN      ] Parameters/TestRpc.TestNegotiationDeadlock/SSL_UnixSocket
I20260926 13:41:58.053723   405 acceptor_pool.cc:254] collecting diagnostics on the listening RPC socket unix:/tmp/dist-test-taski8pofg/test-tmp/rpc-test-f3066dbcd7ab42ef990cd0d86808ca7f.sock every 8 connection(s)
I20260926 13:41:58.053766   404 acceptor_pool.cc:254] collecting diagnostics on the listening RPC socket unix:/tmp/dist-test-taski8pofg/test-tmp/rpc-test-f3066dbcd7ab42ef990cd0d86808ca7f.sock every 8 connection(s)
[       OK ] Parameters/TestRpc.TestNegotiationDeadlock/SSL_UnixSocket (14 ms)
[ RUN      ] Parameters/TestRpc.TestCallWithChainCertAndChainCA/SSL_UnixSocket
I20260926 13:41:58.072213   420 acceptor_pool.cc:254] collecting diagnostics on the listening RPC socket unix:/tmp/dist-test-taski8pofg/test-tmp/rpc-test-ebbffbf9d34645348909143ef6324b21.sock every 8 connection(s)
I20260926 13:41:58.072252   421 acceptor_pool.cc:254] collecting diagnostics on the listening RPC socket unix:/tmp/dist-test-taski8pofg/test-tmp/rpc-test-ebbffbf9d34645348909143ef6324b21.sock every 8 connection(s)
/data0/somelongdirectorytoavoidrpathissues/src/kudu/src/kudu/rpc/rpc-test.cc:270: Failure
Failed
Bad status: Runtime error: could not verify certificate chain (error with cert: subject=CN = localhost, ST = sadfjas, C = AS, emailAddress = sdflkdsajf, O = lskdfjlsad, OU = sldfkja, issuer=C = AS, ST = ASDfkjdhf, L = lskdjf, O = saldfja, OU = skdjf, CN = localhost, emailAddress = sadjflkadsj): : certificate has expired
Google Test trace:
/data0/somelongdirectorytoavoidrpathissues/src/kudu/src/kudu/rpc/rpc-test.cc:267: Connecting to unix:/tmp/dist-test-taski8pofg/test-tmp/rpc-test-ebbffbf9d34645348909143ef6324b21.sock
I20260926 13:41:58.076793   384 test_util.cc:175] -----------------------------------------------
I20260926 13:41:58.076861   384 test_util.cc:176] Had fatal failures, leaving test files at /tmp/dist-test-taski8pofg/test-tmp/rpc-test.6.Parameters_TestRpc.TestCallWithChainCertAndChainCA_SSL_UnixSocket.1790430118025412-384-0
[  FAILED  ] Parameters/TestRpc.TestCallWithChainCertAndChainCA/SSL_UnixSocket, where GetParam() = (true, true) (13 ms)
[ RUN      ] Parameters/TestRpc.TestCallWithPasswordProtectedKey/SSL_UnixSocket
I20260926 13:41:58.086400   445 acceptor_pool.cc:254] collecting diagnostics on the listening RPC socket unix:/tmp/dist-test-taski8pofg/test-tmp/rpc-test-93b3500c68a340e8a4fe04aa5015d86d.sock every 8 connection(s)
I20260926 13:41:58.086434   446 acceptor_pool.cc:254] collecting diagnostics on the listening RPC socket unix:/tmp/dist-test-taski8pofg/test-tmp/rpc-test-93b3500c68a340e8a4fe04aa5015d86d.sock every 8 connection(s)
W20260926 13:41:58.098663   442 connection.cc:196] Error closing socket: Network error: TlsSocket::Close: Broken pipe
[       OK ] Parameters/TestRpc.TestCallWithPasswordProtectedKey/SSL_UnixSocket (22 ms)
[ RUN      ] Parameters/TestRpc.TestCallToBadServer/SSL_UnixSocket
I20260926 13:41:58.112943   384 rpc-test.cc:394] Status: Network error: Client connection negotiation failed: client connection to 0.0.0.0:0: connect: Connection refused (error 111)
I20260926 13:41:58.113336   384 rpc-test.cc:394] Status: Network error: Client connection negotiation failed: client connection to 0.0.0.0:0: connect: Connection refused (error 111)
I20260926 13:41:58.113758   384 rpc-test.cc:394] Status: Network error: Client connection negotiation failed: client connection to 0.0.0.0:0: connect: Connection refused (error 111)
I20260926 13:41:58.114197   384 rpc-test.cc:394] Status: Network error: Client connection negotiation failed: client connection to 0.0.0.0:0: connect: Connection refused (error 111)
I20260926 13:41:58.114652   384 rpc-test.cc:394] Status: Network error: Client connection negotiation failed: client connection to 0.0.0.0:0: connect: Connection refused (error 111)
[       OK ] Parameters/TestRpc.TestCallToBadServer/SSL_UnixSocket (15 ms)
[ RUN      ] Parameters/TestRpc.TestWrongService/SSL_UnixSocket
I20260926 13:41:58.125985   480 acceptor_pool.cc:254] collecting diagnostics on the listening RPC socket unix:/tmp/dist-test-taski8pofg/test-tmp/rpc-test-9c59cc7f16c3487592200f622117b895.sock every 8 connection(s)
I20260926 13:41:58.126003   481 acceptor_pool.cc:254] collecting diagnostics on the listening RPC socket unix:/tmp/dist-test-taski8pofg/test-tmp/rpc-test-9c59cc7f16c3487592200f622117b895.sock every 8 connection(s)
I20260926 13:41:58.140419   477 messenger.cc:345] service WrongServiceName not registered on TestServer
[       OK ] Parameters/TestRpc.TestWrongService/SSL_UnixSocket (27 ms)
[ RUN      ] Parameters/TestRpc.TestConnectionKeepalive/SSL_UnixSocket
I20260926 13:41:58.166666   503 acceptor_pool.cc:254] collecting diagnostics on the listening RPC socket unix:/tmp/dist-test-taski8pofg/test-tmp/rpc-test-88e5b51279dc4fe3895d09430558ba11.sock every 8 connection(s)
I20260926 13:41:58.166734   504 acceptor_pool.cc:254] collecting diagnostics on the listening RPC socket unix:/tmp/dist-test-taski8pofg/test-tmp/rpc-test-88e5b51279dc4fe3895d09430558ba11.sock every 8 connection(s)
I20260926 13:41:58.167081   384 rpc-test.cc:488] Connecting to unix:/tmp/dist-test-taski8pofg/test-tmp/rpc-test-88e5b51279dc4fe3895d09430558ba11.sock
W20260926 13:41:58.644698   516 connection.cc:196] Error closing socket: Network error: TlsSocket::Close: Broken pipe
[       OK ] Parameters/TestRpc.TestConnectionKeepalive/SSL_UnixSocket (1060 ms)
[ RUN      ] Parameters/TestRpc.TestClientConnectionMetrics/SSL_UnixSocket
I20260926 13:41:59.222640   528 acceptor_pool.cc:254] collecting diagnostics on the listening RPC socket unix:/tmp/dist-test-taski8pofg/test-tmp/rpc-test-b5372d7bd33b4bc3a9ac60bbb6309031.sock every 8 connection(s)
I20260926 13:41:59.222699   529 acceptor_pool.cc:254] collecting diagnostics on the listening RPC socket unix:/tmp/dist-test-taski8pofg/test-tmp/rpc-test-b5372d7bd33b4bc3a9ac60bbb6309031.sock every 8 connection(s)
I20260926 13:41:59.223014   384 rpc-test.cc:569] Connecting to unix:/tmp/dist-test-taski8pofg/test-tmp/rpc-test-b5372d7bd33b4bc3a9ac60bbb6309031.sock
W20260926 13:42:09.364624   525 connection.cc:196] Error closing socket: Network error: TlsSocket::Close: Broken pipe
[       OK ] Parameters/TestRpc.TestClientConnectionMetrics/SSL_UnixSocket (10162 ms)
[ RUN      ] Parameters/TestRpc.TestCredentialsPolicy/SSL_UnixSocket
I20260926 13:42:09.388072   551 acceptor_pool.cc:254] collecting diagnostics on the listening RPC socket unix:/tmp/dist-test-taski8pofg/test-tmp/rpc-test-2fc893644d984ad69e8cecd666c2ef29.sock every 8 connection(s)
I20260926 13:42:09.388116   552 acceptor_pool.cc:254] collecting diagnostics on the listening RPC socket unix:/tmp/dist-test-taski8pofg/test-tmp/rpc-test-2fc893644d984ad69e8cecd666c2ef29.sock every 8 connection(s)
I20260926 13:42:09.388484   384 rpc-test.cc:700] Connecting to unix:/tmp/dist-test-taski8pofg/test-tmp/rpc-test-2fc893644d984ad69e8cecd666c2ef29.sock
W20260926 13:42:09.413200   550 connection.cc:196] Error closing socket: Network error: TlsSocket::Close: Broken pipe
W20260926 13:42:09.417491   550 connection.cc:196] Error closing socket: Network error: TlsSocket::Close: Broken pipe
[       OK ] Parameters/TestRpc.TestCredentialsPolicy/SSL_UnixSocket (52 ms)
[ RUN      ] Parameters/TestRpc.TestCallLongerThanKeepalive/SSL_UnixSocket
I20260926 13:42:09.435776   576 acceptor_pool.cc:254] collecting diagnostics on the listening RPC socket unix:/tmp/dist-test-taski8pofg/test-tmp/rpc-test-c39045fd13c845bd832c99e58617c1c8.sock every 8 connection(s)
I20260926 13:42:09.435820   577 acceptor_pool.cc:254] collecting diagnostics on the listening RPC socket unix:/tmp/dist-test-taski8pofg/test-tmp/rpc-test-c39045fd13c845bd832c99e58617c1c8.sock every 8 connection(s)
I20260926 13:42:09.472654   580 rpc-test-base.h:222] got call: sleep_micros: 3000000 deferred: true
I20260926 13:42:12.473452   580 rpcz_store.cc:275] Call kudu.rpc.GenericCalculatorService.Sleep from unix:<unnamed> (request call id 0) took 3000 ms. Trace:
I20260926 13:42:12.473565   580 rpcz_store.cc:276] 0926 13:42:09.472588 (+     0us) service_pool.cc:170] Inserting onto call queue
0926 13:42:09.472637 (+    49us) service_pool.cc:227] Handling call
0926 13:42:12.473431 (+3000794us) inbound_call.cc:173] Queueing success response
Metrics: {}
W20260926 13:42:12.475152   573 connection.cc:196] Error closing socket: Network error: TlsSocket::Close: Broken pipe
[       OK ] Parameters/TestRpc.TestCallLongerThanKeepalive/SSL_UnixSocket (3058 ms)
[ RUN      ] Parameters/TestRpc.TestRpcSidecar/SSL_UnixSocket
I20260926 13:42:12.485522   601 acceptor_pool.cc:254] collecting diagnostics on the listening RPC socket unix:/tmp/dist-test-taski8pofg/test-tmp/rpc-test-4f2e91d78cc9400b99f58f5567e989a0.sock every 8 connection(s)
I20260926 13:42:12.485644   602 acceptor_pool.cc:254] collecting diagnostics on the listening RPC socket unix:/tmp/dist-test-taski8pofg/test-tmp/rpc-test-4f2e91d78cc9400b99f58f5567e989a0.sock every 8 connection(s)
W20260926 13:42:12.539384   598 connection.cc:196] Error closing socket: Network error: TlsSocket::Close: Broken pipe
[       OK ] Parameters/TestRpc.TestRpcSidecar/SSL_UnixSocket (64 ms)
[ RUN      ] Parameters/TestRpc.TestRpcSidecarLimits/SSL_UnixSocket
I20260926 13:42:14.229360   626 acceptor_pool.cc:254] collecting diagnostics on the listening RPC socket unix:/tmp/dist-test-taski8pofg/test-tmp/rpc-test-fd7a0f12ed284f80a6ac6799ad855dca.sock every 8 connection(s)
I20260926 13:42:14.229372   627 acceptor_pool.cc:254] collecting diagnostics on the listening RPC socket unix:/tmp/dist-test-taski8pofg/test-tmp/rpc-test-fd7a0f12ed284f80a6ac6799ad855dca.sock every 8 connection(s)
W20260926 13:42:14.235029   384 serialization.cc:72] Serialized kudu.rpc_test.PushStringsRequestPB (2147483654 bytes) is larger than the maximum configured RPC message size (52428800 bytes). Sending anyway, but peer may reject the data.
W20260926 13:42:14.238528   623 connection.cc:535] server connection from unix:<unnamed> recv error: Network error: RPC frame had a length of 2147483714, but we only support messages up to 52428800 bytes long.
W20260926 13:42:14.238579   623 connection.cc:158] shutting down server connection from unix:<unnamed> with pending inbound data: 4/2147483714 bytes received; last active 0 ns ago: status Network error: RPC frame had a length of 2147483714, but we only support messages up to 52428800 bytes long.
W20260926 13:42:14.238802   639 connection.cc:196] Error closing socket: Network error: TlsSocket::Close: Broken pipe
I20260926 13:42:14.251051   651 acceptor_pool.cc:254] collecting diagnostics on the listening RPC socket unix:/tmp/dist-test-taski8pofg/test-tmp/rpc-test-fd7a0f12ed284f80a6ac6799ad855dca.sock every 8 connection(s)
I20260926 13:42:14.251200   652 acceptor_pool.cc:254] collecting diagnostics on the listening RPC socket unix:/tmp/dist-test-taski8pofg/test-tmp/rpc-test-fd7a0f12ed284f80a6ac6799ad855dca.sock every 8 connection(s)
W20260926 13:42:18.927604   648 connection.cc:577] server connection from unix:<unnamed>: received bad data: 'Corruption: Invalid packet: message had a length of 2147483710, but we only support messages up to 2147483647 bytes
'
W20260926 13:42:18.927929   664 connection.cc:196] Error closing socket: Network error: TlsSocket::Close: Broken pipe
[       OK ] Parameters/TestRpc.TestRpcSidecarLimits/SSL_UnixSocket (6389 ms)
[ RUN      ] Parameters/TestRpc.TestCallTimeoutDoesntAffectNegotiation/SSL_UnixSocket
I20260926 13:42:18.955770   676 acceptor_pool.cc:254] collecting diagnostics on the listening RPC socket unix:/tmp/dist-test-taski8pofg/test-tmp/rpc-test-3349a6bf75404e628278e3d6e70a0770.sock every 8 connection(s)
I20260926 13:42:18.955821   677 acceptor_pool.cc:254] collecting diagnostics on the listening RPC socket unix:/tmp/dist-test-taski8pofg/test-tmp/rpc-test-3349a6bf75404e628278e3d6e70a0770.sock every 8 connection(s)
W20260926 13:42:18.971882   672 negotiation.cc:266] Injecting 500ms delay in negotiation
I20260926 13:42:19.022208   384 rpc-test-base.h:595] status: Timed out: connection negotiation to unix:/tmp/dist-test-taski8pofg/test-tmp/rpc-test-3349a6bf75404e628278e3d6e70a0770.sock for RPC Sleep timed out after 0.050s (ON_OUTBOUND_QUEUE), seconds elapsed: 0.0507503
W20260926 13:42:19.476789   673 connection.cc:196] Error closing socket: Network error: TlsSocket::Close: Broken pipe
[       OK ] Parameters/TestRpc.TestCallTimeoutDoesntAffectNegotiation/SSL_UnixSocket (547 ms)
[ RUN      ] Parameters/TestRpc.TestRpcHandlerLatencyMetric/SSL_UnixSocket
I20260926 13:42:19.486327   701 acceptor_pool.cc:254] collecting diagnostics on the listening RPC socket unix:/tmp/dist-test-taski8pofg/test-tmp/rpc-test-b6ddc98a2fa044649a0d683e46c3142a.sock every 8 connection(s)
I20260926 13:42:19.486438   702 acceptor_pool.cc:254] collecting diagnostics on the listening RPC socket unix:/tmp/dist-test-taski8pofg/test-tmp/rpc-test-b6ddc98a2fa044649a0d683e46c3142a.sock every 8 connection(s)
I20260926 13:42:19.521315   384 rpc-test.cc:1236] Sleep() min lat: 20320
I20260926 13:42:19.521391   384 rpc-test.cc:1237] Sleep() mean lat: 20320
I20260926 13:42:19.521418   384 rpc-test.cc:1238] Sleep() max lat: 20320
I20260926 13:42:19.521432   384 rpc-test.cc:1239] Sleep() #calls: 1
W20260926 13:42:19.522253   698 connection.cc:196] Error closing socket: Network error: TlsSocket::Close: Broken pipe
[       OK ] Parameters/TestRpc.TestRpcHandlerLatencyMetric/SSL_UnixSocket (45 ms)
[ RUN      ] Parameters/TestRpc.TimedOutOnResponseMetricServiceQueue/SSL_UnixSocket
I20260926 13:42:19.531864   727 acceptor_pool.cc:254] collecting diagnostics on the listening RPC socket unix:/tmp/dist-test-taski8pofg/test-tmp/rpc-test-8550f0b858e44e5ea5fb47cd2482e766.sock every 8 connection(s)
I20260926 13:42:19.531921   728 acceptor_pool.cc:254] collecting diagnostics on the listening RPC socket unix:/tmp/dist-test-taski8pofg/test-tmp/rpc-test-8550f0b858e44e5ea5fb47cd2482e766.sock every 8 connection(s)
W20260926 13:42:19.588450   729 rpcz_store.cc:267] Call kudu.rpc_test.CalculatorService.Sleep from unix:<unnamed> (request call id 2) took 20 ms (client timeout 20 ms). Trace:
W20260926 13:42:19.588560   729 rpcz_store.cc:269] 0926 13:42:19.568174 (+     0us) service_pool.cc:170] Inserting onto call queue
0926 13:42:19.588413 (+ 20239us) service_pool.cc:214] Skipping call since client already timed out
0926 13:42:19.588436 (+    23us) inbound_call.cc:173] Queueing failure response
Metrics: {}
W20260926 13:42:19.589465   724 connection.cc:196] Error closing socket: Network error: TlsSocket::Close: Broken pipe
[       OK ] Parameters/TestRpc.TimedOutOnResponseMetricServiceQueue/SSL_UnixSocket (67 ms)
[ RUN      ] Parameters/TestRpc.RpcPendingConnectionsMetric/SSL_UnixSocket
I20260926 13:42:19.592857   750 acceptor_pool.cc:254] collecting diagnostics on the listening RPC socket 0.0.0.0:45601 every 8 connection(s)
I20260926 13:42:19.593010   751 acceptor_pool.cc:254] collecting diagnostics on the listening RPC socket 0.0.0.0:45601 every 8 connection(s)
W20260926 13:42:19.601989   746 negotiation.cc:337] Failed RPC negotiation. Trace:
0926 13:42:19.601606 (+     0us) reactor.cc:625] Submitting negotiation task for server connection from 127.0.0.1:44604 (local address 127.0.0.1:45601)
0926 13:42:19.601716 (+   110us) server_negotiation.cc:206] Beginning negotiation
0926 13:42:19.601719 (+     3us) server_negotiation.cc:399] Waiting for connection header
0926 13:42:19.601795 (+    76us) negotiation.cc:327] Negotiation complete: Network error: Server connection negotiation failed: server connection from 127.0.0.1:44604: BlockingRecv error: recv got EOF from 127.0.0.1:44604 (error 108)
Metrics: {"server-negotiator.queue_time_us":30}
[       OK ] Parameters/TestRpc.RpcPendingConnectionsMetric/SSL_UnixSocket (22 ms)
[ RUN      ] Parameters/TestRpc.TestRpcContextClientDeadline/SSL_UnixSocket
I20260926 13:42:19.630937   766 acceptor_pool.cc:254] collecting diagnostics on the listening RPC socket unix:/tmp/dist-test-taski8pofg/test-tmp/rpc-test-2b2b7eb0f75e49a99937ed04c638fc1b.sock every 8 connection(s)
I20260926 13:42:19.630955   767 acceptor_pool.cc:254] collecting diagnostics on the listening RPC socket unix:/tmp/dist-test-taski8pofg/test-tmp/rpc-test-2b2b7eb0f75e49a99937ed04c638fc1b.sock every 8 connection(s)
W20260926 13:42:19.683346   763 connection.cc:196] Error closing socket: Network error: TlsSocket::Close: Broken pipe
[       OK ] Parameters/TestRpc.TestRpcContextClientDeadline/SSL_UnixSocket (71 ms)
[ RUN      ] Parameters/TestRpc.TestApplicationFeatureFlagUnsupportedServer/SSL_UnixSocket
I20260926 13:42:19.700098   791 acceptor_pool.cc:254] collecting diagnostics on the listening RPC socket unix:/tmp/dist-test-taski8pofg/test-tmp/rpc-test-a54973fda9dd4d2eb417945b52f427fc.sock every 8 connection(s)
I20260926 13:42:19.700155   792 acceptor_pool.cc:254] collecting diagnostics on the listening RPC socket unix:/tmp/dist-test-taski8pofg/test-tmp/rpc-test-a54973fda9dd4d2eb417945b52f427fc.sock every 8 connection(s)
W20260926 13:42:19.712029   788 connection.cc:196] Error closing socket: Network error: TlsSocket::Close: Broken pipe
[       OK ] Parameters/TestRpc.TestApplicationFeatureFlagUnsupportedServer/SSL_UnixSocket (28 ms)
[ RUN      ] Parameters/TestRpc.TestCancellationAsync/SSL_UnixSocket
I20260926 13:42:19.748593   816 acceptor_pool.cc:254] collecting diagnostics on the listening RPC socket unix:/tmp/dist-test-taski8pofg/test-tmp/rpc-test-c6da96da29eb4a8a9141598527927a3e.sock every 8 connection(s)
I20260926 13:42:19.748596   817 acceptor_pool.cc:254] collecting diagnostics on the listening RPC socket unix:/tmp/dist-test-taski8pofg/test-tmp/rpc-test-c6da96da29eb4a8a9141598527927a3e.sock every 8 connection(s)
I20260926 13:42:19.748870   384 rpc-test.cc:1716] Connecting to unix:/tmp/dist-test-taski8pofg/test-tmp/rpc-test-c6da96da29eb4a8a9141598527927a3e.sock
I20260926 13:42:19.775583   384 test_util.cc:268] Using random seed: 7993949
I20260926 13:42:19.801047   820 rpc-test-base.h:240] got call: sleep_micros: 500 pattern: 4294967295 num_repetitions: 2097152 sidecar_idx: 0
I20260926 13:42:19.820621   820 rpc-test-base.h:240] got call: sleep_micros: 500 pattern: 4294967295 num_repetitions: 2097152 sidecar_idx: 0
I20260926 13:42:19.835796   819 rpc-test-base.h:240] got call: sleep_micros: 500 pattern: 4294967295 num_repetitions: 2097152 sidecar_idx: 0
I20260926 13:42:19.851629   820 rpc-test-base.h:240] got call: sleep_micros: 500 pattern: 4294967295 num_repetitions: 2097152 sidecar_idx: 0
I20260926 13:42:19.866827   819 rpc-test-base.h:240] got call: sleep_micros: 500 pattern: 4294967295 num_repetitions: 2097152 sidecar_idx: 0
I20260926 13:42:19.881685   820 rpc-test-base.h:240] got call: sleep_micros: 500 pattern: 4294967295 num_repetitions: 2097152 sidecar_idx: 0
I20260926 13:42:19.896607   819 rpc-test-base.h:240] got call: sleep_micros: 500 pattern: 4294967295 num_repetitions: 2097152 sidecar_idx: 0
W20260926 13:42:19.898169   813 connection.cc:196] Error closing socket: Network error: TlsSocket::Close: Broken pipe
W20260926 13:42:19.904991   813 connection.cc:441] server connection from unix:<unnamed> torn down before Call kudu.rpc.GenericCalculatorService.SleepWithSidecar from unix:<unnamed> (request call id 8) could send its response
W20260926 13:42:19.913993   813 connection.cc:441] server connection from unix:<unnamed> torn down before Call kudu.rpc.GenericCalculatorService.SleepWithSidecar from unix:<unnamed> (request call id 9) could send its response
[       OK ] Parameters/TestRpc.TestCancellationAsync/SSL_UnixSocket (202 ms)
[ RUN      ] Parameters/TestRpc.TestPerformanceBySocketType/SSL_UnixSocket
I20260926 13:42:19.930665   841 acceptor_pool.cc:254] collecting diagnostics on the listening RPC socket unix:/tmp/dist-test-taski8pofg/test-tmp/rpc-test-4f9b177ecefc410d9015f51622daadf4.sock every 8 connection(s)
I20260926 13:42:19.930703   842 acceptor_pool.cc:254] collecting diagnostics on the listening RPC socket unix:/tmp/dist-test-taski8pofg/test-tmp/rpc-test-4f9b177ecefc410d9015f51622daadf4.sock every 8 connection(s)
I20260926 13:42:19.930977   384 rpc-test.cc:1846] Connecting to unix:/tmp/dist-test-taski8pofg/test-tmp/rpc-test-4f9b177ecefc410d9015f51622daadf4.sock
I20260926 13:42:21.414140   384 rpc-test.cc:1859] Sending 1024MB via ssl-enabled unix socket: real 1.460s	user 1.860s	sys 0.813s
I20260926 13:42:22.877426   384 rpc-test.cc:1859] Sending 1024MB via ssl-enabled unix socket: real 1.463s	user 1.802s	sys 0.872s
I20260926 13:42:24.414110   384 rpc-test.cc:1859] Sending 1024MB via ssl-enabled unix socket: real 1.537s	user 1.969s	sys 0.837s
I20260926 13:42:25.884415   384 rpc-test.cc:1859] Sending 1024MB via ssl-enabled unix socket: real 1.470s	user 1.822s	sys 0.872s
I20260926 13:42:27.390838   384 rpc-test.cc:1859] Sending 1024MB via ssl-enabled unix socket: real 1.506s	user 1.850s	sys 0.910s
W20260926 13:42:27.391795   838 connection.cc:196] Error closing socket: Network error: TlsSocket::Close: Broken pipe
[       OK ] Parameters/TestRpc.TestPerformanceBySocketType/SSL_UnixSocket (7477 ms)
[----------] 20 tests from Parameters/TestRpc (29361 ms total)

[----------] 1 test from Parameters/TestRpcSocketTxRxQueue
[ RUN      ] Parameters/TestRpcSocketTxRxQueue.AcceptorRxQueueSizeMetric/0
I20260926 13:42:27.399170   866 acceptor_pool.cc:254] collecting diagnostics on the listening RPC socket 0.0.0.0:38231 every 1 connection(s)
I20260926 13:42:27.399238   867 acceptor_pool.cc:254] collecting diagnostics on the listening RPC socket 0.0.0.0:38231 every 1 connection(s)
W20260926 13:42:27.400023   862 negotiation.cc:337] Failed RPC negotiation. Trace:
0926 13:42:27.399774 (+     0us) reactor.cc:625] Submitting negotiation task for server connection from 127.0.0.1:41626 (local address 127.0.0.1:38231)
0926 13:42:27.399868 (+    94us) server_negotiation.cc:206] Beginning negotiation
0926 13:42:27.399871 (+     3us) server_negotiation.cc:399] Waiting for connection header
0926 13:42:27.399949 (+    78us) negotiation.cc:327] Negotiation complete: Network error: Server connection negotiation failed: server connection from 127.0.0.1:41626: BlockingRecv error: recv got EOF from 127.0.0.1:41626 (error 108)
Metrics: {"server-negotiator.queue_time_us":22}
[       OK ] Parameters/TestRpcSocketTxRxQueue.AcceptorRxQueueSizeMetric/0 (8 ms)
[----------] 1 test from Parameters/TestRpcSocketTxRxQueue (8 ms total)

[----------] Global test environment tear-down
[==========] 21 tests from 2 test suites ran. (29370 ms total)
[  PASSED  ] 20 tests.
[  FAILED  ] 1 test, listed below:
[  FAILED  ] Parameters/TestRpc.TestCallWithChainCertAndChainCA/SSL_UnixSocket, where GetParam() = (true, true)

 1 FAILED TEST