Diagnosed failure
Parameters/TestRpc.TestCallWithChainCertAndChainCA/SSL_UnixSocket: /data0/somelongdirectorytoavoidrpathissues/src/kudu/src/kudu/rpc/rpc-test.cc:270: Failure
Failed
Bad status: Runtime error: could not verify certificate chain (error with cert: subject=CN = localhost, ST = sadfjas, C = AS, emailAddress = sdflkdsajf, O = lskdfjlsad, OU = sldfkja, issuer=C = AS, ST = ASDfkjdhf, L = lskdjf, O = saldfja, OU = skdjf, CN = localhost, emailAddress = sadjflkadsj): : certificate has expired
Google Test trace:
/data0/somelongdirectorytoavoidrpathissues/src/kudu/src/kudu/rpc/rpc-test.cc:267: Connecting to unix:/tmp/dist-test-taskKQwaxe/test-tmp/rpc-test-404b2cf7dc42485794701afb3e777049.sock
I20260925 07:16:36.186528 2075 test_util.cc:175] -----------------------------------------------
I20260925 07:16:36.186599 2075 test_util.cc:176] Had fatal failures, leaving test files at /tmp/dist-test-taskKQwaxe/test-tmp/rpc-test.6.Parameters_TestRpc.TestCallWithChainCertAndChainCA_SSL_UnixSocket.1790320596119285-2075-0
Full log
Note: This is test shard 7 of 8.
[==========] Running 21 tests from 2 test suites.
[----------] Global test environment set-up.
[----------] 20 tests from Parameters/TestRpc
[ RUN ] Parameters/TestRpc.TestMessengerCreateDestroy/SSL_UnixSocket
WARNING: Logging before InitGoogleLogging() is written to STDERR
I20260925 07:16:36.133531 2075 rpc-test.cc:169] started messenger TestCreateDestroy
[ OK ] Parameters/TestRpc.TestMessengerCreateDestroy/SSL_UnixSocket (12 ms)
[ RUN ] Parameters/TestRpc.TestNegotiationDeadlock/SSL_UnixSocket
I20260925 07:16:36.155515 2096 acceptor_pool.cc:254] collecting diagnostics on the listening RPC socket unix:/tmp/dist-test-taskKQwaxe/test-tmp/rpc-test-b879f860e6c24c3d86c9b6de26e13109.sock every 8 connection(s)
I20260925 07:16:36.155498 2095 acceptor_pool.cc:254] collecting diagnostics on the listening RPC socket unix:/tmp/dist-test-taskKQwaxe/test-tmp/rpc-test-b879f860e6c24c3d86c9b6de26e13109.sock every 8 connection(s)
[ OK ] Parameters/TestRpc.TestNegotiationDeadlock/SSL_UnixSocket (28 ms)
[ RUN ] Parameters/TestRpc.TestCallWithChainCertAndChainCA/SSL_UnixSocket
I20260925 07:16:36.182257 2111 acceptor_pool.cc:254] collecting diagnostics on the listening RPC socket unix:/tmp/dist-test-taskKQwaxe/test-tmp/rpc-test-404b2cf7dc42485794701afb3e777049.sock every 8 connection(s)
I20260925 07:16:36.182277 2112 acceptor_pool.cc:254] collecting diagnostics on the listening RPC socket unix:/tmp/dist-test-taskKQwaxe/test-tmp/rpc-test-404b2cf7dc42485794701afb3e777049.sock every 8 connection(s)
/data0/somelongdirectorytoavoidrpathissues/src/kudu/src/kudu/rpc/rpc-test.cc:270: Failure
Failed
Bad status: Runtime error: could not verify certificate chain (error with cert: subject=CN = localhost, ST = sadfjas, C = AS, emailAddress = sdflkdsajf, O = lskdfjlsad, OU = sldfkja, issuer=C = AS, ST = ASDfkjdhf, L = lskdjf, O = saldfja, OU = skdjf, CN = localhost, emailAddress = sadjflkadsj): : certificate has expired
Google Test trace:
/data0/somelongdirectorytoavoidrpathissues/src/kudu/src/kudu/rpc/rpc-test.cc:267: Connecting to unix:/tmp/dist-test-taskKQwaxe/test-tmp/rpc-test-404b2cf7dc42485794701afb3e777049.sock
I20260925 07:16:36.186528 2075 test_util.cc:175] -----------------------------------------------
I20260925 07:16:36.186599 2075 test_util.cc:176] Had fatal failures, leaving test files at /tmp/dist-test-taskKQwaxe/test-tmp/rpc-test.6.Parameters_TestRpc.TestCallWithChainCertAndChainCA_SSL_UnixSocket.1790320596119285-2075-0
[ FAILED ] Parameters/TestRpc.TestCallWithChainCertAndChainCA/SSL_UnixSocket, where GetParam() = (true, true) (23 ms)
[ RUN ] Parameters/TestRpc.TestCallWithPasswordProtectedKey/SSL_UnixSocket
I20260925 07:16:36.215301 2136 acceptor_pool.cc:254] collecting diagnostics on the listening RPC socket unix:/tmp/dist-test-taskKQwaxe/test-tmp/rpc-test-35c0ea38f80644eaaf4cdbde463a4405.sock every 8 connection(s)
I20260925 07:16:36.215332 2137 acceptor_pool.cc:254] collecting diagnostics on the listening RPC socket unix:/tmp/dist-test-taskKQwaxe/test-tmp/rpc-test-35c0ea38f80644eaaf4cdbde463a4405.sock every 8 connection(s)
W20260925 07:16:36.227402 2133 connection.cc:196] Error closing socket: Network error: TlsSocket::Close: Broken pipe
[ OK ] Parameters/TestRpc.TestCallWithPasswordProtectedKey/SSL_UnixSocket (42 ms)
[ RUN ] Parameters/TestRpc.TestCallToBadServer/SSL_UnixSocket
I20260925 07:16:36.244061 2075 rpc-test.cc:394] Status: Network error: Client connection negotiation failed: client connection to 0.0.0.0:0: connect: Connection refused (error 111)
I20260925 07:16:36.244402 2075 rpc-test.cc:394] Status: Network error: Client connection negotiation failed: client connection to 0.0.0.0:0: connect: Connection refused (error 111)
I20260925 07:16:36.244683 2075 rpc-test.cc:394] Status: Network error: Client connection negotiation failed: client connection to 0.0.0.0:0: connect: Connection refused (error 111)
I20260925 07:16:36.244899 2075 rpc-test.cc:394] Status: Network error: Client connection negotiation failed: client connection to 0.0.0.0:0: connect: Connection refused (error 111)
I20260925 07:16:36.245078 2075 rpc-test.cc:394] Status: Network error: Client connection negotiation failed: client connection to 0.0.0.0:0: connect: Connection refused (error 111)
[ OK ] Parameters/TestRpc.TestCallToBadServer/SSL_UnixSocket (17 ms)
[ RUN ] Parameters/TestRpc.TestWrongService/SSL_UnixSocket
I20260925 07:16:36.265821 2171 acceptor_pool.cc:254] collecting diagnostics on the listening RPC socket unix:/tmp/dist-test-taskKQwaxe/test-tmp/rpc-test-9e59f77a165b443daa3a57a756219c82.sock every 8 connection(s)
I20260925 07:16:36.265854 2172 acceptor_pool.cc:254] collecting diagnostics on the listening RPC socket unix:/tmp/dist-test-taskKQwaxe/test-tmp/rpc-test-9e59f77a165b443daa3a57a756219c82.sock every 8 connection(s)
I20260925 07:16:36.283854 2168 messenger.cc:345] service WrongServiceName not registered on TestServer
[ OK ] Parameters/TestRpc.TestWrongService/SSL_UnixSocket (39 ms)
[ RUN ] Parameters/TestRpc.TestConnectionKeepalive/SSL_UnixSocket
I20260925 07:16:36.313274 2194 acceptor_pool.cc:254] collecting diagnostics on the listening RPC socket unix:/tmp/dist-test-taskKQwaxe/test-tmp/rpc-test-6c05ac2e6abb46d2bba527439a7aba29.sock every 8 connection(s)
I20260925 07:16:36.313333 2195 acceptor_pool.cc:254] collecting diagnostics on the listening RPC socket unix:/tmp/dist-test-taskKQwaxe/test-tmp/rpc-test-6c05ac2e6abb46d2bba527439a7aba29.sock every 8 connection(s)
I20260925 07:16:36.313496 2075 rpc-test.cc:488] Connecting to unix:/tmp/dist-test-taskKQwaxe/test-tmp/rpc-test-6c05ac2e6abb46d2bba527439a7aba29.sock
W20260925 07:16:36.787103 2207 connection.cc:196] Error closing socket: Network error: TlsSocket::Close: Broken pipe
[ OK ] Parameters/TestRpc.TestConnectionKeepalive/SSL_UnixSocket (1052 ms)
[ RUN ] Parameters/TestRpc.TestClientConnectionMetrics/SSL_UnixSocket
I20260925 07:16:37.353922 2219 acceptor_pool.cc:254] collecting diagnostics on the listening RPC socket unix:/tmp/dist-test-taskKQwaxe/test-tmp/rpc-test-f328a83c58a9425291009daed0d8d847.sock every 8 connection(s)
I20260925 07:16:37.353992 2220 acceptor_pool.cc:254] collecting diagnostics on the listening RPC socket unix:/tmp/dist-test-taskKQwaxe/test-tmp/rpc-test-f328a83c58a9425291009daed0d8d847.sock every 8 connection(s)
I20260925 07:16:37.354156 2075 rpc-test.cc:569] Connecting to unix:/tmp/dist-test-taskKQwaxe/test-tmp/rpc-test-f328a83c58a9425291009daed0d8d847.sock
W20260925 07:16:47.047794 2216 connection.cc:196] Error closing socket: Network error: TlsSocket::Close: Broken pipe
[ OK ] Parameters/TestRpc.TestClientConnectionMetrics/SSL_UnixSocket (9712 ms)
[ RUN ] Parameters/TestRpc.TestCredentialsPolicy/SSL_UnixSocket
I20260925 07:16:47.073258 2242 acceptor_pool.cc:254] collecting diagnostics on the listening RPC socket unix:/tmp/dist-test-taskKQwaxe/test-tmp/rpc-test-e1e60b0158a84f678a96f2fb1cb0479a.sock every 8 connection(s)
I20260925 07:16:47.073323 2243 acceptor_pool.cc:254] collecting diagnostics on the listening RPC socket unix:/tmp/dist-test-taskKQwaxe/test-tmp/rpc-test-e1e60b0158a84f678a96f2fb1cb0479a.sock every 8 connection(s)
I20260925 07:16:47.073505 2075 rpc-test.cc:700] Connecting to unix:/tmp/dist-test-taskKQwaxe/test-tmp/rpc-test-e1e60b0158a84f678a96f2fb1cb0479a.sock
W20260925 07:16:47.086185 2241 connection.cc:196] Error closing socket: Network error: TlsSocket::Close: Broken pipe
[ OK ] Parameters/TestRpc.TestCredentialsPolicy/SSL_UnixSocket (40 ms)
[ RUN ] Parameters/TestRpc.TestCallLongerThanKeepalive/SSL_UnixSocket
I20260925 07:16:47.113129 2267 acceptor_pool.cc:254] collecting diagnostics on the listening RPC socket unix:/tmp/dist-test-taskKQwaxe/test-tmp/rpc-test-735261437b1248f798f8e5fd5a452ef9.sock every 8 connection(s)
I20260925 07:16:47.113147 2268 acceptor_pool.cc:254] collecting diagnostics on the listening RPC socket unix:/tmp/dist-test-taskKQwaxe/test-tmp/rpc-test-735261437b1248f798f8e5fd5a452ef9.sock every 8 connection(s)
I20260925 07:16:47.123960 2271 rpc-test-base.h:222] got call: sleep_micros: 3000000 deferred: true
I20260925 07:16:50.124776 2271 rpcz_store.cc:275] Call kudu.rpc.GenericCalculatorService.Sleep from unix:<unnamed> (request call id 0) took 3000 ms. Trace:
I20260925 07:16:50.124917 2271 rpcz_store.cc:276] 0925 07:16:47.123893 (+ 0us) service_pool.cc:170] Inserting onto call queue
0925 07:16:47.123933 (+ 40us) service_pool.cc:227] Handling call
0925 07:16:50.124752 (+3000819us) inbound_call.cc:173] Queueing success response
Metrics: {}
[ OK ] Parameters/TestRpc.TestCallLongerThanKeepalive/SSL_UnixSocket (3036 ms)
[ RUN ] Parameters/TestRpc.TestRpcSidecar/SSL_UnixSocket
I20260925 07:16:50.154464 2293 acceptor_pool.cc:254] collecting diagnostics on the listening RPC socket unix:/tmp/dist-test-taskKQwaxe/test-tmp/rpc-test-1121e9e0d9be495998e33a1bc96739ab.sock every 8 connection(s)
I20260925 07:16:50.154469 2292 acceptor_pool.cc:254] collecting diagnostics on the listening RPC socket unix:/tmp/dist-test-taskKQwaxe/test-tmp/rpc-test-1121e9e0d9be495998e33a1bc96739ab.sock every 8 connection(s)
W20260925 07:16:50.190667 2289 connection.cc:196] Error closing socket: Network error: TlsSocket::Close: Broken pipe
[ OK ] Parameters/TestRpc.TestRpcSidecar/SSL_UnixSocket (64 ms)
[ RUN ] Parameters/TestRpc.TestRpcSidecarLimits/SSL_UnixSocket
I20260925 07:16:52.039521 2317 acceptor_pool.cc:254] collecting diagnostics on the listening RPC socket unix:/tmp/dist-test-taskKQwaxe/test-tmp/rpc-test-43bea721f725486ca463b0c02abed0d9.sock every 8 connection(s)
I20260925 07:16:52.039567 2318 acceptor_pool.cc:254] collecting diagnostics on the listening RPC socket unix:/tmp/dist-test-taskKQwaxe/test-tmp/rpc-test-43bea721f725486ca463b0c02abed0d9.sock every 8 connection(s)
W20260925 07:16:52.062156 2075 serialization.cc:72] Serialized kudu.rpc_test.PushStringsRequestPB (2147483654 bytes) is larger than the maximum configured RPC message size (52428800 bytes). Sending anyway, but peer may reject the data.
W20260925 07:16:52.065608 2314 connection.cc:535] server connection from unix:<unnamed> recv error: Network error: RPC frame had a length of 2147483714, but we only support messages up to 52428800 bytes long.
W20260925 07:16:52.065676 2314 connection.cc:158] shutting down server connection from unix:<unnamed> with pending inbound data: 4/2147483714 bytes received; last active 0 ns ago: status Network error: RPC frame had a length of 2147483714, but we only support messages up to 52428800 bytes long.
W20260925 07:16:52.065831 2330 connection.cc:698] client connection to unix:/tmp/dist-test-taskKQwaxe/test-tmp/rpc-test-43bea721f725486ca463b0c02abed0d9.sock send error: Network error: failed to write to TLS socket: Broken pipe
W20260925 07:16:52.065965 2330 connection.cc:196] Error closing socket: Network error: TlsSocket::Close: Success
I20260925 07:16:52.073534 2342 acceptor_pool.cc:254] collecting diagnostics on the listening RPC socket unix:/tmp/dist-test-taskKQwaxe/test-tmp/rpc-test-43bea721f725486ca463b0c02abed0d9.sock every 8 connection(s)
I20260925 07:16:52.073549 2343 acceptor_pool.cc:254] collecting diagnostics on the listening RPC socket unix:/tmp/dist-test-taskKQwaxe/test-tmp/rpc-test-43bea721f725486ca463b0c02abed0d9.sock every 8 connection(s)
W20260925 07:16:56.577839 2339 connection.cc:577] server connection from unix:<unnamed>: received bad data: 'Corruption: Invalid packet: message had a length of 2147483710, but we only support messages up to 2147483647 bytes
'
W20260925 07:16:56.578146 2355 connection.cc:196] Error closing socket: Network error: TlsSocket::Close: Broken pipe
[ OK ] Parameters/TestRpc.TestRpcSidecarLimits/SSL_UnixSocket (6387 ms)
[ RUN ] Parameters/TestRpc.TestCallTimeoutDoesntAffectNegotiation/SSL_UnixSocket
I20260925 07:16:56.598765 2367 acceptor_pool.cc:254] collecting diagnostics on the listening RPC socket unix:/tmp/dist-test-taskKQwaxe/test-tmp/rpc-test-660eff8cd6f5460099dcff0c24eb041c.sock every 8 connection(s)
I20260925 07:16:56.598788 2368 acceptor_pool.cc:254] collecting diagnostics on the listening RPC socket unix:/tmp/dist-test-taskKQwaxe/test-tmp/rpc-test-660eff8cd6f5460099dcff0c24eb041c.sock every 8 connection(s)
W20260925 07:16:56.613118 2363 negotiation.cc:266] Injecting 500ms delay in negotiation
I20260925 07:16:56.663415 2075 rpc-test-base.h:595] status: Timed out: connection negotiation to unix:/tmp/dist-test-taskKQwaxe/test-tmp/rpc-test-660eff8cd6f5460099dcff0c24eb041c.sock for RPC Sleep timed out after 0.050s (ON_OUTBOUND_QUEUE), seconds elapsed: 0.0507713
[ OK ] Parameters/TestRpc.TestCallTimeoutDoesntAffectNegotiation/SSL_UnixSocket (543 ms)
[ RUN ] Parameters/TestRpc.TestRpcHandlerLatencyMetric/SSL_UnixSocket
I20260925 07:16:57.139395 2393 acceptor_pool.cc:254] collecting diagnostics on the listening RPC socket unix:/tmp/dist-test-taskKQwaxe/test-tmp/rpc-test-2596e196916b4fa0b74da3b3222b5278.sock every 8 connection(s)
I20260925 07:16:57.139395 2392 acceptor_pool.cc:254] collecting diagnostics on the listening RPC socket unix:/tmp/dist-test-taskKQwaxe/test-tmp/rpc-test-2596e196916b4fa0b74da3b3222b5278.sock every 8 connection(s)
I20260925 07:16:57.176455 2075 rpc-test.cc:1236] Sleep() min lat: 20413
I20260925 07:16:57.176559 2075 rpc-test.cc:1237] Sleep() mean lat: 20413
I20260925 07:16:57.176590 2075 rpc-test.cc:1238] Sleep() max lat: 20413
I20260925 07:16:57.176604 2075 rpc-test.cc:1239] Sleep() #calls: 1
[ OK ] Parameters/TestRpc.TestRpcHandlerLatencyMetric/SSL_UnixSocket (55 ms)
[ RUN ] Parameters/TestRpc.TimedOutOnResponseMetricServiceQueue/SSL_UnixSocket
I20260925 07:16:57.186633 2418 acceptor_pool.cc:254] collecting diagnostics on the listening RPC socket unix:/tmp/dist-test-taskKQwaxe/test-tmp/rpc-test-cceac6ac5e224c5daa1483bce798424c.sock every 8 connection(s)
I20260925 07:16:57.186689 2419 acceptor_pool.cc:254] collecting diagnostics on the listening RPC socket unix:/tmp/dist-test-taskKQwaxe/test-tmp/rpc-test-cceac6ac5e224c5daa1483bce798424c.sock every 8 connection(s)
W20260925 07:16:57.246294 2420 rpcz_store.cc:267] Call kudu.rpc_test.CalculatorService.Sleep from unix:<unnamed> (request call id 2) took 20 ms (client timeout 20 ms). Trace:
W20260925 07:16:57.246443 2420 rpcz_store.cc:269] 0925 07:16:57.225968 (+ 0us) service_pool.cc:170] Inserting onto call queue
0925 07:16:57.246244 (+ 20276us) service_pool.cc:214] Skipping call since client already timed out
0925 07:16:57.246260 (+ 16us) inbound_call.cc:173] Queueing failure response
Metrics: {}
[ OK ] Parameters/TestRpc.TimedOutOnResponseMetricServiceQueue/SSL_UnixSocket (69 ms)
[ RUN ] Parameters/TestRpc.RpcPendingConnectionsMetric/SSL_UnixSocket
I20260925 07:16:57.249984 2441 acceptor_pool.cc:254] collecting diagnostics on the listening RPC socket 0.0.0.0:43637 every 8 connection(s)
I20260925 07:16:57.250027 2442 acceptor_pool.cc:254] collecting diagnostics on the listening RPC socket 0.0.0.0:43637 every 8 connection(s)
W20260925 07:16:57.250738 2437 negotiation.cc:337] Failed RPC negotiation. Trace:
0925 07:16:57.250547 (+ 0us) reactor.cc:625] Submitting negotiation task for server connection from 127.0.0.1:37274 (local address 127.0.0.1:43637)
0925 07:16:57.250593 (+ 46us) server_negotiation.cc:206] Beginning negotiation
0925 07:16:57.250595 (+ 2us) server_negotiation.cc:399] Waiting for connection header
0925 07:16:57.250673 (+ 78us) negotiation.cc:327] Negotiation complete: Network error: Server connection negotiation failed: server connection from 127.0.0.1:37274: BlockingRecv error: recv got EOF from 127.0.0.1:37274 (error 108)
Metrics: {"server-negotiator.queue_time_us":15}
[ OK ] Parameters/TestRpc.RpcPendingConnectionsMetric/SSL_UnixSocket (13 ms)
[ RUN ] Parameters/TestRpc.TestRpcContextClientDeadline/SSL_UnixSocket
I20260925 07:16:57.281672 2457 acceptor_pool.cc:254] collecting diagnostics on the listening RPC socket unix:/tmp/dist-test-taskKQwaxe/test-tmp/rpc-test-579d811167fb42d99bed0ca516657f80.sock every 8 connection(s)
I20260925 07:16:57.281714 2458 acceptor_pool.cc:254] collecting diagnostics on the listening RPC socket unix:/tmp/dist-test-taskKQwaxe/test-tmp/rpc-test-579d811167fb42d99bed0ca516657f80.sock every 8 connection(s)
[ OK ] Parameters/TestRpc.TestRpcContextClientDeadline/SSL_UnixSocket (55 ms)
[ RUN ] Parameters/TestRpc.TestApplicationFeatureFlagUnsupportedServer/SSL_UnixSocket
I20260925 07:16:57.330066 2482 acceptor_pool.cc:254] collecting diagnostics on the listening RPC socket unix:/tmp/dist-test-taskKQwaxe/test-tmp/rpc-test-63df6629bb484a0e8d73bf0688337302.sock every 8 connection(s)
I20260925 07:16:57.330125 2483 acceptor_pool.cc:254] collecting diagnostics on the listening RPC socket unix:/tmp/dist-test-taskKQwaxe/test-tmp/rpc-test-63df6629bb484a0e8d73bf0688337302.sock every 8 connection(s)
[ OK ] Parameters/TestRpc.TestApplicationFeatureFlagUnsupportedServer/SSL_UnixSocket (26 ms)
[ RUN ] Parameters/TestRpc.TestCancellationAsync/SSL_UnixSocket
I20260925 07:16:57.354389 2507 acceptor_pool.cc:254] collecting diagnostics on the listening RPC socket unix:/tmp/dist-test-taskKQwaxe/test-tmp/rpc-test-b9424f5967ce472aae45f6706c990645.sock every 8 connection(s)
I20260925 07:16:57.354422 2508 acceptor_pool.cc:254] collecting diagnostics on the listening RPC socket unix:/tmp/dist-test-taskKQwaxe/test-tmp/rpc-test-b9424f5967ce472aae45f6706c990645.sock every 8 connection(s)
I20260925 07:16:57.354595 2075 rpc-test.cc:1716] Connecting to unix:/tmp/dist-test-taskKQwaxe/test-tmp/rpc-test-b9424f5967ce472aae45f6706c990645.sock
I20260925 07:16:57.364579 2075 test_util.cc:268] Using random seed: -2140234665
I20260925 07:16:57.383926 2511 rpc-test-base.h:240] got call: sleep_micros: 500 pattern: 4294967295 num_repetitions: 2097152 sidecar_idx: 0
I20260925 07:16:57.399741 2511 rpc-test-base.h:240] got call: sleep_micros: 500 pattern: 4294967295 num_repetitions: 2097152 sidecar_idx: 0
I20260925 07:16:57.416688 2511 rpc-test-base.h:240] got call: sleep_micros: 500 pattern: 4294967295 num_repetitions: 2097152 sidecar_idx: 0
I20260925 07:16:57.432303 2511 rpc-test-base.h:240] got call: sleep_micros: 500 pattern: 4294967295 num_repetitions: 2097152 sidecar_idx: 0
I20260925 07:16:57.448696 2511 rpc-test-base.h:240] got call: sleep_micros: 500 pattern: 4294967295 num_repetitions: 2097152 sidecar_idx: 0
I20260925 07:16:57.463377 2511 rpc-test-base.h:240] got call: sleep_micros: 500 pattern: 4294967295 num_repetitions: 2097152 sidecar_idx: 0
I20260925 07:16:57.476655 2511 rpc-test-base.h:240] got call: sleep_micros: 500 pattern: 4294967295 num_repetitions: 2097152 sidecar_idx: 0
I20260925 07:16:57.489529 2511 rpc-test-base.h:240] got call: sleep_micros: 500 pattern: 4294967295 num_repetitions: 2097152 sidecar_idx: 0
I20260925 07:16:57.504025 2511 rpc-test-base.h:240] got call: sleep_micros: 500 pattern: 4294967295 num_repetitions: 2097152 sidecar_idx: 0
W20260925 07:16:57.506625 2504 connection.cc:196] Error closing socket: Network error: TlsSocket::Close: Broken pipe
W20260925 07:16:57.507421 2504 connection.cc:441] server connection from unix:<unnamed> torn down before Call kudu.rpc.GenericCalculatorService.SleepWithSidecar from unix:<unnamed> (request call id 9) could send its response
[ OK ] Parameters/TestRpc.TestCancellationAsync/SSL_UnixSocket (164 ms)
[ RUN ] Parameters/TestRpc.TestPerformanceBySocketType/SSL_UnixSocket
I20260925 07:16:57.522908 2532 acceptor_pool.cc:254] collecting diagnostics on the listening RPC socket unix:/tmp/dist-test-taskKQwaxe/test-tmp/rpc-test-a1e90e2ac2854c35b51f021ec75fe165.sock every 8 connection(s)
I20260925 07:16:57.522951 2533 acceptor_pool.cc:254] collecting diagnostics on the listening RPC socket unix:/tmp/dist-test-taskKQwaxe/test-tmp/rpc-test-a1e90e2ac2854c35b51f021ec75fe165.sock every 8 connection(s)
I20260925 07:16:57.523142 2075 rpc-test.cc:1846] Connecting to unix:/tmp/dist-test-taskKQwaxe/test-tmp/rpc-test-a1e90e2ac2854c35b51f021ec75fe165.sock
I20260925 07:16:58.998170 2075 rpc-test.cc:1859] Sending 1024MB via ssl-enabled unix socket: real 1.459s user 1.690s sys 0.853s
I20260925 07:17:00.486646 2075 rpc-test.cc:1859] Sending 1024MB via ssl-enabled unix socket: real 1.488s user 1.630s sys 0.982s
I20260925 07:17:01.920107 2075 rpc-test.cc:1859] Sending 1024MB via ssl-enabled unix socket: real 1.433s user 1.555s sys 0.948s
I20260925 07:17:03.381764 2075 rpc-test.cc:1859] Sending 1024MB via ssl-enabled unix socket: real 1.462s user 1.693s sys 0.854s
I20260925 07:17:04.798069 2075 rpc-test.cc:1859] Sending 1024MB via ssl-enabled unix socket: real 1.416s user 1.624s sys 0.862s
[ OK ] Parameters/TestRpc.TestPerformanceBySocketType/SSL_UnixSocket (7291 ms)
[----------] 20 tests from Parameters/TestRpc (28678 ms total)
[----------] 1 test from Parameters/TestRpcSocketTxRxQueue
[ RUN ] Parameters/TestRpcSocketTxRxQueue.AcceptorRxQueueSizeMetric/0
I20260925 07:17:04.810663 2557 acceptor_pool.cc:254] collecting diagnostics on the listening RPC socket 0.0.0.0:45303 every 1 connection(s)
I20260925 07:17:04.810730 2558 acceptor_pool.cc:254] collecting diagnostics on the listening RPC socket 0.0.0.0:45303 every 1 connection(s)
W20260925 07:17:04.811396 2553 negotiation.cc:337] Failed RPC negotiation. Trace:
0925 07:17:04.811250 (+ 0us) reactor.cc:625] Submitting negotiation task for server connection from 127.0.0.1:47608 (local address 127.0.0.1:45303)
0925 07:17:04.811296 (+ 46us) server_negotiation.cc:206] Beginning negotiation
0925 07:17:04.811299 (+ 3us) server_negotiation.cc:399] Waiting for connection header
0925 07:17:04.811360 (+ 61us) negotiation.cc:327] Negotiation complete: Network error: Server connection negotiation failed: server connection from 127.0.0.1:47608: BlockingRecv error: recv got EOF from 127.0.0.1:47608 (error 108)
Metrics: {"server-negotiator.queue_time_us":16}
[ OK ] Parameters/TestRpcSocketTxRxQueue.AcceptorRxQueueSizeMetric/0 (13 ms)
[----------] 1 test from Parameters/TestRpcSocketTxRxQueue (13 ms total)
[----------] Global test environment tear-down
[==========] 21 tests from 2 test suites ran. (28691 ms total)
[ PASSED ] 20 tests.
[ FAILED ] 1 test, listed below:
[ FAILED ] Parameters/TestRpc.TestCallWithChainCertAndChainCA/SSL_UnixSocket, where GetParam() = (true, true)
1 FAILED TEST