Diagnosed failure

Parameters/TestRpc.TestCallWithChainCertAndRootCA/SSL_TCP: /data0/somelongdirectorytoavoidrpathissues/src/kudu/src/kudu/rpc/rpc-test.cc:303: Failure
Failed
Bad status: Runtime error: could not verify certificate chain (error with cert: subject=CN = localhost, ST = sadfjas, C = AS, emailAddress = sdflkdsajf, O = lskdfjlsad, OU = sldfkja, issuer=C = AS, ST = ASDfkjdhf, L = lskdjf, O = saldfja, OU = skdjf, CN = localhost, emailAddress = sadjflkadsj): : certificate has expired
Google Test trace:
/data0/somelongdirectorytoavoidrpathissues/src/kudu/src/kudu/rpc/rpc-test.cc:300: Connecting to 0.0.0.0:40783
I20260925 16:41:57.990402   390 test_util.cc:175] -----------------------------------------------
I20260925 16:41:57.990573   390 test_util.cc:176] Had fatal failures, leaving test files at /tmp/dist-test-taskVAF3tZ/test-tmp/rpc-test.1.Parameters_TestRpc.TestCallWithChainCertAndRootCA_SSL_TCP.1790354516395113-390-0

Full log

Note: This is test shard 2 of 8.
[==========] Running 21 tests from 2 test suites.
[----------] Global test environment set-up.
[----------] 1 test from TestRpc
[ RUN      ] TestRpc.TestMethodsByName
[       OK ] TestRpc.TestMethodsByName (7 ms)
[----------] 1 test from TestRpc (7 ms total)

[----------] 20 tests from Parameters/TestRpc
[ RUN      ] Parameters/TestRpc.TestAcceptorPoolStartStop/SSL_TCP
WARNING: Logging before InitGoogleLogging() is written to STDERR
I20260925 16:41:56.490033   405 acceptor_pool.cc:254] collecting diagnostics on the listening RPC socket 0.0.0.0:36993 every 8 connection(s)
I20260925 16:41:56.491652   406 acceptor_pool.cc:254] collecting diagnostics on the listening RPC socket 0.0.0.0:36993 every 8 connection(s)
W20260925 16:41:57.492188   390 thread.cc:536] Waited for 1000ms trying to join with acceptor (tid 406)
I20260925 16:41:57.647926   417 acceptor_pool.cc:254] collecting diagnostics on the listening RPC socket 0.0.0.0:43781 every 8 connection(s)
I20260925 16:41:57.649408   418 acceptor_pool.cc:254] collecting diagnostics on the listening RPC socket 0.0.0.0:43781 every 8 connection(s)
I20260925 16:41:57.678435   428 acceptor_pool.cc:254] collecting diagnostics on the listening RPC socket 0.0.0.0:32783 every 8 connection(s)
I20260925 16:41:57.680316   429 acceptor_pool.cc:254] collecting diagnostics on the listening RPC socket 0.0.0.0:32783 every 8 connection(s)
I20260925 16:41:57.732801   439 acceptor_pool.cc:254] collecting diagnostics on the listening RPC socket 0.0.0.0:33239 every 8 connection(s)
I20260925 16:41:57.733482   440 acceptor_pool.cc:254] collecting diagnostics on the listening RPC socket 0.0.0.0:33239 every 8 connection(s)
I20260925 16:41:57.775880   450 acceptor_pool.cc:254] collecting diagnostics on the listening RPC socket 0.0.0.0:43729 every 8 connection(s)
I20260925 16:41:57.776749   451 acceptor_pool.cc:254] collecting diagnostics on the listening RPC socket 0.0.0.0:43729 every 8 connection(s)
[       OK ] Parameters/TestRpc.TestAcceptorPoolStartStop/SSL_TCP (1328 ms)
[ RUN      ] Parameters/TestRpc.TestCall/SSL_TCP
I20260925 16:41:57.810286   463 acceptor_pool.cc:254] collecting diagnostics on the listening RPC socket 0.0.0.0:34133 every 8 connection(s)
I20260925 16:41:57.812810   464 acceptor_pool.cc:254] collecting diagnostics on the listening RPC socket 0.0.0.0:34133 every 8 connection(s)
I20260925 16:41:57.818445   390 rpc-test.cc:234] Connecting to 0.0.0.0:34133
[       OK ] Parameters/TestRpc.TestCall/SSL_TCP (159 ms)
[ RUN      ] Parameters/TestRpc.TestCallWithChainCertAndRootCA/SSL_TCP
I20260925 16:41:57.969677   488 acceptor_pool.cc:254] collecting diagnostics on the listening RPC socket 0.0.0.0:40783 every 8 connection(s)
I20260925 16:41:57.970494   489 acceptor_pool.cc:254] collecting diagnostics on the listening RPC socket 0.0.0.0:40783 every 8 connection(s)
/data0/somelongdirectorytoavoidrpathissues/src/kudu/src/kudu/rpc/rpc-test.cc:303: Failure
Failed
Bad status: Runtime error: could not verify certificate chain (error with cert: subject=CN = localhost, ST = sadfjas, C = AS, emailAddress = sdflkdsajf, O = lskdfjlsad, OU = sldfkja, issuer=C = AS, ST = ASDfkjdhf, L = lskdjf, O = saldfja, OU = skdjf, CN = localhost, emailAddress = sadjflkadsj): : certificate has expired
Google Test trace:
/data0/somelongdirectorytoavoidrpathissues/src/kudu/src/kudu/rpc/rpc-test.cc:300: Connecting to 0.0.0.0:40783
I20260925 16:41:57.990402   390 test_util.cc:175] -----------------------------------------------
I20260925 16:41:57.990573   390 test_util.cc:176] Had fatal failures, leaving test files at /tmp/dist-test-taskVAF3tZ/test-tmp/rpc-test.1.Parameters_TestRpc.TestCallWithChainCertAndRootCA_SSL_TCP.1790354516395113-390-0
[  FAILED  ] Parameters/TestRpc.TestCallWithChainCertAndRootCA/SSL_TCP, where GetParam() = (true, false) (49 ms)
[ RUN      ] Parameters/TestRpc.TestCallWithBadPasswordProtectedKey/SSL_TCP
[       OK ] Parameters/TestRpc.TestCallWithBadPasswordProtectedKey/SSL_TCP (30 ms)
[ RUN      ] Parameters/TestRpc.TestInvalidMethodCall/SSL_TCP
I20260925 16:41:58.055289   525 acceptor_pool.cc:254] collecting diagnostics on the listening RPC socket 0.0.0.0:38101 every 8 connection(s)
I20260925 16:41:58.056154   526 acceptor_pool.cc:254] collecting diagnostics on the listening RPC socket 0.0.0.0:38101 every 8 connection(s)
I20260925 16:41:58.059490   390 rpc-test.cc:406] Connecting to 0.0.0.0:38101
[       OK ] Parameters/TestRpc.TestInvalidMethodCall/SSL_TCP (72 ms)
[ RUN      ] Parameters/TestRpc.TestHighFDs/SSL_TCP
I20260925 16:41:58.306272   550 acceptor_pool.cc:254] collecting diagnostics on the listening RPC socket 0.0.0.0:39809 every 8 connection(s)
I20260925 16:41:58.307103   551 acceptor_pool.cc:254] collecting diagnostics on the listening RPC socket 0.0.0.0:39809 every 8 connection(s)
[       OK ] Parameters/TestRpc.TestHighFDs/SSL_TCP (270 ms)
[ RUN      ] Parameters/TestRpc.TestConnectionAlwaysKeepalive/SSL_TCP
I20260925 16:41:58.377921   573 acceptor_pool.cc:254] collecting diagnostics on the listening RPC socket 0.0.0.0:42625 every 8 connection(s)
I20260925 16:41:58.378631   574 acceptor_pool.cc:254] collecting diagnostics on the listening RPC socket 0.0.0.0:42625 every 8 connection(s)
I20260925 16:41:58.381745   390 rpc-test.cc:532] Connecting to 0.0.0.0:42625
[       OK ] Parameters/TestRpc.TestConnectionAlwaysKeepalive/SSL_TCP (3054 ms)
[ RUN      ] Parameters/TestRpc.TestReopenOutboundConnections/SSL_TCP
I20260925 16:42:01.456422   596 acceptor_pool.cc:254] collecting diagnostics on the listening RPC socket 0.0.0.0:44499 every 8 connection(s)
I20260925 16:42:01.457122   597 acceptor_pool.cc:254] collecting diagnostics on the listening RPC socket 0.0.0.0:44499 every 8 connection(s)
I20260925 16:42:01.460268   390 rpc-test.cc:658] Connecting to 0.0.0.0:44499
[       OK ] Parameters/TestRpc.TestReopenOutboundConnections/SSL_TCP (400 ms)
[ RUN      ] Parameters/TestRpc.TestConnectionNetworkPlane/SSL_TCP
I20260925 16:42:01.848397   619 acceptor_pool.cc:254] collecting diagnostics on the listening RPC socket 0.0.0.0:40129 every 8 connection(s)
I20260925 16:42:01.849277   620 acceptor_pool.cc:254] collecting diagnostics on the listening RPC socket 0.0.0.0:40129 every 8 connection(s)
I20260925 16:42:01.852449   390 rpc-test.cc:772] Connecting to 0.0.0.0:40129
[       OK ] Parameters/TestRpc.TestConnectionNetworkPlane/SSL_TCP (81 ms)
[ RUN      ] Parameters/TestRpc.TestTCPKeepalive/SSL_TCP
I20260925 16:42:01.917105   644 acceptor_pool.cc:254] collecting diagnostics on the listening RPC socket 0.0.0.0:34009 every 8 connection(s)
I20260925 16:42:01.917847   645 acceptor_pool.cc:254] collecting diagnostics on the listening RPC socket 0.0.0.0:34009 every 8 connection(s)
I20260925 16:42:01.950933   648 rpc-test-base.h:222] got call: sleep_micros: 8000000 deferred: true
I20260925 16:42:09.955013   648 rpcz_store.cc:275] Call kudu.rpc.GenericCalculatorService.Sleep from 127.0.0.1:34520 (request call id 0) took 8004 ms. Trace:
I20260925 16:42:09.955432   648 rpcz_store.cc:276] 0925 16:42:01.950685 (+     0us) service_pool.cc:170] Inserting onto call queue
0925 16:42:01.950782 (+    97us) service_pool.cc:227] Handling call
0925 16:42:09.954845 (+8004063us) inbound_call.cc:173] Queueing success response
Metrics: {}
[       OK ] Parameters/TestRpc.TestTCPKeepalive/SSL_TCP (8066 ms)
[ RUN      ] Parameters/TestRpc.TestMaxSmallSidecars/SSL_TCP
I20260925 16:42:10.003620   670 acceptor_pool.cc:254] collecting diagnostics on the listening RPC socket 0.0.0.0:43977 every 8 connection(s)
I20260925 16:42:10.004482   671 acceptor_pool.cc:254] collecting diagnostics on the listening RPC socket 0.0.0.0:43977 every 8 connection(s)
[       OK ] Parameters/TestRpc.TestMaxSmallSidecars/SSL_TCP (208 ms)
[ RUN      ] Parameters/TestRpc.TestCallTimeout/SSL_TCP
I20260925 16:42:10.209583   695 acceptor_pool.cc:254] collecting diagnostics on the listening RPC socket 0.0.0.0:36157 every 8 connection(s)
I20260925 16:42:10.210290   696 acceptor_pool.cc:254] collecting diagnostics on the listening RPC socket 0.0.0.0:36157 every 8 connection(s)
I20260925 16:42:10.233649   390 rpc-test-base.h:595] status: Timed out: connection negotiation to 0.0.0.0:36157 for RPC Sleep timed out after 0.000s (ON_OUTBOUND_QUEUE), seconds elapsed: 0.00240129
I20260925 16:42:10.240680   699 rpc-test-base.h:222] got call: sleep_micros: 700000
I20260925 16:42:10.434511   390 rpc-test-base.h:595] status: Timed out: Sleep RPC to 0.0.0.0:36157 timed out after 0.200s (SENT), seconds elapsed: 0.200474
I20260925 16:42:10.436137   698 rpc-test-base.h:222] got call: sleep_micros: 2000000
W20260925 16:42:10.941357   699 rpcz_store.cc:267] Call kudu.rpc.GenericCalculatorService.Sleep from 127.0.0.1:49390 (request call id 1) took 700 ms (client timeout 200 ms). Trace:
W20260925 16:42:10.941808   699 rpcz_store.cc:269] 0925 16:42:10.240530 (+     0us) service_pool.cc:170] Inserting onto call queue
0925 16:42:10.240627 (+    97us) service_pool.cc:227] Handling call
0925 16:42:10.941279 (+700652us) inbound_call.cc:173] Queueing success response
Metrics: {}
I20260925 16:42:11.936920   390 rpc-test-base.h:595] status: Timed out: Sleep RPC to 0.0.0.0:36157 timed out after 1.500s (SENT), seconds elapsed: 1.50198
W20260925 16:42:12.436686   698 rpcz_store.cc:267] Call kudu.rpc.GenericCalculatorService.Sleep from 127.0.0.1:49390 (request call id 2) took 2000 ms (client timeout 1500 ms). Trace:
W20260925 16:42:12.437018   698 rpcz_store.cc:269] 0925 16:42:10.435850 (+     0us) service_pool.cc:170] Inserting onto call queue
0925 16:42:10.435989 (+   139us) service_pool.cc:227] Handling call
0925 16:42:12.436628 (+2000639us) inbound_call.cc:173] Queueing success response
Metrics: {}
W20260925 16:42:12.437670   692 connection.cc:441] server connection from 127.0.0.1:49390 torn down before Call kudu.rpc.GenericCalculatorService.Sleep from 127.0.0.1:49390 (request call id 2) could send its response
[       OK ] Parameters/TestRpc.TestCallTimeout/SSL_TCP (2266 ms)
[ RUN      ] Parameters/TestRpc.TestServerShutsDown/SSL_TCP
I20260925 16:42:12.444585   390 rpc-test.cc:1125] Connecting to 0.0.0.0:39475
W20260925 16:42:12.453835   712 negotiation.cc:337] Failed RPC negotiation. Trace:
0925 16:42:12.452055 (+     0us) reactor.cc:625] Submitting negotiation task for client connection to 0.0.0.0:39475 (local address 127.0.0.1:60942)
0925 16:42:12.452488 (+   433us) negotiation.cc:107] Waiting for socket to connect
0925 16:42:12.452521 (+    33us) client_negotiation.cc:174] Beginning negotiation
0925 16:42:12.452741 (+   220us) client_negotiation.cc:252] Sending NEGOTIATE NegotiatePB request
0925 16:42:12.452969 (+   228us) negotiation.cc:327] Negotiation complete: Network error: Client connection negotiation failed: client connection to 0.0.0.0:39475: BlockingWrite error: write error: Broken pipe (error 32)
Metrics: {"client-negotiator.queue_time_us":119}
[       OK ] Parameters/TestRpc.TestServerShutsDown/SSL_TCP (13 ms)
[ RUN      ] Parameters/TestRpc.TimedOutOnResponseMetric/SSL_TCP
I20260925 16:42:12.472680   729 acceptor_pool.cc:254] collecting diagnostics on the listening RPC socket 0.0.0.0:34721 every 8 connection(s)
I20260925 16:42:12.473343   730 acceptor_pool.cc:254] collecting diagnostics on the listening RPC socket 0.0.0.0:34721 every 8 connection(s)
W20260925 16:42:12.703998   733 rpcz_store.cc:267] Call kudu.rpc_test.CalculatorService.Sleep from 127.0.0.1:46370 (request call id 3) took 50 ms (client timeout 25 ms). Trace:
W20260925 16:42:12.704346   733 rpcz_store.cc:269] 0925 16:42:12.653400 (+     0us) service_pool.cc:170] Inserting onto call queue
0925 16:42:12.653508 (+   108us) service_pool.cc:227] Handling call
0925 16:42:12.703911 (+ 50403us) inbound_call.cc:173] Queueing success response
Related trace 'test_child':
Metrics: {"test_sleep_us":50000,"child_traces":[["test_child",{"related_trace_metric":1}]]}
W20260925 16:42:12.762833   733 rpcz_store.cc:267] Call kudu.rpc_test.CalculatorService.Sleep from 127.0.0.1:46370 (request call id 4) took 50 ms (client timeout 50 ms). Trace:
W20260925 16:42:12.763140   733 rpcz_store.cc:269] 0925 16:42:12.712356 (+     0us) service_pool.cc:170] Inserting onto call queue
0925 16:42:12.712473 (+   117us) service_pool.cc:227] Handling call
0925 16:42:12.762775 (+ 50302us) inbound_call.cc:173] Queueing success response
Related trace 'test_child':
Metrics: {"test_sleep_us":50000,"child_traces":[["test_child",{"related_trace_metric":1}]]}
[       OK ] Parameters/TestRpc.TimedOutOnResponseMetric/SSL_TCP (315 ms)
[ RUN      ] Parameters/TestRpc.AcceptorDispatchingTimesMetric/SSL_TCP
I20260925 16:42:12.790450   754 acceptor_pool.cc:254] collecting diagnostics on the listening RPC socket 0.0.0.0:39597 every 8 connection(s)
I20260925 16:42:12.791240   755 acceptor_pool.cc:254] collecting diagnostics on the listening RPC socket 0.0.0.0:39597 every 8 connection(s)
W20260925 16:42:12.798514   750 negotiation.cc:337] Failed RPC negotiation. Trace:
0925 16:42:12.796422 (+     0us) reactor.cc:625] Submitting negotiation task for server connection from 127.0.0.1:50936 (local address 127.0.0.1:39597)
0925 16:42:12.797241 (+   819us) server_negotiation.cc:206] Beginning negotiation
0925 16:42:12.797268 (+    27us) server_negotiation.cc:399] Waiting for connection header
0925 16:42:12.797575 (+   307us) negotiation.cc:327] Negotiation complete: Network error: Server connection negotiation failed: server connection from 127.0.0.1:50936: BlockingRecv error: recv got EOF from 127.0.0.1:50936 (error 108)
Metrics: {"server-negotiator.queue_time_us":148}
[       OK ] Parameters/TestRpc.AcceptorDispatchingTimesMetric/SSL_TCP (31 ms)
[ RUN      ] Parameters/TestRpc.TestRpcCallbackDestroysMessenger/SSL_TCP
[       OK ] Parameters/TestRpc.TestRpcCallbackDestroysMessenger/SSL_TCP (35 ms)
[ RUN      ] Parameters/TestRpc.TestApplicationFeatureFlag/SSL_TCP
I20260925 16:42:12.857769   779 acceptor_pool.cc:254] collecting diagnostics on the listening RPC socket 0.0.0.0:36537 every 8 connection(s)
I20260925 16:42:12.858467   780 acceptor_pool.cc:254] collecting diagnostics on the listening RPC socket 0.0.0.0:36537 every 8 connection(s)
W20260925 16:42:12.903280   778 messenger.cc:357] Unable to handle RPC call: Not implemented: call requires unsupported application feature flags: 99
[       OK ] Parameters/TestRpc.TestApplicationFeatureFlag/SSL_TCP (72 ms)
[ RUN      ] Parameters/TestRpc.TestCancellation/SSL_TCP
I20260925 16:42:12.939916   804 acceptor_pool.cc:254] collecting diagnostics on the listening RPC socket 0.0.0.0:43085 every 8 connection(s)
I20260925 16:42:12.940654   805 acceptor_pool.cc:254] collecting diagnostics on the listening RPC socket 0.0.0.0:43085 every 8 connection(s)
I20260925 16:42:12.944065   390 rpc-test.cc:1648] Connecting to 0.0.0.0:43085
I20260925 16:42:13.050331   390 rpc-test-base.h:595] status: Aborted: Sleep RPC to 0.0.0.0:43085 is cancelled in state READY, seconds elapsed: 0.00035177
I20260925 16:42:13.212761   390 rpc-test-base.h:595] status: Aborted: Sleep RPC to 0.0.0.0:43085 is cancelled in state SENT, seconds elapsed: 0.000970189
I20260925 16:42:13.254439   807 rpc-test-base.h:222] got call: sleep_micros: 510000
I20260925 16:42:13.391741   390 rpc-test-base.h:595] status: Aborted: Sleep RPC to 0.0.0.0:43085 is cancelled in state SENT, seconds elapsed: 0.000988115
I20260925 16:42:13.430660   806 rpc-test-base.h:222] got call: sleep_micros: 510000
I20260925 16:42:13.555449   390 rpc-test-base.h:595] status: Aborted: Sleep RPC to 0.0.0.0:43085 is cancelled in state SENT, seconds elapsed: 0.00080797
W20260925 16:42:13.595212   808 rpcz_store.cc:267] Call kudu.rpc.GenericCalculatorService.Sleep from 127.0.0.1:47632 (request call id 11) took 15 ms (client timeout 10 ms). Trace:
W20260925 16:42:13.595517   808 rpcz_store.cc:269] 0925 16:42:13.580077 (+     0us) service_pool.cc:170] Inserting onto call queue
0925 16:42:13.594903 (+ 14826us) service_pool.cc:214] Skipping call since client already timed out
0925 16:42:13.595015 (+   112us) inbound_call.cc:173] Queueing failure response
Metrics: {}
I20260925 16:42:13.596060   808 rpc-test-base.h:222] got call: sleep_micros: 1500000
W20260925 16:42:13.765233   807 rpcz_store.cc:267] Call kudu.rpc.GenericCalculatorService.Sleep from 127.0.0.1:47632 (request call id 3) took 511 ms (client timeout 10 ms). Trace:
W20260925 16:42:13.765614   807 rpcz_store.cc:269] 0925 16:42:13.254107 (+     0us) service_pool.cc:170] Inserting onto call queue
0925 16:42:13.254347 (+   240us) service_pool.cc:227] Handling call
0925 16:42:13.765175 (+510828us) inbound_call.cc:173] Queueing success response
Metrics: {}
W20260925 16:42:13.941510   806 rpcz_store.cc:267] Call kudu.rpc.GenericCalculatorService.Sleep from 127.0.0.1:47632 (request call id 7) took 511 ms (client timeout 10 ms). Trace:
W20260925 16:42:13.941922   806 rpcz_store.cc:269] 0925 16:42:13.430395 (+     0us) service_pool.cc:170] Inserting onto call queue
0925 16:42:13.430571 (+   176us) service_pool.cc:227] Handling call
0925 16:42:13.941454 (+510883us) inbound_call.cc:173] Queueing success response
Metrics: {}
I20260925 16:42:14.557935   390 rpc-test-base.h:595] status: Timed out: Sleep RPC to 0.0.0.0:43085 timed out after 1.000s (SENT), seconds elapsed: 1.00209
I20260925 16:42:14.559192   806 rpc-test-base.h:222] got call: sleep_micros: 1500000
W20260925 16:42:15.096616   808 rpcz_store.cc:267] Call kudu.rpc.GenericCalculatorService.Sleep from 127.0.0.1:47632 (request call id 12) took 1516 ms (client timeout 1000 ms). Trace:
W20260925 16:42:15.096956   808 rpcz_store.cc:269] 0925 16:42:13.580416 (+     0us) service_pool.cc:170] Inserting onto call queue
0925 16:42:13.596029 (+ 15613us) service_pool.cc:227] Handling call
0925 16:42:15.096554 (+1500525us) inbound_call.cc:173] Queueing success response
Metrics: {}
I20260925 16:42:15.559363   390 rpc-test-base.h:595] status: Timed out: Sleep RPC to 0.0.0.0:43085 timed out after 1.000s (SENT), seconds elapsed: 1.00114
W20260925 16:42:15.560691   803 messenger.cc:357] Unable to handle RPC call: Not implemented: call requires unsupported application feature flags: 99, 1
W20260925 16:42:15.562054   803 messenger.cc:357] Unable to handle RPC call: Not implemented: call requires unsupported application feature flags: 99, 1
W20260925 16:42:16.059679   806 rpcz_store.cc:267] Call kudu.rpc.GenericCalculatorService.Sleep from 127.0.0.1:47632 (request call id 13) took 1500 ms (client timeout 1000 ms). Trace:
W20260925 16:42:16.059994   806 rpcz_store.cc:269] 0925 16:42:14.558985 (+     0us) service_pool.cc:170] Inserting onto call queue
0925 16:42:14.559129 (+   144us) service_pool.cc:227] Handling call
0925 16:42:16.059621 (+1500492us) inbound_call.cc:173] Queueing success response
Metrics: {}
W20260925 16:42:16.060500   803 connection.cc:441] server connection from 127.0.0.1:47632 torn down before Call kudu.rpc.GenericCalculatorService.Sleep from 127.0.0.1:47632 (request call id 13) could send its response
[       OK ] Parameters/TestRpc.TestCancellation/SSL_TCP (3155 ms)
[ RUN      ] Parameters/TestRpc.TestCancellationMultiThreads/SSL_TCP
I20260925 16:42:16.087899   829 acceptor_pool.cc:254] collecting diagnostics on the listening RPC socket 0.0.0.0:36119 every 8 connection(s)
I20260925 16:42:16.088634   830 acceptor_pool.cc:254] collecting diagnostics on the listening RPC socket 0.0.0.0:36119 every 8 connection(s)
I20260925 16:42:16.091658   390 rpc-test.cc:1808] Connecting to 0.0.0.0:36119
I20260925 16:42:16.241874   843 test_util.cc:268] Using random seed: 1713871541
I20260925 16:42:16.243412   844 test_util.cc:268] Using random seed: 1713873075
I20260925 16:42:16.244782   845 test_util.cc:268] Using random seed: 1713874443
I20260925 16:42:16.246351   846 test_util.cc:268] Using random seed: 1713875989
I20260925 16:42:16.247896   847 test_util.cc:268] Using random seed: 1713877443
I20260925 16:42:16.250041   848 test_util.cc:268] Using random seed: 1713879570
I20260925 16:42:16.251701   849 test_util.cc:268] Using random seed: 1713881180
I20260925 16:42:16.253410   850 test_util.cc:268] Using random seed: 1713882937
I20260925 16:42:16.255434   851 test_util.cc:268] Using random seed: 1713885015
I20260925 16:42:16.257364   852 test_util.cc:268] Using random seed: 1713886913
I20260925 16:42:16.258906   853 test_util.cc:268] Using random seed: 1713888111
I20260925 16:42:16.260224   854 test_util.cc:268] Using random seed: 1713889748
I20260925 16:42:16.262178   855 test_util.cc:268] Using random seed: 1713891692
I20260925 16:42:16.264343   856 test_util.cc:268] Using random seed: 1713893780
I20260925 16:42:16.266590   857 test_util.cc:268] Using random seed: 1713896135
I20260925 16:42:16.268718   858 test_util.cc:268] Using random seed: 1713898235
I20260925 16:42:16.271217   859 test_util.cc:268] Using random seed: 1713900752
I20260925 16:42:16.273378   860 test_util.cc:268] Using random seed: 1713902457
I20260925 16:42:16.275529   861 test_util.cc:268] Using random seed: 1713904607
I20260925 16:42:16.277318   862 test_util.cc:268] Using random seed: 1713906806
I20260925 16:42:16.281467   863 test_util.cc:268] Using random seed: 1713910945
I20260925 16:42:16.283584   864 test_util.cc:268] Using random seed: 1713912688
I20260925 16:42:16.285795   865 test_util.cc:268] Using random seed: 1713914788
I20260925 16:42:16.290990   866 test_util.cc:268] Using random seed: 1713920511
I20260925 16:42:16.293249   867 test_util.cc:268] Using random seed: 1713922746
I20260925 16:42:16.295449   868 test_util.cc:268] Using random seed: 1713924578
I20260925 16:42:16.297242   869 test_util.cc:268] Using random seed: 1713926769
I20260925 16:42:16.299377   870 test_util.cc:268] Using random seed: 1713928892
I20260925 16:42:16.301227   871 test_util.cc:268] Using random seed: 1713930730
I20260925 16:42:16.304232   872 test_util.cc:268] Using random seed: 1713933807
[       OK ] Parameters/TestRpc.TestCancellationMultiThreads/SSL_TCP (17807 ms)
[ RUN      ] Parameters/TestRpc.TestCallId/SSL_TCP
I20260925 16:42:33.904529   886 acceptor_pool.cc:254] collecting diagnostics on the listening RPC socket 0.0.0.0:41731 every 8 connection(s)
I20260925 16:42:33.905329   887 acceptor_pool.cc:254] collecting diagnostics on the listening RPC socket 0.0.0.0:41731 every 8 connection(s)
[       OK ] Parameters/TestRpc.TestCallId/SSL_TCP (80 ms)
[----------] 20 tests from Parameters/TestRpc (37502 ms total)

[----------] Global test environment tear-down
[==========] 21 tests from 2 test suites ran. (37510 ms total)
[  PASSED  ] 20 tests.
[  FAILED  ] 1 test, listed below:
[  FAILED  ] Parameters/TestRpc.TestCallWithChainCertAndRootCA/SSL_TCP, where GetParam() = (true, false)

 1 FAILED TEST