Parameters/TestRpc.TestCallWithChainCertAndRootCA/SSL_TCP: /data0/somelongdirectorytoavoidrpathissues/src/kudu/src/kudu/rpc/rpc-test.cc:303: Failure
Failed
Bad status: Runtime error: could not verify certificate chain (error with cert: subject=CN = localhost, ST = sadfjas, C = AS, emailAddress = sdflkdsajf, O = lskdfjlsad, OU = sldfkja, issuer=C = AS, ST = ASDfkjdhf, L = lskdjf, O = saldfja, OU = skdjf, CN = localhost, emailAddress = sadjflkadsj): : certificate has expired
Google Test trace:
/data0/somelongdirectorytoavoidrpathissues/src/kudu/src/kudu/rpc/rpc-test.cc:300: Connecting to 0.0.0.0:35553
I20260927 19:38:31.143500 3472 test_util.cc:175] -----------------------------------------------
I20260927 19:38:31.143741 3472 test_util.cc:176] Had fatal failures, leaving test files at /tmp/dist-test-taskHHgQzK/test-tmp/rpc-test.1.Parameters_TestRpc.TestCallWithChainCertAndRootCA_SSL_TCP.1790537909570884-3472-0
Note: This is test shard 2 of 8.
[==========] Running 21 tests from 2 test suites.
[----------] Global test environment set-up.
[----------] 1 test from TestRpc
[ RUN ] TestRpc.TestMethodsByName
[ OK ] TestRpc.TestMethodsByName (8 ms)
[----------] 1 test from TestRpc (8 ms total)
[----------] 20 tests from Parameters/TestRpc
[ RUN ] Parameters/TestRpc.TestAcceptorPoolStartStop/SSL_TCP
WARNING: Logging before InitGoogleLogging() is written to STDERR
I20260927 19:38:29.699265 3487 acceptor_pool.cc:254] collecting diagnostics on the listening RPC socket 0.0.0.0:42239 every 8 connection(s)
I20260927 19:38:29.701256 3488 acceptor_pool.cc:254] collecting diagnostics on the listening RPC socket 0.0.0.0:42239 every 8 connection(s)
I20260927 19:38:30.875090 3499 acceptor_pool.cc:254] collecting diagnostics on the listening RPC socket 0.0.0.0:37359 every 8 connection(s)
I20260927 19:38:30.876894 3500 acceptor_pool.cc:254] collecting diagnostics on the listening RPC socket 0.0.0.0:37359 every 8 connection(s)
I20260927 19:38:30.897769 3510 acceptor_pool.cc:254] collecting diagnostics on the listening RPC socket 0.0.0.0:39253 every 8 connection(s)
I20260927 19:38:30.899501 3511 acceptor_pool.cc:254] collecting diagnostics on the listening RPC socket 0.0.0.0:39253 every 8 connection(s)
I20260927 19:38:30.931069 3521 acceptor_pool.cc:254] collecting diagnostics on the listening RPC socket 0.0.0.0:36173 every 8 connection(s)
I20260927 19:38:30.931838 3522 acceptor_pool.cc:254] collecting diagnostics on the listening RPC socket 0.0.0.0:36173 every 8 connection(s)
I20260927 19:38:30.958165 3532 acceptor_pool.cc:254] collecting diagnostics on the listening RPC socket 0.0.0.0:40879 every 8 connection(s)
I20260927 19:38:30.959016 3533 acceptor_pool.cc:254] collecting diagnostics on the listening RPC socket 0.0.0.0:40879 every 8 connection(s)
[ OK ] Parameters/TestRpc.TestAcceptorPoolStartStop/SSL_TCP (1324 ms)
[ RUN ] Parameters/TestRpc.TestCall/SSL_TCP
I20260927 19:38:31.004025 3545 acceptor_pool.cc:254] collecting diagnostics on the listening RPC socket 0.0.0.0:44843 every 8 connection(s)
I20260927 19:38:31.006747 3546 acceptor_pool.cc:254] collecting diagnostics on the listening RPC socket 0.0.0.0:44843 every 8 connection(s)
I20260927 19:38:31.012694 3472 rpc-test.cc:234] Connecting to 0.0.0.0:44843
[ OK ] Parameters/TestRpc.TestCall/SSL_TCP (133 ms)
[ RUN ] Parameters/TestRpc.TestCallWithChainCertAndRootCA/SSL_TCP
I20260927 19:38:31.119563 3570 acceptor_pool.cc:254] collecting diagnostics on the listening RPC socket 0.0.0.0:35553 every 8 connection(s)
I20260927 19:38:31.120366 3571 acceptor_pool.cc:254] collecting diagnostics on the listening RPC socket 0.0.0.0:35553 every 8 connection(s)
/data0/somelongdirectorytoavoidrpathissues/src/kudu/src/kudu/rpc/rpc-test.cc:303: Failure
Failed
Bad status: Runtime error: could not verify certificate chain (error with cert: subject=CN = localhost, ST = sadfjas, C = AS, emailAddress = sdflkdsajf, O = lskdfjlsad, OU = sldfkja, issuer=C = AS, ST = ASDfkjdhf, L = lskdjf, O = saldfja, OU = skdjf, CN = localhost, emailAddress = sadjflkadsj): : certificate has expired
Google Test trace:
/data0/somelongdirectorytoavoidrpathissues/src/kudu/src/kudu/rpc/rpc-test.cc:300: Connecting to 0.0.0.0:35553
I20260927 19:38:31.143500 3472 test_util.cc:175] -----------------------------------------------
I20260927 19:38:31.143741 3472 test_util.cc:176] Had fatal failures, leaving test files at /tmp/dist-test-taskHHgQzK/test-tmp/rpc-test.1.Parameters_TestRpc.TestCallWithChainCertAndRootCA_SSL_TCP.1790537909570884-3472-0
[ FAILED ] Parameters/TestRpc.TestCallWithChainCertAndRootCA/SSL_TCP, where GetParam() = (true, false) (46 ms)
[ RUN ] Parameters/TestRpc.TestCallWithBadPasswordProtectedKey/SSL_TCP
[ OK ] Parameters/TestRpc.TestCallWithBadPasswordProtectedKey/SSL_TCP (35 ms)
[ RUN ] Parameters/TestRpc.TestInvalidMethodCall/SSL_TCP
I20260927 19:38:31.203791 3607 acceptor_pool.cc:254] collecting diagnostics on the listening RPC socket 0.0.0.0:36575 every 8 connection(s)
I20260927 19:38:31.204708 3608 acceptor_pool.cc:254] collecting diagnostics on the listening RPC socket 0.0.0.0:36575 every 8 connection(s)
I20260927 19:38:31.208668 3472 rpc-test.cc:406] Connecting to 0.0.0.0:36575
[ OK ] Parameters/TestRpc.TestInvalidMethodCall/SSL_TCP (75 ms)
[ RUN ] Parameters/TestRpc.TestHighFDs/SSL_TCP
I20260927 19:38:31.502058 3632 acceptor_pool.cc:254] collecting diagnostics on the listening RPC socket 0.0.0.0:35035 every 8 connection(s)
I20260927 19:38:31.502897 3633 acceptor_pool.cc:254] collecting diagnostics on the listening RPC socket 0.0.0.0:35035 every 8 connection(s)
[ OK ] Parameters/TestRpc.TestHighFDs/SSL_TCP (294 ms)
[ RUN ] Parameters/TestRpc.TestConnectionAlwaysKeepalive/SSL_TCP
I20260927 19:38:31.569487 3655 acceptor_pool.cc:254] collecting diagnostics on the listening RPC socket 0.0.0.0:43835 every 8 connection(s)
I20260927 19:38:31.570287 3656 acceptor_pool.cc:254] collecting diagnostics on the listening RPC socket 0.0.0.0:43835 every 8 connection(s)
I20260927 19:38:31.573743 3472 rpc-test.cc:532] Connecting to 0.0.0.0:43835
[ OK ] Parameters/TestRpc.TestConnectionAlwaysKeepalive/SSL_TCP (3067 ms)
[ RUN ] Parameters/TestRpc.TestReopenOutboundConnections/SSL_TCP
I20260927 19:38:34.646811 3678 acceptor_pool.cc:254] collecting diagnostics on the listening RPC socket 0.0.0.0:42099 every 8 connection(s)
I20260927 19:38:34.647564 3679 acceptor_pool.cc:254] collecting diagnostics on the listening RPC socket 0.0.0.0:42099 every 8 connection(s)
I20260927 19:38:34.651081 3472 rpc-test.cc:658] Connecting to 0.0.0.0:42099
[ OK ] Parameters/TestRpc.TestReopenOutboundConnections/SSL_TCP (425 ms)
[ RUN ] Parameters/TestRpc.TestConnectionNetworkPlane/SSL_TCP
I20260927 19:38:35.071960 3701 acceptor_pool.cc:254] collecting diagnostics on the listening RPC socket 0.0.0.0:33929 every 8 connection(s)
I20260927 19:38:35.072788 3702 acceptor_pool.cc:254] collecting diagnostics on the listening RPC socket 0.0.0.0:33929 every 8 connection(s)
I20260927 19:38:35.076388 3472 rpc-test.cc:772] Connecting to 0.0.0.0:33929
[ OK ] Parameters/TestRpc.TestConnectionNetworkPlane/SSL_TCP (107 ms)
[ RUN ] Parameters/TestRpc.TestTCPKeepalive/SSL_TCP
I20260927 19:38:35.184396 3726 acceptor_pool.cc:254] collecting diagnostics on the listening RPC socket 0.0.0.0:41807 every 8 connection(s)
I20260927 19:38:35.185148 3727 acceptor_pool.cc:254] collecting diagnostics on the listening RPC socket 0.0.0.0:41807 every 8 connection(s)
I20260927 19:38:35.218650 3730 rpc-test-base.h:222] got call: sleep_micros: 8000000 deferred: true
I20260927 19:38:43.223388 3730 rpcz_store.cc:275] Call kudu.rpc.GenericCalculatorService.Sleep from 127.0.0.1:43904 (request call id 0) took 8005 ms. Trace:
I20260927 19:38:43.223934 3730 rpcz_store.cc:276] 0927 19:38:35.218345 (+ 0us) service_pool.cc:170] Inserting onto call queue
0927 19:38:35.218456 (+ 111us) service_pool.cc:227] Handling call
0927 19:38:43.223170 (+8004714us) inbound_call.cc:173] Queueing success response
Metrics: {}
[ OK ] Parameters/TestRpc.TestTCPKeepalive/SSL_TCP (8089 ms)
[ RUN ] Parameters/TestRpc.TestMaxSmallSidecars/SSL_TCP
I20260927 19:38:43.299893 3752 acceptor_pool.cc:254] collecting diagnostics on the listening RPC socket 0.0.0.0:36879 every 8 connection(s)
I20260927 19:38:43.300823 3753 acceptor_pool.cc:254] collecting diagnostics on the listening RPC socket 0.0.0.0:36879 every 8 connection(s)
[ OK ] Parameters/TestRpc.TestMaxSmallSidecars/SSL_TCP (247 ms)
[ RUN ] Parameters/TestRpc.TestCallTimeout/SSL_TCP
I20260927 19:38:43.516867 3777 acceptor_pool.cc:254] collecting diagnostics on the listening RPC socket 0.0.0.0:40599 every 8 connection(s)
I20260927 19:38:43.517668 3778 acceptor_pool.cc:254] collecting diagnostics on the listening RPC socket 0.0.0.0:40599 every 8 connection(s)
I20260927 19:38:43.536927 3472 rpc-test-base.h:595] status: Timed out: connection negotiation to 0.0.0.0:40599 for RPC Sleep timed out after 0.000s (ON_OUTBOUND_QUEUE), seconds elapsed: 0.00266643
I20260927 19:38:43.544684 3781 rpc-test-base.h:222] got call: sleep_micros: 700000
I20260927 19:38:43.738773 3472 rpc-test-base.h:595] status: Timed out: Sleep RPC to 0.0.0.0:40599 timed out after 0.200s (SENT), seconds elapsed: 0.201454
I20260927 19:38:43.740796 3780 rpc-test-base.h:222] got call: sleep_micros: 2000000
W20260927 19:38:44.245540 3781 rpcz_store.cc:267] Call kudu.rpc.GenericCalculatorService.Sleep from 127.0.0.1:59570 (request call id 1) took 701 ms (client timeout 200 ms). Trace:
W20260927 19:38:44.245929 3781 rpcz_store.cc:269] 0927 19:38:43.544475 (+ 0us) service_pool.cc:170] Inserting onto call queue
0927 19:38:43.544612 (+ 137us) service_pool.cc:227] Handling call
0927 19:38:44.245454 (+700842us) inbound_call.cc:173] Queueing success response
Metrics: {}
I20260927 19:38:45.240487 3472 rpc-test-base.h:595] status: Timed out: Sleep RPC to 0.0.0.0:40599 timed out after 1.500s (SENT), seconds elapsed: 1.50102
W20260927 19:38:45.741400 3780 rpcz_store.cc:267] Call kudu.rpc.GenericCalculatorService.Sleep from 127.0.0.1:59570 (request call id 2) took 2000 ms (client timeout 1500 ms). Trace:
W20260927 19:38:45.741775 3780 rpcz_store.cc:269] 0927 19:38:43.740487 (+ 0us) service_pool.cc:170] Inserting onto call queue
0927 19:38:43.740618 (+ 131us) service_pool.cc:227] Handling call
0927 19:38:45.741324 (+2000706us) inbound_call.cc:173] Queueing success response
Metrics: {}
W20260927 19:38:45.742542 3775 connection.cc:441] server connection from 127.0.0.1:59570 torn down before Call kudu.rpc.GenericCalculatorService.Sleep from 127.0.0.1:59570 (request call id 2) could send its response
[ OK ] Parameters/TestRpc.TestCallTimeout/SSL_TCP (2261 ms)
[ RUN ] Parameters/TestRpc.TestServerShutsDown/SSL_TCP
I20260927 19:38:45.750795 3472 rpc-test.cc:1125] Connecting to 0.0.0.0:39857
W20260927 19:38:45.762339 3794 negotiation.cc:337] Failed RPC negotiation. Trace:
0927 19:38:45.760345 (+ 0us) reactor.cc:625] Submitting negotiation task for client connection to 0.0.0.0:39857 (local address 127.0.0.1:53480)
0927 19:38:45.760841 (+ 496us) negotiation.cc:107] Waiting for socket to connect
0927 19:38:45.760876 (+ 35us) client_negotiation.cc:174] Beginning negotiation
0927 19:38:45.761183 (+ 307us) client_negotiation.cc:252] Sending NEGOTIATE NegotiatePB request
0927 19:38:45.761472 (+ 289us) negotiation.cc:327] Negotiation complete: Network error: Client connection negotiation failed: client connection to 0.0.0.0:39857: BlockingWrite error: write error: Broken pipe (error 32)
Metrics: {"client-negotiator.queue_time_us":137}
[ OK ] Parameters/TestRpc.TestServerShutsDown/SSL_TCP (16 ms)
[ RUN ] Parameters/TestRpc.TimedOutOnResponseMetric/SSL_TCP
I20260927 19:38:45.785051 3811 acceptor_pool.cc:254] collecting diagnostics on the listening RPC socket 0.0.0.0:44513 every 8 connection(s)
I20260927 19:38:45.785881 3812 acceptor_pool.cc:254] collecting diagnostics on the listening RPC socket 0.0.0.0:44513 every 8 connection(s)
W20260927 19:38:46.040020 3815 rpcz_store.cc:267] Call kudu.rpc_test.CalculatorService.Sleep from 127.0.0.1:47036 (request call id 3) took 50 ms (client timeout 25 ms). Trace:
W20260927 19:38:46.040427 3815 rpcz_store.cc:269] 0927 19:38:45.989286 (+ 0us) service_pool.cc:170] Inserting onto call queue
0927 19:38:45.989419 (+ 133us) service_pool.cc:227] Handling call
0927 19:38:46.039914 (+ 50495us) inbound_call.cc:173] Queueing success response
Related trace 'test_child':
Metrics: {"test_sleep_us":50000,"child_traces":[["test_child",{"related_trace_metric":1}]]}
W20260927 19:38:46.100091 3815 rpcz_store.cc:267] Call kudu.rpc_test.CalculatorService.Sleep from 127.0.0.1:47036 (request call id 4) took 50 ms (client timeout 50 ms). Trace:
W20260927 19:38:46.100533 3815 rpcz_store.cc:269] 0927 19:38:46.049431 (+ 0us) service_pool.cc:170] Inserting onto call queue
0927 19:38:46.049598 (+ 167us) service_pool.cc:227] Handling call
0927 19:38:46.100007 (+ 50409us) inbound_call.cc:173] Queueing success response
Related trace 'test_child':
Metrics: {"test_sleep_us":50000,"child_traces":[["test_child",{"related_trace_metric":1}]]}
W20260927 19:38:46.104053 3808 connection.cc:196] Error closing socket: Network error: TlsSocket::Close: Connection reset by peer
[ OK ] Parameters/TestRpc.TimedOutOnResponseMetric/SSL_TCP (343 ms)
[ RUN ] Parameters/TestRpc.AcceptorDispatchingTimesMetric/SSL_TCP
I20260927 19:38:46.122139 3836 acceptor_pool.cc:254] collecting diagnostics on the listening RPC socket 0.0.0.0:36993 every 8 connection(s)
I20260927 19:38:46.122877 3837 acceptor_pool.cc:254] collecting diagnostics on the listening RPC socket 0.0.0.0:36993 every 8 connection(s)
W20260927 19:38:46.129037 3832 negotiation.cc:337] Failed RPC negotiation. Trace:
0927 19:38:46.127074 (+ 0us) reactor.cc:625] Submitting negotiation task for server connection from 127.0.0.1:32966 (local address 127.0.0.1:36993)
0927 19:38:46.127806 (+ 732us) server_negotiation.cc:206] Beginning negotiation
0927 19:38:46.127844 (+ 38us) server_negotiation.cc:399] Waiting for connection header
0927 19:38:46.128248 (+ 404us) negotiation.cc:327] Negotiation complete: Network error: Server connection negotiation failed: server connection from 127.0.0.1:32966: BlockingRecv error: recv got EOF from 127.0.0.1:32966 (error 108)
Metrics: {"server-negotiator.queue_time_us":300}
[ OK ] Parameters/TestRpc.AcceptorDispatchingTimesMetric/SSL_TCP (24 ms)
[ RUN ] Parameters/TestRpc.TestRpcCallbackDestroysMessenger/SSL_TCP
[ OK ] Parameters/TestRpc.TestRpcCallbackDestroysMessenger/SSL_TCP (24 ms)
[ RUN ] Parameters/TestRpc.TestApplicationFeatureFlag/SSL_TCP
I20260927 19:38:46.177845 3861 acceptor_pool.cc:254] collecting diagnostics on the listening RPC socket 0.0.0.0:36929 every 8 connection(s)
I20260927 19:38:46.178630 3862 acceptor_pool.cc:254] collecting diagnostics on the listening RPC socket 0.0.0.0:36929 every 8 connection(s)
W20260927 19:38:46.223829 3860 messenger.cc:357] Unable to handle RPC call: Not implemented: call requires unsupported application feature flags: 99
[ OK ] Parameters/TestRpc.TestApplicationFeatureFlag/SSL_TCP (74 ms)
[ RUN ] Parameters/TestRpc.TestCancellation/SSL_TCP
I20260927 19:38:46.256162 3886 acceptor_pool.cc:254] collecting diagnostics on the listening RPC socket 0.0.0.0:41847 every 8 connection(s)
I20260927 19:38:46.256978 3887 acceptor_pool.cc:254] collecting diagnostics on the listening RPC socket 0.0.0.0:41847 every 8 connection(s)
I20260927 19:38:46.260540 3472 rpc-test.cc:1648] Connecting to 0.0.0.0:41847
I20260927 19:38:46.383742 3472 rpc-test-base.h:595] status: Aborted: Sleep RPC to 0.0.0.0:41847 is cancelled in state READY, seconds elapsed: 0.000491147
I20260927 19:38:46.540270 3472 rpc-test-base.h:595] status: Aborted: Sleep RPC to 0.0.0.0:41847 is cancelled in state SENT, seconds elapsed: 0.00102198
I20260927 19:38:46.614076 3889 rpc-test-base.h:222] got call: sleep_micros: 510000
I20260927 19:38:46.737248 3472 rpc-test-base.h:595] status: Aborted: Sleep RPC to 0.0.0.0:41847 is cancelled in state SENT, seconds elapsed: 0.00122474
I20260927 19:38:46.790973 3888 rpc-test-base.h:222] got call: sleep_micros: 510000
I20260927 19:38:46.928555 3472 rpc-test-base.h:595] status: Aborted: Sleep RPC to 0.0.0.0:41847 is cancelled in state SENT, seconds elapsed: 0.000951852
W20260927 19:38:46.971149 3890 rpcz_store.cc:267] Call kudu.rpc.GenericCalculatorService.Sleep from 127.0.0.1:50724 (request call id 11) took 16 ms (client timeout 10 ms). Trace:
W20260927 19:38:46.971500 3890 rpcz_store.cc:269] 0927 19:38:46.954302 (+ 0us) service_pool.cc:170] Inserting onto call queue
0927 19:38:46.970883 (+ 16581us) service_pool.cc:214] Skipping call since client already timed out
0927 19:38:46.970981 (+ 98us) inbound_call.cc:173] Queueing failure response
Metrics: {}
I20260927 19:38:46.972102 3890 rpc-test-base.h:222] got call: sleep_micros: 1500000
W20260927 19:38:47.124992 3889 rpcz_store.cc:267] Call kudu.rpc.GenericCalculatorService.Sleep from 127.0.0.1:50724 (request call id 3) took 511 ms (client timeout 10 ms). Trace:
W20260927 19:38:47.125389 3889 rpcz_store.cc:269] 0927 19:38:46.613752 (+ 0us) service_pool.cc:170] Inserting onto call queue
0927 19:38:46.613968 (+ 216us) service_pool.cc:227] Handling call
0927 19:38:47.124921 (+510953us) inbound_call.cc:173] Queueing success response
Metrics: {}
W20260927 19:38:47.301734 3888 rpcz_store.cc:267] Call kudu.rpc.GenericCalculatorService.Sleep from 127.0.0.1:50724 (request call id 7) took 511 ms (client timeout 10 ms). Trace:
W20260927 19:38:47.302145 3888 rpcz_store.cc:269] 0927 19:38:46.790791 (+ 0us) service_pool.cc:170] Inserting onto call queue
0927 19:38:46.790903 (+ 112us) service_pool.cc:227] Handling call
0927 19:38:47.301663 (+510760us) inbound_call.cc:173] Queueing success response
Metrics: {}
I20260927 19:38:47.930725 3472 rpc-test-base.h:595] status: Timed out: Sleep RPC to 0.0.0.0:41847 timed out after 1.000s (SENT), seconds elapsed: 1.00173
I20260927 19:38:47.932252 3888 rpc-test-base.h:222] got call: sleep_micros: 1500000
W20260927 19:38:48.472651 3890 rpcz_store.cc:267] Call kudu.rpc.GenericCalculatorService.Sleep from 127.0.0.1:50724 (request call id 12) took 1518 ms (client timeout 1000 ms). Trace:
W20260927 19:38:48.473039 3890 rpcz_store.cc:269] 0927 19:38:46.954529 (+ 0us) service_pool.cc:170] Inserting onto call queue
0927 19:38:46.972059 (+ 17530us) service_pool.cc:227] Handling call
0927 19:38:48.472578 (+1500519us) inbound_call.cc:173] Queueing success response
Metrics: {}
I20260927 19:38:48.933341 3472 rpc-test-base.h:595] status: Timed out: Sleep RPC to 0.0.0.0:41847 timed out after 1.000s (SENT), seconds elapsed: 1.00226
W20260927 19:38:48.935191 3884 messenger.cc:357] Unable to handle RPC call: Not implemented: call requires unsupported application feature flags: 99, 1
W20260927 19:38:48.936830 3884 messenger.cc:357] Unable to handle RPC call: Not implemented: call requires unsupported application feature flags: 99, 1
W20260927 19:38:49.432968 3888 rpcz_store.cc:267] Call kudu.rpc.GenericCalculatorService.Sleep from 127.0.0.1:50724 (request call id 13) took 1500 ms (client timeout 1000 ms). Trace:
W20260927 19:38:49.433380 3888 rpcz_store.cc:269] 0927 19:38:47.932062 (+ 0us) service_pool.cc:170] Inserting onto call queue
0927 19:38:47.932190 (+ 128us) service_pool.cc:227] Handling call
0927 19:38:49.432895 (+1500705us) inbound_call.cc:173] Queueing success response
Metrics: {}
W20260927 19:38:49.433964 3884 connection.cc:441] server connection from 127.0.0.1:50724 torn down before Call kudu.rpc.GenericCalculatorService.Sleep from 127.0.0.1:50724 (request call id 13) could send its response
[ OK ] Parameters/TestRpc.TestCancellation/SSL_TCP (3208 ms)
[ RUN ] Parameters/TestRpc.TestCancellationMultiThreads/SSL_TCP
I20260927 19:38:49.472970 3911 acceptor_pool.cc:254] collecting diagnostics on the listening RPC socket 0.0.0.0:46713 every 8 connection(s)
I20260927 19:38:49.473953 3912 acceptor_pool.cc:254] collecting diagnostics on the listening RPC socket 0.0.0.0:46713 every 8 connection(s)
I20260927 19:38:49.480393 3472 rpc-test.cc:1808] Connecting to 0.0.0.0:46713
I20260927 19:38:49.640511 3925 test_util.cc:268] Using random seed: 423676431
I20260927 19:38:49.641888 3926 test_util.cc:268] Using random seed: 423677827
I20260927 19:38:49.643690 3927 test_util.cc:268] Using random seed: 423679620
I20260927 19:38:49.645455 3928 test_util.cc:268] Using random seed: 423681369
I20260927 19:38:49.647429 3929 test_util.cc:268] Using random seed: 423683189
I20260927 19:38:49.648972 3930 test_util.cc:268] Using random seed: 423684774
I20260927 19:38:49.650646 3931 test_util.cc:268] Using random seed: 423686427
I20260927 19:38:49.652900 3932 test_util.cc:268] Using random seed: 423688632
I20260927 19:38:49.654585 3933 test_util.cc:268] Using random seed: 423690378
I20260927 19:38:49.656231 3934 test_util.cc:268] Using random seed: 423692000
I20260927 19:38:49.657968 3935 test_util.cc:268] Using random seed: 423693752
I20260927 19:38:49.660439 3936 test_util.cc:268] Using random seed: 423696155
I20260927 19:38:49.680809 3938 test_util.cc:268] Using random seed: 423716447
I20260927 19:38:49.684867 3939 test_util.cc:268] Using random seed: 423720506
I20260927 19:38:49.687182 3940 test_util.cc:268] Using random seed: 423722822
I20260927 19:38:49.689216 3941 test_util.cc:268] Using random seed: 423724975
I20260927 19:38:49.695448 3942 test_util.cc:268] Using random seed: 423731129
I20260927 19:38:49.697660 3943 test_util.cc:268] Using random seed: 423733366
I20260927 19:38:49.699580 3944 test_util.cc:268] Using random seed: 423735297
I20260927 19:38:49.701741 3945 test_util.cc:268] Using random seed: 423737437
I20260927 19:38:49.705477 3946 test_util.cc:268] Using random seed: 423741195
I20260927 19:38:49.707717 3947 test_util.cc:268] Using random seed: 423743374
I20260927 19:38:49.710278 3948 test_util.cc:268] Using random seed: 423745929
I20260927 19:38:49.713018 3949 test_util.cc:268] Using random seed: 423748734
I20260927 19:38:49.715252 3950 test_util.cc:268] Using random seed: 423750952
I20260927 19:38:49.719548 3951 test_util.cc:268] Using random seed: 423755214
I20260927 19:38:49.722137 3952 test_util.cc:268] Using random seed: 423757827
I20260927 19:38:49.724313 3953 test_util.cc:268] Using random seed: 423760049
I20260927 19:38:49.726331 3954 test_util.cc:268] Using random seed: 423762094
I20260927 19:38:49.728489 3955 test_util.cc:268] Using random seed: 423764186
[ OK ] Parameters/TestRpc.TestCancellationMultiThreads/SSL_TCP (19185 ms)
[ RUN ] Parameters/TestRpc.TestCallId/SSL_TCP
I20260927 19:39:08.651784 3968 acceptor_pool.cc:254] collecting diagnostics on the listening RPC socket 0.0.0.0:42657 every 8 connection(s)
I20260927 19:39:08.652628 3969 acceptor_pool.cc:254] collecting diagnostics on the listening RPC socket 0.0.0.0:42657 every 8 connection(s)
[ OK ] Parameters/TestRpc.TestCallId/SSL_TCP (86 ms)
[----------] 20 tests from Parameters/TestRpc (39075 ms total)
[----------] Global test environment tear-down
[==========] 21 tests from 2 test suites ran. (39084 ms total)
[ PASSED ] 20 tests.
[ FAILED ] 1 test, listed below:
[ FAILED ] Parameters/TestRpc.TestCallWithChainCertAndRootCA/SSL_TCP, where GetParam() = (true, false)
1 FAILED TEST