Diagnosed failure

Parameters/TestRpc.TestCallWithChainCertAndChainCA/SSL_UnixSocket: /data0/somelongdirectorytoavoidrpathissues/src/kudu/src/kudu/rpc/rpc-test.cc:270: Failure
Failed
Bad status: Runtime error: could not verify certificate chain (error with cert: subject=CN = localhost, ST = sadfjas, C = AS, emailAddress = sdflkdsajf, O = lskdfjlsad, OU = sldfkja, issuer=C = AS, ST = ASDfkjdhf, L = lskdjf, O = saldfja, OU = skdjf, CN = localhost, emailAddress = sadjflkadsj): : certificate has expired
Google Test trace:
/data0/somelongdirectorytoavoidrpathissues/src/kudu/src/kudu/rpc/rpc-test.cc:267: Connecting to unix:/tmp/dist-test-taskJQohsx/test-tmp/rpc-test-629a5fc0c4d4411daf470b46359b188c.sock
I20260925 15:08:40.898823 10514 test_util.cc:175] -----------------------------------------------
I20260925 15:08:40.898916 10514 test_util.cc:176] Had fatal failures, leaving test files at /tmp/dist-test-taskJQohsx/test-tmp/rpc-test.6.Parameters_TestRpc.TestCallWithChainCertAndChainCA_SSL_UnixSocket.1790348920772176-10514-0

Full log

Note: This is test shard 7 of 8.
[==========] Running 21 tests from 2 test suites.
[----------] Global test environment set-up.
[----------] 20 tests from Parameters/TestRpc
[ RUN      ] Parameters/TestRpc.TestMessengerCreateDestroy/SSL_UnixSocket
WARNING: Logging before InitGoogleLogging() is written to STDERR
I20260925 15:08:40.824977 10514 rpc-test.cc:169] started messenger TestCreateDestroy
[       OK ] Parameters/TestRpc.TestMessengerCreateDestroy/SSL_UnixSocket (36 ms)
[ RUN      ] Parameters/TestRpc.TestNegotiationDeadlock/SSL_UnixSocket
I20260925 15:08:40.856261 10534 acceptor_pool.cc:254] collecting diagnostics on the listening RPC socket unix:/tmp/dist-test-taskJQohsx/test-tmp/rpc-test-7637967bdcd645fc89a975159e7e34b9.sock every 8 connection(s)
I20260925 15:08:40.856604 10535 acceptor_pool.cc:254] collecting diagnostics on the listening RPC socket unix:/tmp/dist-test-taskJQohsx/test-tmp/rpc-test-7637967bdcd645fc89a975159e7e34b9.sock every 8 connection(s)
[       OK ] Parameters/TestRpc.TestNegotiationDeadlock/SSL_UnixSocket (47 ms)
[ RUN      ] Parameters/TestRpc.TestCallWithChainCertAndChainCA/SSL_UnixSocket
I20260925 15:08:40.887807 10550 acceptor_pool.cc:254] collecting diagnostics on the listening RPC socket unix:/tmp/dist-test-taskJQohsx/test-tmp/rpc-test-629a5fc0c4d4411daf470b46359b188c.sock every 8 connection(s)
I20260925 15:08:40.888118 10551 acceptor_pool.cc:254] collecting diagnostics on the listening RPC socket unix:/tmp/dist-test-taskJQohsx/test-tmp/rpc-test-629a5fc0c4d4411daf470b46359b188c.sock every 8 connection(s)
/data0/somelongdirectorytoavoidrpathissues/src/kudu/src/kudu/rpc/rpc-test.cc:270: Failure
Failed
Bad status: Runtime error: could not verify certificate chain (error with cert: subject=CN = localhost, ST = sadfjas, C = AS, emailAddress = sdflkdsajf, O = lskdfjlsad, OU = sldfkja, issuer=C = AS, ST = ASDfkjdhf, L = lskdjf, O = saldfja, OU = skdjf, CN = localhost, emailAddress = sadjflkadsj): : certificate has expired
Google Test trace:
/data0/somelongdirectorytoavoidrpathissues/src/kudu/src/kudu/rpc/rpc-test.cc:267: Connecting to unix:/tmp/dist-test-taskJQohsx/test-tmp/rpc-test-629a5fc0c4d4411daf470b46359b188c.sock
I20260925 15:08:40.898823 10514 test_util.cc:175] -----------------------------------------------
I20260925 15:08:40.898916 10514 test_util.cc:176] Had fatal failures, leaving test files at /tmp/dist-test-taskJQohsx/test-tmp/rpc-test.6.Parameters_TestRpc.TestCallWithChainCertAndChainCA_SSL_UnixSocket.1790348920772176-10514-0
[  FAILED  ] Parameters/TestRpc.TestCallWithChainCertAndChainCA/SSL_UnixSocket, where GetParam() = (true, true) (23 ms)
[ RUN      ] Parameters/TestRpc.TestCallWithPasswordProtectedKey/SSL_UnixSocket
I20260925 15:08:40.907032 10575 acceptor_pool.cc:254] collecting diagnostics on the listening RPC socket unix:/tmp/dist-test-taskJQohsx/test-tmp/rpc-test-bc040e4222214dea9d5594b6f20bd419.sock every 8 connection(s)
I20260925 15:08:40.907238 10576 acceptor_pool.cc:254] collecting diagnostics on the listening RPC socket unix:/tmp/dist-test-taskJQohsx/test-tmp/rpc-test-bc040e4222214dea9d5594b6f20bd419.sock every 8 connection(s)
[       OK ] Parameters/TestRpc.TestCallWithPasswordProtectedKey/SSL_UnixSocket (41 ms)
[ RUN      ] Parameters/TestRpc.TestCallToBadServer/SSL_UnixSocket
I20260925 15:08:40.968309 10514 rpc-test.cc:394] Status: Network error: Client connection negotiation failed: client connection to 0.0.0.0:0: connect: Connection refused (error 111)
I20260925 15:08:40.969100 10514 rpc-test.cc:394] Status: Network error: Client connection negotiation failed: client connection to 0.0.0.0:0: connect: Connection refused (error 111)
I20260925 15:08:40.969739 10514 rpc-test.cc:394] Status: Network error: Client connection negotiation failed: client connection to 0.0.0.0:0: connect: Connection refused (error 111)
I20260925 15:08:40.970396 10514 rpc-test.cc:394] Status: Network error: Client connection negotiation failed: client connection to 0.0.0.0:0: connect: Connection refused (error 111)
I20260925 15:08:40.971082 10514 rpc-test.cc:394] Status: Network error: Client connection negotiation failed: client connection to 0.0.0.0:0: connect: Connection refused (error 111)
[       OK ] Parameters/TestRpc.TestCallToBadServer/SSL_UnixSocket (32 ms)
[ RUN      ] Parameters/TestRpc.TestWrongService/SSL_UnixSocket
I20260925 15:08:40.992038 10610 acceptor_pool.cc:254] collecting diagnostics on the listening RPC socket unix:/tmp/dist-test-taskJQohsx/test-tmp/rpc-test-4bdf08f2ac7f473f9bb4d380f0238f8d.sock every 8 connection(s)
I20260925 15:08:40.992298 10611 acceptor_pool.cc:254] collecting diagnostics on the listening RPC socket unix:/tmp/dist-test-taskJQohsx/test-tmp/rpc-test-4bdf08f2ac7f473f9bb4d380f0238f8d.sock every 8 connection(s)
I20260925 15:08:41.015352 10607 messenger.cc:345] service WrongServiceName not registered on TestServer
[       OK ] Parameters/TestRpc.TestWrongService/SSL_UnixSocket (46 ms)
[ RUN      ] Parameters/TestRpc.TestConnectionKeepalive/SSL_UnixSocket
I20260925 15:08:41.031131 10633 acceptor_pool.cc:254] collecting diagnostics on the listening RPC socket unix:/tmp/dist-test-taskJQohsx/test-tmp/rpc-test-0c3dcc1cf90e4d53b12cb8bd75fc0589.sock every 8 connection(s)
I20260925 15:08:41.031344 10634 acceptor_pool.cc:254] collecting diagnostics on the listening RPC socket unix:/tmp/dist-test-taskJQohsx/test-tmp/rpc-test-0c3dcc1cf90e4d53b12cb8bd75fc0589.sock every 8 connection(s)
I20260925 15:08:41.032173 10514 rpc-test.cc:488] Connecting to unix:/tmp/dist-test-taskJQohsx/test-tmp/rpc-test-0c3dcc1cf90e4d53b12cb8bd75fc0589.sock
W20260925 15:08:41.522121 10646 connection.cc:196] Error closing socket: Network error: TlsSocket::Close: Broken pipe
[       OK ] Parameters/TestRpc.TestConnectionKeepalive/SSL_UnixSocket (1046 ms)
[ RUN      ] Parameters/TestRpc.TestClientConnectionMetrics/SSL_UnixSocket
I20260925 15:08:42.083250 10658 acceptor_pool.cc:254] collecting diagnostics on the listening RPC socket unix:/tmp/dist-test-taskJQohsx/test-tmp/rpc-test-39e3711583b54ac0b47875f9637e7355.sock every 8 connection(s)
I20260925 15:08:42.083453 10659 acceptor_pool.cc:254] collecting diagnostics on the listening RPC socket unix:/tmp/dist-test-taskJQohsx/test-tmp/rpc-test-39e3711583b54ac0b47875f9637e7355.sock every 8 connection(s)
I20260925 15:08:42.084321 10514 rpc-test.cc:569] Connecting to unix:/tmp/dist-test-taskJQohsx/test-tmp/rpc-test-39e3711583b54ac0b47875f9637e7355.sock
W20260925 15:09:02.522663 10655 connection.cc:196] Error closing socket: Network error: TlsSocket::Close: Broken pipe
[       OK ] Parameters/TestRpc.TestClientConnectionMetrics/SSL_UnixSocket (20462 ms)
[ RUN      ] Parameters/TestRpc.TestCredentialsPolicy/SSL_UnixSocket
I20260925 15:09:02.557906 10681 acceptor_pool.cc:254] collecting diagnostics on the listening RPC socket unix:/tmp/dist-test-taskJQohsx/test-tmp/rpc-test-da3a4434f9f046bca31f8c3aa294ca14.sock every 8 connection(s)
I20260925 15:09:02.558131 10682 acceptor_pool.cc:254] collecting diagnostics on the listening RPC socket unix:/tmp/dist-test-taskJQohsx/test-tmp/rpc-test-da3a4434f9f046bca31f8c3aa294ca14.sock every 8 connection(s)
I20260925 15:09:02.559013 10514 rpc-test.cc:700] Connecting to unix:/tmp/dist-test-taskJQohsx/test-tmp/rpc-test-da3a4434f9f046bca31f8c3aa294ca14.sock
W20260925 15:09:02.596678 10680 connection.cc:196] Error closing socket: Network error: TlsSocket::Close: Broken pipe
W20260925 15:09:02.604003 10680 connection.cc:196] Error closing socket: Network error: TlsSocket::Close: Broken pipe
[       OK ] Parameters/TestRpc.TestCredentialsPolicy/SSL_UnixSocket (77 ms)
[ RUN      ] Parameters/TestRpc.TestCallLongerThanKeepalive/SSL_UnixSocket
I20260925 15:09:02.625118 10706 acceptor_pool.cc:254] collecting diagnostics on the listening RPC socket unix:/tmp/dist-test-taskJQohsx/test-tmp/rpc-test-d0eae93928034391b8ba6120ee8f2b6a.sock every 8 connection(s)
I20260925 15:09:02.625303 10707 acceptor_pool.cc:254] collecting diagnostics on the listening RPC socket unix:/tmp/dist-test-taskJQohsx/test-tmp/rpc-test-d0eae93928034391b8ba6120ee8f2b6a.sock every 8 connection(s)
I20260925 15:09:02.658131 10710 rpc-test-base.h:222] got call: sleep_micros: 3000000 deferred: true
I20260925 15:09:05.659955 10710 rpcz_store.cc:275] Call kudu.rpc.GenericCalculatorService.Sleep from unix:<unnamed> (request call id 0) took 3001 ms. Trace:
I20260925 15:09:05.660126 10710 rpcz_store.cc:276] 0925 15:09:02.658018 (+     0us) service_pool.cc:170] Inserting onto call queue
0925 15:09:02.658082 (+    64us) service_pool.cc:227] Handling call
0925 15:09:05.659904 (+3001822us) inbound_call.cc:173] Queueing success response
Metrics: {}
W20260925 15:09:05.663058 10703 connection.cc:196] Error closing socket: Network error: TlsSocket::Close: Broken pipe
[       OK ] Parameters/TestRpc.TestCallLongerThanKeepalive/SSL_UnixSocket (3059 ms)
[ RUN      ] Parameters/TestRpc.TestRpcSidecar/SSL_UnixSocket
I20260925 15:09:05.689646 10731 acceptor_pool.cc:254] collecting diagnostics on the listening RPC socket unix:/tmp/dist-test-taskJQohsx/test-tmp/rpc-test-090bfba9693f4bea841a3bd99b7f8d81.sock every 8 connection(s)
I20260925 15:09:05.689777 10732 acceptor_pool.cc:254] collecting diagnostics on the listening RPC socket unix:/tmp/dist-test-taskJQohsx/test-tmp/rpc-test-090bfba9693f4bea841a3bd99b7f8d81.sock every 8 connection(s)
W20260925 15:09:05.784149 10728 connection.cc:196] Error closing socket: Network error: TlsSocket::Close: Broken pipe
[       OK ] Parameters/TestRpc.TestRpcSidecar/SSL_UnixSocket (121 ms)
[ RUN      ] Parameters/TestRpc.TestRpcSidecarLimits/SSL_UnixSocket
I20260925 15:09:07.800104 10756 acceptor_pool.cc:254] collecting diagnostics on the listening RPC socket unix:/tmp/dist-test-taskJQohsx/test-tmp/rpc-test-bf61c3ce1d4040a7b01411c2e0de42d8.sock every 8 connection(s)
I20260925 15:09:07.800345 10757 acceptor_pool.cc:254] collecting diagnostics on the listening RPC socket unix:/tmp/dist-test-taskJQohsx/test-tmp/rpc-test-bf61c3ce1d4040a7b01411c2e0de42d8.sock every 8 connection(s)
W20260925 15:09:07.812363 10514 serialization.cc:72] Serialized kudu.rpc_test.PushStringsRequestPB (2147483654 bytes) is larger than the maximum configured RPC message size (52428800 bytes). Sending anyway, but peer may reject the data.
W20260925 15:09:07.818147 10753 connection.cc:535] server connection from unix:<unnamed> recv error: Network error: RPC frame had a length of 2147483714, but we only support messages up to 52428800 bytes long.
W20260925 15:09:07.818312 10753 connection.cc:158] shutting down server connection from unix:<unnamed> with pending inbound data: 4/2147483714 bytes received; last active 0 ns ago: status Network error: RPC frame had a length of 2147483714, but we only support messages up to 52428800 bytes long.
W20260925 15:09:07.818759 10769 connection.cc:196] Error closing socket: Network error: TlsSocket::Close: Broken pipe
I20260925 15:09:07.835088 10781 acceptor_pool.cc:254] collecting diagnostics on the listening RPC socket unix:/tmp/dist-test-taskJQohsx/test-tmp/rpc-test-bf61c3ce1d4040a7b01411c2e0de42d8.sock every 8 connection(s)
I20260925 15:09:07.835417 10782 acceptor_pool.cc:254] collecting diagnostics on the listening RPC socket unix:/tmp/dist-test-taskJQohsx/test-tmp/rpc-test-bf61c3ce1d4040a7b01411c2e0de42d8.sock every 8 connection(s)
W20260925 15:09:13.512782 10778 connection.cc:577] server connection from unix:<unnamed>: received bad data: 'Corruption: Invalid packet: message had a length of 2147483710, but we only support messages up to 2147483647 bytes
'
W20260925 15:09:13.513422 10794 connection.cc:196] Error closing socket: Network error: TlsSocket::Close: Broken pipe
[       OK ] Parameters/TestRpc.TestRpcSidecarLimits/SSL_UnixSocket (8136 ms)
[ RUN      ] Parameters/TestRpc.TestCallTimeoutDoesntAffectNegotiation/SSL_UnixSocket
I20260925 15:09:13.953209 10806 acceptor_pool.cc:254] collecting diagnostics on the listening RPC socket unix:/tmp/dist-test-taskJQohsx/test-tmp/rpc-test-c49f81cca00242fdb6782c1527b22a1f.sock every 8 connection(s)
I20260925 15:09:13.953433 10807 acceptor_pool.cc:254] collecting diagnostics on the listening RPC socket unix:/tmp/dist-test-taskJQohsx/test-tmp/rpc-test-c49f81cca00242fdb6782c1527b22a1f.sock every 8 connection(s)
W20260925 15:09:13.966090 10802 negotiation.cc:266] Injecting 500ms delay in negotiation
I20260925 15:09:14.016654 10514 rpc-test-base.h:595] status: Timed out: connection negotiation to unix:/tmp/dist-test-taskJQohsx/test-tmp/rpc-test-c49f81cca00242fdb6782c1527b22a1f.sock for RPC Sleep timed out after 0.050s (ON_OUTBOUND_QUEUE), seconds elapsed: 0.0511484
[       OK ] Parameters/TestRpc.TestCallTimeoutDoesntAffectNegotiation/SSL_UnixSocket (551 ms)
[ RUN      ] Parameters/TestRpc.TestRpcHandlerLatencyMetric/SSL_UnixSocket
I20260925 15:09:14.486766 10831 acceptor_pool.cc:254] collecting diagnostics on the listening RPC socket unix:/tmp/dist-test-taskJQohsx/test-tmp/rpc-test-459ee3bd0c5641c9bad6edb362bb5eab.sock every 8 connection(s)
I20260925 15:09:14.486999 10832 acceptor_pool.cc:254] collecting diagnostics on the listening RPC socket unix:/tmp/dist-test-taskJQohsx/test-tmp/rpc-test-459ee3bd0c5641c9bad6edb362bb5eab.sock every 8 connection(s)
I20260925 15:09:14.527185 10514 rpc-test.cc:1236] Sleep() min lat: 20663
I20260925 15:09:14.527292 10514 rpc-test.cc:1237] Sleep() mean lat: 20663
I20260925 15:09:14.527335 10514 rpc-test.cc:1238] Sleep() max lat: 20663
I20260925 15:09:14.527359 10514 rpc-test.cc:1239] Sleep() #calls: 1
W20260925 15:09:14.528331 10828 connection.cc:196] Error closing socket: Network error: TlsSocket::Close: Broken pipe
[       OK ] Parameters/TestRpc.TestRpcHandlerLatencyMetric/SSL_UnixSocket (56 ms)
[ RUN      ] Parameters/TestRpc.TimedOutOnResponseMetricServiceQueue/SSL_UnixSocket
I20260925 15:09:14.557590 10857 acceptor_pool.cc:254] collecting diagnostics on the listening RPC socket unix:/tmp/dist-test-taskJQohsx/test-tmp/rpc-test-481d619b3d28424d8e1a0c973097eb9a.sock every 8 connection(s)
I20260925 15:09:14.557879 10858 acceptor_pool.cc:254] collecting diagnostics on the listening RPC socket unix:/tmp/dist-test-taskJQohsx/test-tmp/rpc-test-481d619b3d28424d8e1a0c973097eb9a.sock every 8 connection(s)
W20260925 15:09:14.615087 10859 rpcz_store.cc:267] Call kudu.rpc_test.CalculatorService.Sleep from unix:<unnamed> (request call id 2) took 20 ms (client timeout 20 ms). Trace:
W20260925 15:09:14.615226 10859 rpcz_store.cc:269] 0925 15:09:14.594666 (+     0us) service_pool.cc:170] Inserting onto call queue
0925 15:09:14.615001 (+ 20335us) service_pool.cc:214] Skipping call since client already timed out
0925 15:09:14.615053 (+    52us) inbound_call.cc:173] Queueing failure response
Metrics: {}
W20260925 15:09:14.616521 10854 connection.cc:196] Error closing socket: Network error: TlsSocket::Close: Broken pipe
[       OK ] Parameters/TestRpc.TimedOutOnResponseMetricServiceQueue/SSL_UnixSocket (87 ms)
[ RUN      ] Parameters/TestRpc.RpcPendingConnectionsMetric/SSL_UnixSocket
I20260925 15:09:14.624011 10880 acceptor_pool.cc:254] collecting diagnostics on the listening RPC socket 0.0.0.0:36763 every 8 connection(s)
I20260925 15:09:14.624214 10881 acceptor_pool.cc:254] collecting diagnostics on the listening RPC socket 0.0.0.0:36763 every 8 connection(s)
W20260925 15:09:14.626112 10876 negotiation.cc:337] Failed RPC negotiation. Trace:
0925 15:09:14.625535 (+     0us) reactor.cc:625] Submitting negotiation task for server connection from 127.0.0.1:58098 (local address 127.0.0.1:36763)
0925 15:09:14.625677 (+   142us) server_negotiation.cc:206] Beginning negotiation
0925 15:09:14.625681 (+     4us) server_negotiation.cc:399] Waiting for connection header
0925 15:09:14.625820 (+   139us) negotiation.cc:327] Negotiation complete: Network error: Server connection negotiation failed: server connection from 127.0.0.1:58098: BlockingRecv error: recv got EOF from 127.0.0.1:58098 (error 108)
Metrics: {"server-negotiator.queue_time_us":46}
[       OK ] Parameters/TestRpc.RpcPendingConnectionsMetric/SSL_UnixSocket (18 ms)
[ RUN      ] Parameters/TestRpc.TestRpcContextClientDeadline/SSL_UnixSocket
I20260925 15:09:14.650466 10896 acceptor_pool.cc:254] collecting diagnostics on the listening RPC socket unix:/tmp/dist-test-taskJQohsx/test-tmp/rpc-test-0e08a06ac5c54f5eb4363f62193b5475.sock every 8 connection(s)
I20260925 15:09:14.650702 10897 acceptor_pool.cc:254] collecting diagnostics on the listening RPC socket unix:/tmp/dist-test-taskJQohsx/test-tmp/rpc-test-0e08a06ac5c54f5eb4363f62193b5475.sock every 8 connection(s)
[       OK ] Parameters/TestRpc.TestRpcContextClientDeadline/SSL_UnixSocket (60 ms)
[ RUN      ] Parameters/TestRpc.TestApplicationFeatureFlagUnsupportedServer/SSL_UnixSocket
I20260925 15:09:14.719254 10921 acceptor_pool.cc:254] collecting diagnostics on the listening RPC socket unix:/tmp/dist-test-taskJQohsx/test-tmp/rpc-test-f591e9f2dc364bedbf903250b430b023.sock every 8 connection(s)
I20260925 15:09:14.719460 10922 acceptor_pool.cc:254] collecting diagnostics on the listening RPC socket unix:/tmp/dist-test-taskJQohsx/test-tmp/rpc-test-f591e9f2dc364bedbf903250b430b023.sock every 8 connection(s)
W20260925 15:09:14.759842 10918 connection.cc:196] Error closing socket: Network error: TlsSocket::Close: Broken pipe
[       OK ] Parameters/TestRpc.TestApplicationFeatureFlagUnsupportedServer/SSL_UnixSocket (64 ms)
[ RUN      ] Parameters/TestRpc.TestCancellationAsync/SSL_UnixSocket
I20260925 15:09:14.785115 10946 acceptor_pool.cc:254] collecting diagnostics on the listening RPC socket unix:/tmp/dist-test-taskJQohsx/test-tmp/rpc-test-ca6584abc9844447a6e833cd551098eb.sock every 8 connection(s)
I20260925 15:09:14.785312 10947 acceptor_pool.cc:254] collecting diagnostics on the listening RPC socket unix:/tmp/dist-test-taskJQohsx/test-tmp/rpc-test-ca6584abc9844447a6e833cd551098eb.sock every 8 connection(s)
I20260925 15:09:14.786286 10514 rpc-test.cc:1716] Connecting to unix:/tmp/dist-test-taskJQohsx/test-tmp/rpc-test-ca6584abc9844447a6e833cd551098eb.sock
I20260925 15:09:14.810109 10514 test_util.cc:268] Using random seed: 427407083
I20260925 15:09:14.845046 10950 rpc-test-base.h:240] got call: sleep_micros: 500 pattern: 4294967295 num_repetitions: 2097152 sidecar_idx: 0
I20260925 15:09:14.865718 10949 rpc-test-base.h:240] got call: sleep_micros: 500 pattern: 4294967295 num_repetitions: 2097152 sidecar_idx: 0
I20260925 15:09:14.895298 10950 rpc-test-base.h:240] got call: sleep_micros: 500 pattern: 4294967295 num_repetitions: 2097152 sidecar_idx: 0
I20260925 15:09:14.922262 10949 rpc-test-base.h:240] got call: sleep_micros: 500 pattern: 4294967295 num_repetitions: 2097152 sidecar_idx: 0
I20260925 15:09:14.951413 10950 rpc-test-base.h:240] got call: sleep_micros: 500 pattern: 4294967295 num_repetitions: 2097152 sidecar_idx: 0
I20260925 15:09:14.979018 10949 rpc-test-base.h:240] got call: sleep_micros: 500 pattern: 4294967295 num_repetitions: 2097152 sidecar_idx: 0
I20260925 15:09:15.005860 10950 rpc-test-base.h:240] got call: sleep_micros: 500 pattern: 4294967295 num_repetitions: 2097152 sidecar_idx: 0
W20260925 15:09:15.008536 10943 connection.cc:196] Error closing socket: Network error: TlsSocket::Close: Broken pipe
W20260925 15:09:15.022547 10943 connection.cc:441] server connection from unix:<unnamed> torn down before Call kudu.rpc.GenericCalculatorService.SleepWithSidecar from unix:<unnamed> (request call id 8) could send its response
W20260925 15:09:15.039103 10943 connection.cc:441] server connection from unix:<unnamed> torn down before Call kudu.rpc.GenericCalculatorService.SleepWithSidecar from unix:<unnamed> (request call id 9) could send its response
[       OK ] Parameters/TestRpc.TestCancellationAsync/SSL_UnixSocket (278 ms)
[ RUN      ] Parameters/TestRpc.TestPerformanceBySocketType/SSL_UnixSocket
I20260925 15:09:15.062532 10971 acceptor_pool.cc:254] collecting diagnostics on the listening RPC socket unix:/tmp/dist-test-taskJQohsx/test-tmp/rpc-test-ba31a8230dad48928870ebbc30d81102.sock every 8 connection(s)
I20260925 15:09:15.062706 10972 acceptor_pool.cc:254] collecting diagnostics on the listening RPC socket unix:/tmp/dist-test-taskJQohsx/test-tmp/rpc-test-ba31a8230dad48928870ebbc30d81102.sock every 8 connection(s)
I20260925 15:09:15.063576 10514 rpc-test.cc:1846] Connecting to unix:/tmp/dist-test-taskJQohsx/test-tmp/rpc-test-ba31a8230dad48928870ebbc30d81102.sock
I20260925 15:09:18.022810 10514 rpc-test.cc:1859] Sending 1024MB via ssl-enabled unix socket: real 2.952s	user 3.042s	sys 1.971s
I20260925 15:09:21.048417 10514 rpc-test.cc:1859] Sending 1024MB via ssl-enabled unix socket: real 3.025s	user 2.995s	sys 2.137s
I20260925 15:09:24.046943 10514 rpc-test.cc:1859] Sending 1024MB via ssl-enabled unix socket: real 2.998s	user 3.003s	sys 2.088s
I20260925 15:09:27.090843 10514 rpc-test.cc:1859] Sending 1024MB via ssl-enabled unix socket: real 3.044s	user 2.979s	sys 2.180s
I20260925 15:09:30.122960 10514 rpc-test.cc:1859] Sending 1024MB via ssl-enabled unix socket: real 3.032s	user 3.072s	sys 2.065s
W20260925 15:09:30.125168 10968 connection.cc:196] Error closing socket: Network error: TlsSocket::Close: Broken pipe
[       OK ] Parameters/TestRpc.TestPerformanceBySocketType/SSL_UnixSocket (15088 ms)
[----------] 20 tests from Parameters/TestRpc (49339 ms total)

[----------] 1 test from Parameters/TestRpcSocketTxRxQueue
[ RUN      ] Parameters/TestRpcSocketTxRxQueue.AcceptorRxQueueSizeMetric/0
I20260925 15:09:30.134685 10996 acceptor_pool.cc:254] collecting diagnostics on the listening RPC socket 0.0.0.0:34389 every 1 connection(s)
I20260925 15:09:30.134907 10997 acceptor_pool.cc:254] collecting diagnostics on the listening RPC socket 0.0.0.0:34389 every 1 connection(s)
W20260925 15:09:30.136425 10992 negotiation.cc:337] Failed RPC negotiation. Trace:
0925 15:09:30.136040 (+     0us) reactor.cc:625] Submitting negotiation task for server connection from 127.0.0.1:40422 (local address 127.0.0.1:34389)
0925 15:09:30.136179 (+   139us) server_negotiation.cc:206] Beginning negotiation
0925 15:09:30.136183 (+     4us) server_negotiation.cc:399] Waiting for connection header
0925 15:09:30.136309 (+   126us) negotiation.cc:327] Negotiation complete: Network error: Server connection negotiation failed: server connection from 127.0.0.1:40422: BlockingRecv error: recv got EOF from 127.0.0.1:40422 (error 108)
Metrics: {"server-negotiator.queue_time_us":42}
[       OK ] Parameters/TestRpcSocketTxRxQueue.AcceptorRxQueueSizeMetric/0 (9 ms)
[----------] 1 test from Parameters/TestRpcSocketTxRxQueue (9 ms total)

[----------] Global test environment tear-down
[==========] 21 tests from 2 test suites ran. (49349 ms total)
[  PASSED  ] 20 tests.
[  FAILED  ] 1 test, listed below:
[  FAILED  ] Parameters/TestRpc.TestCallWithChainCertAndChainCA/SSL_UnixSocket, where GetParam() = (true, true)

 1 FAILED TEST