Diagnosed failure

Parameters/TestRpc.TestCallWithChainCertAndChainCA/SSL_TCP: /data0/somelongdirectorytoavoidrpathissues/src/kudu/src/kudu/rpc/rpc-test.cc:270: Failure
Failed
Bad status: Runtime error: could not verify certificate chain (error with cert: subject=CN = localhost, ST = sadfjas, C = AS, emailAddress = sdflkdsajf, O = lskdfjlsad, OU = sldfkja, issuer=C = AS, ST = ASDfkjdhf, L = lskdjf, O = saldfja, OU = skdjf, CN = localhost, emailAddress = sadjflkadsj): : certificate has expired
Google Test trace:
/data0/somelongdirectorytoavoidrpathissues/src/kudu/src/kudu/rpc/rpc-test.cc:267: Connecting to 0.0.0.0:44775
I20260925 16:45:50.431084  8966 test_util.cc:175] -----------------------------------------------
I20260925 16:45:50.431236  8966 test_util.cc:176] Had fatal failures, leaving test files at /tmp/dist-test-taskHYcgie/test-tmp/rpc-test.5.Parameters_TestRpc.TestCallWithChainCertAndChainCA_SSL_TCP.1790354749097778-8966-0

Full log

Note: This is test shard 6 of 8.
[==========] Running 21 tests from 2 test suites.
[----------] Global test environment set-up.
[----------] 20 tests from Parameters/TestRpc
[ RUN      ] Parameters/TestRpc.TestMessengerCreateDestroy/SSL_TCP
WARNING: Logging before InitGoogleLogging() is written to STDERR
I20260925 16:45:49.201406  8966 rpc-test.cc:169] started messenger TestCreateDestroy
[       OK ] Parameters/TestRpc.TestMessengerCreateDestroy/SSL_TCP (1152 ms)
[ RUN      ] Parameters/TestRpc.TestNegotiationDeadlock/SSL_TCP
I20260925 16:45:50.331490  8988 acceptor_pool.cc:254] collecting diagnostics on the listening RPC socket 0.0.0.0:39953 every 8 connection(s)
I20260925 16:45:50.333015  8989 acceptor_pool.cc:254] collecting diagnostics on the listening RPC socket 0.0.0.0:39953 every 8 connection(s)
[       OK ] Parameters/TestRpc.TestNegotiationDeadlock/SSL_TCP (79 ms)
[ RUN      ] Parameters/TestRpc.TestCallWithChainCertAndChainCA/SSL_TCP
I20260925 16:45:50.403049  9004 acceptor_pool.cc:254] collecting diagnostics on the listening RPC socket 0.0.0.0:44775 every 8 connection(s)
I20260925 16:45:50.405239  9005 acceptor_pool.cc:254] collecting diagnostics on the listening RPC socket 0.0.0.0:44775 every 8 connection(s)
/data0/somelongdirectorytoavoidrpathissues/src/kudu/src/kudu/rpc/rpc-test.cc:270: Failure
Failed
Bad status: Runtime error: could not verify certificate chain (error with cert: subject=CN = localhost, ST = sadfjas, C = AS, emailAddress = sdflkdsajf, O = lskdfjlsad, OU = sldfkja, issuer=C = AS, ST = ASDfkjdhf, L = lskdjf, O = saldfja, OU = skdjf, CN = localhost, emailAddress = sadjflkadsj): : certificate has expired
Google Test trace:
/data0/somelongdirectorytoavoidrpathissues/src/kudu/src/kudu/rpc/rpc-test.cc:267: Connecting to 0.0.0.0:44775
I20260925 16:45:50.431084  8966 test_util.cc:175] -----------------------------------------------
I20260925 16:45:50.431236  8966 test_util.cc:176] Had fatal failures, leaving test files at /tmp/dist-test-taskHYcgie/test-tmp/rpc-test.5.Parameters_TestRpc.TestCallWithChainCertAndChainCA_SSL_TCP.1790354749097778-8966-0
[  FAILED  ] Parameters/TestRpc.TestCallWithChainCertAndChainCA/SSL_TCP, where GetParam() = (true, false) (48 ms)
[ RUN      ] Parameters/TestRpc.TestCallWithPasswordProtectedKey/SSL_TCP
I20260925 16:45:50.447461  9029 acceptor_pool.cc:254] collecting diagnostics on the listening RPC socket 0.0.0.0:42837 every 8 connection(s)
I20260925 16:45:50.448194  9030 acceptor_pool.cc:254] collecting diagnostics on the listening RPC socket 0.0.0.0:42837 every 8 connection(s)
[       OK ] Parameters/TestRpc.TestCallWithPasswordProtectedKey/SSL_TCP (63 ms)
[ RUN      ] Parameters/TestRpc.TestCallToBadServer/SSL_TCP
I20260925 16:45:50.515734  8966 rpc-test.cc:394] Status: Network error: Client connection negotiation failed: client connection to 0.0.0.0:0: connect: Connection refused (error 111)
I20260925 16:45:50.516970  8966 rpc-test.cc:394] Status: Network error: Client connection negotiation failed: client connection to 0.0.0.0:0: connect: Connection refused (error 111)
I20260925 16:45:50.518163  8966 rpc-test.cc:394] Status: Network error: Client connection negotiation failed: client connection to 0.0.0.0:0: connect: Connection refused (error 111)
I20260925 16:45:50.519362  8966 rpc-test.cc:394] Status: Network error: Client connection negotiation failed: client connection to 0.0.0.0:0: connect: Connection refused (error 111)
I20260925 16:45:50.520604  8966 rpc-test.cc:394] Status: Network error: Client connection negotiation failed: client connection to 0.0.0.0:0: connect: Connection refused (error 111)
[       OK ] Parameters/TestRpc.TestCallToBadServer/SSL_TCP (28 ms)
[ RUN      ] Parameters/TestRpc.TestWrongService/SSL_TCP
I20260925 16:45:50.549856  9064 acceptor_pool.cc:254] collecting diagnostics on the listening RPC socket 0.0.0.0:35537 every 8 connection(s)
I20260925 16:45:50.550666  9065 acceptor_pool.cc:254] collecting diagnostics on the listening RPC socket 0.0.0.0:35537 every 8 connection(s)
I20260925 16:45:50.576864  9062 messenger.cc:345] service WrongServiceName not registered on TestServer
[       OK ] Parameters/TestRpc.TestWrongService/SSL_TCP (61 ms)
[ RUN      ] Parameters/TestRpc.TestConnectionKeepalive/SSL_TCP
I20260925 16:45:50.604827  9087 acceptor_pool.cc:254] collecting diagnostics on the listening RPC socket 0.0.0.0:46027 every 8 connection(s)
I20260925 16:45:50.605578  9088 acceptor_pool.cc:254] collecting diagnostics on the listening RPC socket 0.0.0.0:46027 every 8 connection(s)
I20260925 16:45:50.608636  8966 rpc-test.cc:488] Connecting to 0.0.0.0:46027
[       OK ] Parameters/TestRpc.TestConnectionKeepalive/SSL_TCP (1058 ms)
[ RUN      ] Parameters/TestRpc.TestClientConnectionMetrics/SSL_TCP
I20260925 16:45:51.675498  9112 acceptor_pool.cc:254] collecting diagnostics on the listening RPC socket 0.0.0.0:36103 every 8 connection(s)
I20260925 16:45:51.676213  9113 acceptor_pool.cc:254] collecting diagnostics on the listening RPC socket 0.0.0.0:36103 every 8 connection(s)
I20260925 16:45:51.679299  8966 rpc-test.cc:569] Connecting to 0.0.0.0:36103
[       OK ] Parameters/TestRpc.TestClientConnectionMetrics/SSL_TCP (113060 ms)
[ RUN      ] Parameters/TestRpc.TestCredentialsPolicy/SSL_TCP
I20260925 16:47:44.736235  9146 acceptor_pool.cc:254] collecting diagnostics on the listening RPC socket 0.0.0.0:42833 every 8 connection(s)
I20260925 16:47:44.737062  9147 acceptor_pool.cc:254] collecting diagnostics on the listening RPC socket 0.0.0.0:42833 every 8 connection(s)
I20260925 16:47:44.740304  8966 rpc-test.cc:700] Connecting to 0.0.0.0:42833
[       OK ] Parameters/TestRpc.TestCredentialsPolicy/SSL_TCP (86 ms)
[ RUN      ] Parameters/TestRpc.TestCallLongerThanKeepalive/SSL_TCP
I20260925 16:47:44.805600  9171 acceptor_pool.cc:254] collecting diagnostics on the listening RPC socket 0.0.0.0:38741 every 8 connection(s)
I20260925 16:47:44.806339  9172 acceptor_pool.cc:254] collecting diagnostics on the listening RPC socket 0.0.0.0:38741 every 8 connection(s)
I20260925 16:47:44.832967  9175 rpc-test-base.h:222] got call: sleep_micros: 3000000 deferred: true
I20260925 16:47:47.837002  9175 rpcz_store.cc:275] Call kudu.rpc.GenericCalculatorService.Sleep from 127.0.0.1:56936 (request call id 0) took 3004 ms. Trace:
I20260925 16:47:47.837332  9175 rpcz_store.cc:276] 0925 16:47:44.832686 (+     0us) service_pool.cc:170] Inserting onto call queue
0925 16:47:44.832825 (+   139us) service_pool.cc:227] Handling call
0925 16:47:47.836952 (+3004127us) inbound_call.cc:173] Queueing success response
Metrics: {}
[       OK ] Parameters/TestRpc.TestCallLongerThanKeepalive/SSL_TCP (3056 ms)
[ RUN      ] Parameters/TestRpc.TestRpcSidecar/SSL_TCP
I20260925 16:47:47.868701  9196 acceptor_pool.cc:254] collecting diagnostics on the listening RPC socket 0.0.0.0:42065 every 8 connection(s)
I20260925 16:47:47.869472  9197 acceptor_pool.cc:254] collecting diagnostics on the listening RPC socket 0.0.0.0:42065 every 8 connection(s)
[       OK ] Parameters/TestRpc.TestRpcSidecar/SSL_TCP (512 ms)
[ RUN      ] Parameters/TestRpc.TestRpcSidecarLimits/SSL_TCP
I20260925 16:48:04.884267  9223 acceptor_pool.cc:254] collecting diagnostics on the listening RPC socket 0.0.0.0:40221 every 8 connection(s)
I20260925 16:48:04.885113  9224 acceptor_pool.cc:254] collecting diagnostics on the listening RPC socket 0.0.0.0:40221 every 8 connection(s)
W20260925 16:48:04.910570  8966 serialization.cc:72] Serialized kudu.rpc_test.PushStringsRequestPB (2147483654 bytes) is larger than the maximum configured RPC message size (52428800 bytes). Sending anyway, but peer may reject the data.
W20260925 16:48:04.920557  9221 connection.cc:535] server connection from 127.0.0.1:48634 recv error: Network error: RPC frame had a length of 2147483714, but we only support messages up to 52428800 bytes long.
W20260925 16:48:04.920941  9221 connection.cc:158] shutting down server connection from 127.0.0.1:48634 with pending inbound data: 4/2147483714 bytes received; last active 0 ns ago: status Network error: RPC frame had a length of 2147483714, but we only support messages up to 52428800 bytes long.
W20260925 16:48:04.921854  9236 connection.cc:698] client connection to 0.0.0.0:40221 send error: Network error: failed to write to TLS socket: Connection reset by peer
W20260925 16:48:04.922510  9236 connection.cc:196] Error closing socket: Network error: TlsSocket::Close: Success
[       OK ] Parameters/TestRpc.TestRpcSidecarLimits/SSL_TCP (17269 ms)
[ RUN      ] Parameters/TestRpc.TestCallTimeoutDoesntAffectNegotiation/SSL_TCP
I20260925 16:48:05.649470  9248 acceptor_pool.cc:254] collecting diagnostics on the listening RPC socket 0.0.0.0:35237 every 8 connection(s)
I20260925 16:48:05.650164  9249 acceptor_pool.cc:254] collecting diagnostics on the listening RPC socket 0.0.0.0:35237 every 8 connection(s)
W20260925 16:48:05.670074  9244 negotiation.cc:266] Injecting 500ms delay in negotiation
I20260925 16:48:05.720690  8966 rpc-test-base.h:595] status: Timed out: connection negotiation to 0.0.0.0:35237 for RPC Sleep timed out after 0.050s (ON_OUTBOUND_QUEUE), seconds elapsed: 0.0516471
[       OK ] Parameters/TestRpc.TestCallTimeoutDoesntAffectNegotiation/SSL_TCP (557 ms)
[ RUN      ] Parameters/TestRpc.TestRpcHandlerLatencyMetric/SSL_TCP
I20260925 16:48:06.214396  9273 acceptor_pool.cc:254] collecting diagnostics on the listening RPC socket 0.0.0.0:33179 every 8 connection(s)
I20260925 16:48:06.215130  9274 acceptor_pool.cc:254] collecting diagnostics on the listening RPC socket 0.0.0.0:33179 every 8 connection(s)
I20260925 16:48:06.268362  8966 rpc-test.cc:1236] Sleep() min lat: 21434
I20260925 16:48:06.268527  8966 rpc-test.cc:1237] Sleep() mean lat: 21434
I20260925 16:48:06.268649  8966 rpc-test.cc:1238] Sleep() max lat: 21434
I20260925 16:48:06.268821  8966 rpc-test.cc:1239] Sleep() #calls: 1
[       OK ] Parameters/TestRpc.TestRpcHandlerLatencyMetric/SSL_TCP (90 ms)
[ RUN      ] Parameters/TestRpc.TimedOutOnResponseMetricServiceQueue/SSL_TCP
I20260925 16:48:06.300390  9299 acceptor_pool.cc:254] collecting diagnostics on the listening RPC socket 0.0.0.0:46697 every 8 connection(s)
I20260925 16:48:06.301175  9300 acceptor_pool.cc:254] collecting diagnostics on the listening RPC socket 0.0.0.0:46697 every 8 connection(s)
W20260925 16:48:06.370631  9301 rpcz_store.cc:267] Call kudu.rpc_test.CalculatorService.Sleep from 127.0.0.1:42254 (request call id 2) took 20 ms (client timeout 20 ms). Trace:
W20260925 16:48:06.370942  9301 rpcz_store.cc:269] 0925 16:48:06.350224 (+     0us) service_pool.cc:170] Inserting onto call queue
0925 16:48:06.370481 (+ 20257us) service_pool.cc:214] Skipping call since client already timed out
0925 16:48:06.370581 (+   100us) inbound_call.cc:173] Queueing failure response
Metrics: {}
[       OK ] Parameters/TestRpc.TimedOutOnResponseMetricServiceQueue/SSL_TCP (99 ms)
[ RUN      ] Parameters/TestRpc.RpcPendingConnectionsMetric/SSL_TCP
I20260925 16:48:06.386792  9322 acceptor_pool.cc:254] collecting diagnostics on the listening RPC socket 0.0.0.0:44983 every 8 connection(s)
I20260925 16:48:06.387511  9323 acceptor_pool.cc:254] collecting diagnostics on the listening RPC socket 0.0.0.0:44983 every 8 connection(s)
W20260925 16:48:06.392156  9318 negotiation.cc:337] Failed RPC negotiation. Trace:
0925 16:48:06.391081 (+     0us) reactor.cc:625] Submitting negotiation task for server connection from 127.0.0.1:33966 (local address 127.0.0.1:44983)
0925 16:48:06.391430 (+   349us) server_negotiation.cc:206] Beginning negotiation
0925 16:48:06.391447 (+    17us) server_negotiation.cc:399] Waiting for connection header
0925 16:48:06.391656 (+   209us) negotiation.cc:327] Negotiation complete: Network error: Server connection negotiation failed: server connection from 127.0.0.1:33966: BlockingRecv error: recv got EOF from 127.0.0.1:33966 (error 108)
Metrics: {"server-negotiator.queue_time_us":80}
[       OK ] Parameters/TestRpc.RpcPendingConnectionsMetric/SSL_TCP (28 ms)
[ RUN      ] Parameters/TestRpc.TestRpcContextClientDeadline/SSL_TCP
I20260925 16:48:06.422044  9338 acceptor_pool.cc:254] collecting diagnostics on the listening RPC socket 0.0.0.0:37147 every 8 connection(s)
I20260925 16:48:06.422746  9339 acceptor_pool.cc:254] collecting diagnostics on the listening RPC socket 0.0.0.0:37147 every 8 connection(s)
[       OK ] Parameters/TestRpc.TestRpcContextClientDeadline/SSL_TCP (92 ms)
[ RUN      ] Parameters/TestRpc.TestApplicationFeatureFlagUnsupportedServer/SSL_TCP
I20260925 16:48:06.549804  9363 acceptor_pool.cc:254] collecting diagnostics on the listening RPC socket 0.0.0.0:38329 every 8 connection(s)
I20260925 16:48:06.550518  9364 acceptor_pool.cc:254] collecting diagnostics on the listening RPC socket 0.0.0.0:38329 every 8 connection(s)
[       OK ] Parameters/TestRpc.TestApplicationFeatureFlagUnsupportedServer/SSL_TCP (98 ms)
[ RUN      ] Parameters/TestRpc.TestCancellationAsync/SSL_TCP
I20260925 16:48:06.624610  9388 acceptor_pool.cc:254] collecting diagnostics on the listening RPC socket 0.0.0.0:38739 every 8 connection(s)
I20260925 16:48:06.625327  9389 acceptor_pool.cc:254] collecting diagnostics on the listening RPC socket 0.0.0.0:38739 every 8 connection(s)
I20260925 16:48:06.628295  8966 rpc-test.cc:1716] Connecting to 0.0.0.0:38739
I20260925 16:48:06.648878  8966 test_util.cc:268] Using random seed: 2064278558
I20260925 16:48:06.876093  9392 rpc-test-base.h:240] got call: sleep_micros: 500 pattern: 4294967295 num_repetitions: 2097152 sidecar_idx: 0
I20260925 16:48:07.046665  9391 rpc-test-base.h:240] got call: sleep_micros: 500 pattern: 4294967295 num_repetitions: 2097152 sidecar_idx: 0
W20260925 16:48:07.157022  9401 outbound_call.cc:322] RPC callback for RPC call kudu.rpc.GenericCalculatorService.SleepWithSidecar -> {remote=0.0.0.0:38739 (localhost), user_credentials={real_user=slave}} blocked reactor thread for 50415.1us
I20260925 16:48:07.233086  9392 rpc-test-base.h:240] got call: sleep_micros: 500 pattern: 4294967295 num_repetitions: 2097152 sidecar_idx: 0
I20260925 16:48:07.409021  9391 rpc-test-base.h:240] got call: sleep_micros: 500 pattern: 4294967295 num_repetitions: 2097152 sidecar_idx: 0
I20260925 16:48:07.592708  9392 rpc-test-base.h:240] got call: sleep_micros: 500 pattern: 4294967295 num_repetitions: 2097152 sidecar_idx: 0
I20260925 16:48:07.772807  9391 rpc-test-base.h:240] got call: sleep_micros: 500 pattern: 4294967295 num_repetitions: 2097152 sidecar_idx: 0
I20260925 16:48:07.951756  9392 rpc-test-base.h:240] got call: sleep_micros: 500 pattern: 4294967295 num_repetitions: 2097152 sidecar_idx: 0
I20260925 16:48:08.135078  9392 rpc-test-base.h:240] got call: sleep_micros: 500 pattern: 4294967295 num_repetitions: 2097152 sidecar_idx: 0
W20260925 16:48:08.289223  9386 connection.cc:196] Error closing socket: Network error: TlsSocket::Close: Broken pipe
W20260925 16:48:08.289657  9386 connection.cc:441] server connection from 127.0.0.1:46968 torn down before Call kudu.rpc.GenericCalculatorService.SleepWithSidecar from 127.0.0.1:46968 (request call id 8) could send its response
[       OK ] Parameters/TestRpc.TestCancellationAsync/SSL_TCP (1701 ms)
[ RUN      ] Parameters/TestRpc.TestPerformanceBySocketType/SSL_TCP
I20260925 16:48:08.411458  9413 acceptor_pool.cc:254] collecting diagnostics on the listening RPC socket 0.0.0.0:43237 every 8 connection(s)
I20260925 16:48:08.412045  9414 acceptor_pool.cc:254] collecting diagnostics on the listening RPC socket 0.0.0.0:43237 every 8 connection(s)
I20260925 16:48:08.415912  8966 rpc-test.cc:1846] Connecting to 0.0.0.0:43237
I20260925 16:48:26.933979  8966 rpc-test.cc:1859] Sending 1024MB via ssl-enabled tcp socket: real 18.496s	user 15.826s	sys 10.438s
I20260925 16:48:45.379426  8966 rpc-test.cc:1859] Sending 1024MB via ssl-enabled tcp socket: real 18.445s	user 15.829s	sys 10.350s
I20260925 16:49:03.698594  8966 rpc-test.cc:1859] Sending 1024MB via ssl-enabled tcp socket: real 18.319s	user 15.704s	sys 10.207s
I20260925 16:49:22.070585  8966 rpc-test.cc:1859] Sending 1024MB via ssl-enabled tcp socket: real 18.372s	user 15.482s	sys 10.647s
I20260925 16:49:40.377960  8966 rpc-test.cc:1859] Sending 1024MB via ssl-enabled tcp socket: real 18.307s	user 15.765s	sys 10.170s
[       OK ] Parameters/TestRpc.TestPerformanceBySocketType/SSL_TCP (92097 ms)
[----------] 20 tests from Parameters/TestRpc (231246 ms total)

[----------] 1 test from Parameters/TestRpcSocketTxRxQueue
[ RUN      ] Parameters/TestRpcSocketTxRxQueue.OverCapacity/0
W20260925 16:49:40.855877  9440 negotiation.cc:337] Failed RPC negotiation. Trace:
0925 16:49:40.411430 (+     0us) reactor.cc:625] Submitting negotiation task for client connection to 0.0.0.0:38697 (local address 127.0.0.1:52540)
0925 16:49:40.412095 (+   665us) negotiation.cc:107] Waiting for socket to connect
0925 16:49:40.412145 (+    50us) client_negotiation.cc:174] Beginning negotiation
0925 16:49:40.412715 (+   570us) client_negotiation.cc:252] Sending NEGOTIATE NegotiatePB request
0925 16:49:40.854287 (+441572us) negotiation.cc:327] Negotiation complete: Network error: Client connection negotiation failed: client connection to 0.0.0.0:38697: BlockingRecv error: recv error from unknown peer: Transport endpoint is not connected (error 107)
Metrics: {"client-negotiator.queue_time_us":117}
W20260925 16:49:40.858053  9458 negotiation.cc:337] Failed RPC negotiation. Trace:
0925 16:49:40.425025 (+     0us) reactor.cc:625] Submitting negotiation task for client connection to 0.0.0.0:38697 (local address 127.0.0.1:52558)
0925 16:49:40.425528 (+   503us) negotiation.cc:107] Waiting for socket to connect
0925 16:49:40.425556 (+    28us) client_negotiation.cc:174] Beginning negotiation
0925 16:49:40.425732 (+   176us) client_negotiation.cc:252] Sending NEGOTIATE NegotiatePB request
0925 16:49:40.854315 (+428583us) negotiation.cc:327] Negotiation complete: Network error: Client connection negotiation failed: client connection to 0.0.0.0:38697: BlockingRecv error: recv error from unknown peer: Transport endpoint is not connected (error 107)
Metrics: {"client-negotiator.queue_time_us":124}
W20260925 16:49:40.858150  9467 negotiation.cc:337] Failed RPC negotiation. Trace:
0925 16:49:40.436995 (+     0us) reactor.cc:625] Submitting negotiation task for client connection to 0.0.0.0:38697 (local address 127.0.0.1:52560)
0925 16:49:40.437483 (+   488us) negotiation.cc:107] Waiting for socket to connect
0925 16:49:40.437514 (+    31us) client_negotiation.cc:174] Beginning negotiation
0925 16:49:40.437674 (+   160us) client_negotiation.cc:252] Sending NEGOTIATE NegotiatePB request
0925 16:49:40.854757 (+417083us) negotiation.cc:327] Negotiation complete: Network error: Client connection negotiation failed: client connection to 0.0.0.0:38697: BlockingRecv error: recv error from unknown peer: Transport endpoint is not connected (error 107)
Metrics: {"client-negotiator.queue_time_us":116}
W20260925 16:49:40.858319  9449 negotiation.cc:337] Failed RPC negotiation. Trace:
0925 16:49:40.418017 (+     0us) reactor.cc:625] Submitting negotiation task for client connection to 0.0.0.0:38697 (local address 127.0.0.1:52548)
0925 16:49:40.418586 (+   569us) negotiation.cc:107] Waiting for socket to connect
0925 16:49:40.418616 (+    30us) client_negotiation.cc:174] Beginning negotiation
0925 16:49:40.418791 (+   175us) client_negotiation.cc:252] Sending NEGOTIATE NegotiatePB request
0925 16:49:40.854315 (+435524us) negotiation.cc:327] Negotiation complete: Network error: Client connection negotiation failed: client connection to 0.0.0.0:38697: BlockingRecv error: recv error from unknown peer: Transport endpoint is not connected (error 107)
Metrics: {"client-negotiator.queue_time_us":157}
W20260925 16:49:40.859097  9476 negotiation.cc:337] Failed RPC negotiation. Trace:
0925 16:49:40.455319 (+     0us) reactor.cc:625] Submitting negotiation task for client connection to 0.0.0.0:38697 (local address 127.0.0.1:52564)
0925 16:49:40.455983 (+   664us) negotiation.cc:107] Waiting for socket to connect
0925 16:49:40.456035 (+    52us) client_negotiation.cc:174] Beginning negotiation
0925 16:49:40.456291 (+   256us) client_negotiation.cc:252] Sending NEGOTIATE NegotiatePB request
0925 16:49:40.856302 (+400011us) negotiation.cc:327] Negotiation complete: Network error: Client connection negotiation failed: client connection to 0.0.0.0:38697: BlockingRecv error: recv error from unknown peer: Transport endpoint is not connected (error 107)
Metrics: {"client-negotiator.queue_time_us":153}
W20260925 16:49:40.859483  9485 negotiation.cc:337] Failed RPC negotiation. Trace:
0925 16:49:40.468154 (+     0us) reactor.cc:625] Submitting negotiation task for client connection to 0.0.0.0:38697 (local address 127.0.0.1:52570)
0925 16:49:40.468904 (+   750us) negotiation.cc:107] Waiting for socket to connect
0925 16:49:40.468953 (+    49us) client_negotiation.cc:174] Beginning negotiation
0925 16:49:40.469207 (+   254us) client_negotiation.cc:252] Sending NEGOTIATE NegotiatePB request
0925 16:49:40.855378 (+386171us) negotiation.cc:327] Negotiation complete: Network error: Client connection negotiation failed: client connection to 0.0.0.0:38697: BlockingRecv error: recv error from unknown peer: Transport endpoint is not connected (error 107)
Metrics: {"client-negotiator.queue_time_us":166}
[       OK ] Parameters/TestRpcSocketTxRxQueue.OverCapacity/0 (1265 ms)
[----------] 1 test from Parameters/TestRpcSocketTxRxQueue (1265 ms total)

[----------] Global test environment tear-down
[==========] 21 tests from 2 test suites ran. (232513 ms total)
[  PASSED  ] 20 tests.
[  FAILED  ] 1 test, listed below:
[  FAILED  ] Parameters/TestRpc.TestCallWithChainCertAndChainCA/SSL_TCP, where GetParam() = (true, false)

 1 FAILED TEST