Diagnosed failure
Parameters/TestRpc.TestCallWithChainCertAndChainCA/SSL_TCP: /data0/somelongdirectorytoavoidrpathissues/src/kudu/src/kudu/rpc/rpc-test.cc:270: Failure
Failed
Bad status: Runtime error: could not verify certificate chain (error with cert: subject=CN = localhost, ST = sadfjas, C = AS, emailAddress = sdflkdsajf, O = lskdfjlsad, OU = sldfkja, issuer=C = AS, ST = ASDfkjdhf, L = lskdjf, O = saldfja, OU = skdjf, CN = localhost, emailAddress = sadjflkadsj): : certificate has expired
Google Test trace:
/data0/somelongdirectorytoavoidrpathissues/src/kudu/src/kudu/rpc/rpc-test.cc:267: Connecting to 0.0.0.0:45645
I20260929 02:46:36.918846 5398 test_util.cc:175] -----------------------------------------------
I20260929 02:46:36.918987 5398 test_util.cc:176] Had fatal failures, leaving test files at /tmp/dist-test-taskDZw6fq/test-tmp/rpc-test.5.Parameters_TestRpc.TestCallWithChainCertAndChainCA_SSL_TCP.1790649996737463-5398-0
Full log
Note: This is test shard 6 of 8.
[==========] Running 21 tests from 2 test suites.
[----------] Global test environment set-up.
[----------] 20 tests from Parameters/TestRpc
[ RUN ] Parameters/TestRpc.TestMessengerCreateDestroy/SSL_TCP
WARNING: Logging before InitGoogleLogging() is written to STDERR
I20260929 02:46:36.780733 5398 rpc-test.cc:169] started messenger TestCreateDestroy
[ OK ] Parameters/TestRpc.TestMessengerCreateDestroy/SSL_TCP (26 ms)
[ RUN ] Parameters/TestRpc.TestNegotiationDeadlock/SSL_TCP
I20260929 02:46:36.805517 5418 acceptor_pool.cc:254] collecting diagnostics on the listening RPC socket 0.0.0.0:34547 every 8 connection(s)
I20260929 02:46:36.805824 5419 acceptor_pool.cc:254] collecting diagnostics on the listening RPC socket 0.0.0.0:34547 every 8 connection(s)
[ OK ] Parameters/TestRpc.TestNegotiationDeadlock/SSL_TCP (42 ms)
[ RUN ] Parameters/TestRpc.TestCallWithChainCertAndChainCA/SSL_TCP
I20260929 02:46:36.906561 5434 acceptor_pool.cc:254] collecting diagnostics on the listening RPC socket 0.0.0.0:45645 every 8 connection(s)
I20260929 02:46:36.906852 5435 acceptor_pool.cc:254] collecting diagnostics on the listening RPC socket 0.0.0.0:45645 every 8 connection(s)
/data0/somelongdirectorytoavoidrpathissues/src/kudu/src/kudu/rpc/rpc-test.cc:270: Failure
Failed
Bad status: Runtime error: could not verify certificate chain (error with cert: subject=CN = localhost, ST = sadfjas, C = AS, emailAddress = sdflkdsajf, O = lskdfjlsad, OU = sldfkja, issuer=C = AS, ST = ASDfkjdhf, L = lskdjf, O = saldfja, OU = skdjf, CN = localhost, emailAddress = sadjflkadsj): : certificate has expired
Google Test trace:
/data0/somelongdirectorytoavoidrpathissues/src/kudu/src/kudu/rpc/rpc-test.cc:267: Connecting to 0.0.0.0:45645
I20260929 02:46:36.918846 5398 test_util.cc:175] -----------------------------------------------
I20260929 02:46:36.918987 5398 test_util.cc:176] Had fatal failures, leaving test files at /tmp/dist-test-taskDZw6fq/test-tmp/rpc-test.5.Parameters_TestRpc.TestCallWithChainCertAndChainCA_SSL_TCP.1790649996737463-5398-0
[ FAILED ] Parameters/TestRpc.TestCallWithChainCertAndChainCA/SSL_TCP, where GetParam() = (true, false) (92 ms)
[ RUN ] Parameters/TestRpc.TestCallWithPasswordProtectedKey/SSL_TCP
I20260929 02:46:36.929752 5459 acceptor_pool.cc:254] collecting diagnostics on the listening RPC socket 0.0.0.0:39627 every 8 connection(s)
I20260929 02:46:36.929998 5460 acceptor_pool.cc:254] collecting diagnostics on the listening RPC socket 0.0.0.0:39627 every 8 connection(s)
[ OK ] Parameters/TestRpc.TestCallWithPasswordProtectedKey/SSL_TCP (47 ms)
[ RUN ] Parameters/TestRpc.TestCallToBadServer/SSL_TCP
I20260929 02:46:36.986594 5398 rpc-test.cc:394] Status: Network error: Client connection negotiation failed: client connection to 0.0.0.0:0: connect: Connection refused (error 111)
I20260929 02:46:36.987259 5398 rpc-test.cc:394] Status: Network error: Client connection negotiation failed: client connection to 0.0.0.0:0: connect: Connection refused (error 111)
I20260929 02:46:36.987867 5398 rpc-test.cc:394] Status: Network error: Client connection negotiation failed: client connection to 0.0.0.0:0: connect: Connection refused (error 111)
I20260929 02:46:36.988443 5398 rpc-test.cc:394] Status: Network error: Client connection negotiation failed: client connection to 0.0.0.0:0: connect: Connection refused (error 111)
I20260929 02:46:36.988986 5398 rpc-test.cc:394] Status: Network error: Client connection negotiation failed: client connection to 0.0.0.0:0: connect: Connection refused (error 111)
[ OK ] Parameters/TestRpc.TestCallToBadServer/SSL_TCP (24 ms)
[ RUN ] Parameters/TestRpc.TestWrongService/SSL_TCP
I20260929 02:46:37.026041 5494 acceptor_pool.cc:254] collecting diagnostics on the listening RPC socket 0.0.0.0:46557 every 8 connection(s)
I20260929 02:46:37.026319 5495 acceptor_pool.cc:254] collecting diagnostics on the listening RPC socket 0.0.0.0:46557 every 8 connection(s)
I20260929 02:46:37.047850 5491 messenger.cc:345] service WrongServiceName not registered on TestServer
[ OK ] Parameters/TestRpc.TestWrongService/SSL_TCP (62 ms)
[ RUN ] Parameters/TestRpc.TestConnectionKeepalive/SSL_TCP
I20260929 02:46:37.063797 5517 acceptor_pool.cc:254] collecting diagnostics on the listening RPC socket 0.0.0.0:33005 every 8 connection(s)
I20260929 02:46:37.064097 5518 acceptor_pool.cc:254] collecting diagnostics on the listening RPC socket 0.0.0.0:33005 every 8 connection(s)
I20260929 02:46:37.064999 5398 rpc-test.cc:488] Connecting to 0.0.0.0:33005
[ OK ] Parameters/TestRpc.TestConnectionKeepalive/SSL_TCP (1043 ms)
[ RUN ] Parameters/TestRpc.TestClientConnectionMetrics/SSL_TCP
I20260929 02:46:38.110554 5542 acceptor_pool.cc:254] collecting diagnostics on the listening RPC socket 0.0.0.0:41723 every 8 connection(s)
I20260929 02:46:38.110862 5543 acceptor_pool.cc:254] collecting diagnostics on the listening RPC socket 0.0.0.0:41723 every 8 connection(s)
I20260929 02:46:38.111809 5398 rpc-test.cc:569] Connecting to 0.0.0.0:41723
[ OK ] Parameters/TestRpc.TestClientConnectionMetrics/SSL_TCP (19981 ms)
[ RUN ] Parameters/TestRpc.TestCredentialsPolicy/SSL_TCP
I20260929 02:46:58.091355 5565 acceptor_pool.cc:254] collecting diagnostics on the listening RPC socket 0.0.0.0:42471 every 8 connection(s)
I20260929 02:46:58.091580 5566 acceptor_pool.cc:254] collecting diagnostics on the listening RPC socket 0.0.0.0:42471 every 8 connection(s)
I20260929 02:46:58.092607 5398 rpc-test.cc:700] Connecting to 0.0.0.0:42471
[ OK ] Parameters/TestRpc.TestCredentialsPolicy/SSL_TCP (65 ms)
[ RUN ] Parameters/TestRpc.TestCallLongerThanKeepalive/SSL_TCP
I20260929 02:46:58.167934 5590 acceptor_pool.cc:254] collecting diagnostics on the listening RPC socket 0.0.0.0:33271 every 8 connection(s)
I20260929 02:46:58.168182 5591 acceptor_pool.cc:254] collecting diagnostics on the listening RPC socket 0.0.0.0:33271 every 8 connection(s)
I20260929 02:46:58.198017 5594 rpc-test-base.h:222] got call: sleep_micros: 3000000 deferred: true
I20260929 02:47:01.199862 5594 rpcz_store.cc:275] Call kudu.rpc.GenericCalculatorService.Sleep from 127.0.0.1:42464 (request call id 0) took 3001 ms. Trace:
I20260929 02:47:01.200035 5594 rpcz_store.cc:276] 0929 02:46:58.197908 (+ 0us) service_pool.cc:170] Inserting onto call queue
0929 02:46:58.197971 (+ 63us) service_pool.cc:227] Handling call
0929 02:47:01.199813 (+3001842us) inbound_call.cc:173] Queueing success response
Metrics: {}
[ OK ] Parameters/TestRpc.TestCallLongerThanKeepalive/SSL_TCP (3063 ms)
[ RUN ] Parameters/TestRpc.TestRpcSidecar/SSL_TCP
I20260929 02:47:01.227350 5615 acceptor_pool.cc:254] collecting diagnostics on the listening RPC socket 0.0.0.0:35353 every 8 connection(s)
I20260929 02:47:01.227571 5616 acceptor_pool.cc:254] collecting diagnostics on the listening RPC socket 0.0.0.0:35353 every 8 connection(s)
[ OK ] Parameters/TestRpc.TestRpcSidecar/SSL_TCP (125 ms)
[ RUN ] Parameters/TestRpc.TestRpcSidecarLimits/SSL_TCP
I20260929 02:47:03.349794 5640 acceptor_pool.cc:254] collecting diagnostics on the listening RPC socket 0.0.0.0:41697 every 8 connection(s)
I20260929 02:47:03.350056 5641 acceptor_pool.cc:254] collecting diagnostics on the listening RPC socket 0.0.0.0:41697 every 8 connection(s)
W20260929 02:47:03.361716 5398 serialization.cc:72] Serialized kudu.rpc_test.PushStringsRequestPB (2147483654 bytes) is larger than the maximum configured RPC message size (52428800 bytes). Sending anyway, but peer may reject the data.
W20260929 02:47:03.367966 5637 connection.cc:535] server connection from 127.0.0.1:35544 recv error: Network error: RPC frame had a length of 2147483714, but we only support messages up to 52428800 bytes long.
W20260929 02:47:03.368098 5637 connection.cc:158] shutting down server connection from 127.0.0.1:35544 with pending inbound data: 4/2147483714 bytes received; last active 0 ns ago: status Network error: RPC frame had a length of 2147483714, but we only support messages up to 52428800 bytes long.
W20260929 02:47:03.368598 5653 connection.cc:196] Error closing socket: Network error: TlsSocket::Close: Connection reset by peer
I20260929 02:47:03.387811 5665 acceptor_pool.cc:254] collecting diagnostics on the listening RPC socket 0.0.0.0:36715 every 8 connection(s)
I20260929 02:47:03.388020 5666 acceptor_pool.cc:254] collecting diagnostics on the listening RPC socket 0.0.0.0:36715 every 8 connection(s)
W20260929 02:47:08.641225 5664 connection.cc:577] server connection from 127.0.0.1:58270: received bad data: 'Corruption: Invalid packet: message had a length of 2147483710, but we only support messages up to 2147483647 bytes
'
[ OK ] Parameters/TestRpc.TestRpcSidecarLimits/SSL_TCP (7769 ms)
[ RUN ] Parameters/TestRpc.TestCallTimeoutDoesntAffectNegotiation/SSL_TCP
I20260929 02:47:09.141872 5690 acceptor_pool.cc:254] collecting diagnostics on the listening RPC socket 0.0.0.0:35773 every 8 connection(s)
I20260929 02:47:09.142167 5691 acceptor_pool.cc:254] collecting diagnostics on the listening RPC socket 0.0.0.0:35773 every 8 connection(s)
W20260929 02:47:09.155292 5686 negotiation.cc:266] Injecting 500ms delay in negotiation
I20260929 02:47:09.205870 5398 rpc-test-base.h:595] status: Timed out: connection negotiation to 0.0.0.0:35773 for RPC Sleep timed out after 0.050s (ON_OUTBOUND_QUEUE), seconds elapsed: 0.051281
[ OK ] Parameters/TestRpc.TestCallTimeoutDoesntAffectNegotiation/SSL_TCP (564 ms)
[ RUN ] Parameters/TestRpc.TestRpcHandlerLatencyMetric/SSL_TCP
I20260929 02:47:09.689513 5715 acceptor_pool.cc:254] collecting diagnostics on the listening RPC socket 0.0.0.0:44275 every 8 connection(s)
I20260929 02:47:09.689831 5716 acceptor_pool.cc:254] collecting diagnostics on the listening RPC socket 0.0.0.0:44275 every 8 connection(s)
I20260929 02:47:09.749595 5398 rpc-test.cc:1236] Sleep() min lat: 20616
I20260929 02:47:09.749691 5398 rpc-test.cc:1237] Sleep() mean lat: 20616
I20260929 02:47:09.749730 5398 rpc-test.cc:1238] Sleep() max lat: 20616
I20260929 02:47:09.749750 5398 rpc-test.cc:1239] Sleep() #calls: 1
[ OK ] Parameters/TestRpc.TestRpcHandlerLatencyMetric/SSL_TCP (88 ms)
[ RUN ] Parameters/TestRpc.TimedOutOnResponseMetricServiceQueue/SSL_TCP
I20260929 02:47:09.770404 5741 acceptor_pool.cc:254] collecting diagnostics on the listening RPC socket 0.0.0.0:33047 every 8 connection(s)
I20260929 02:47:09.770640 5742 acceptor_pool.cc:254] collecting diagnostics on the listening RPC socket 0.0.0.0:33047 every 8 connection(s)
W20260929 02:47:09.826391 5743 rpcz_store.cc:267] Call kudu.rpc_test.CalculatorService.Sleep from 127.0.0.1:45420 (request call id 2) took 20 ms (client timeout 20 ms). Trace:
W20260929 02:47:09.826628 5743 rpcz_store.cc:269] 0929 02:47:09.805940 (+ 0us) service_pool.cc:170] Inserting onto call queue
0929 02:47:09.826333 (+ 20393us) service_pool.cc:214] Skipping call since client already timed out
0929 02:47:09.826374 (+ 41us) inbound_call.cc:173] Queueing failure response
Metrics: {}
[ OK ] Parameters/TestRpc.TimedOutOnResponseMetricServiceQueue/SSL_TCP (75 ms)
[ RUN ] Parameters/TestRpc.RpcPendingConnectionsMetric/SSL_TCP
I20260929 02:47:09.836711 5764 acceptor_pool.cc:254] collecting diagnostics on the listening RPC socket 0.0.0.0:35305 every 8 connection(s)
I20260929 02:47:09.837018 5765 acceptor_pool.cc:254] collecting diagnostics on the listening RPC socket 0.0.0.0:35305 every 8 connection(s)
W20260929 02:47:09.839386 5760 negotiation.cc:337] Failed RPC negotiation. Trace:
0929 02:47:09.838656 (+ 0us) reactor.cc:625] Submitting negotiation task for server connection from 127.0.0.1:60090 (local address 127.0.0.1:35305)
0929 02:47:09.838879 (+ 223us) server_negotiation.cc:206] Beginning negotiation
0929 02:47:09.838885 (+ 6us) server_negotiation.cc:399] Waiting for connection header
0929 02:47:09.839036 (+ 151us) negotiation.cc:327] Negotiation complete: Network error: Server connection negotiation failed: server connection from 127.0.0.1:60090: BlockingRecv error: recv got EOF from 127.0.0.1:60090 (error 108)
Metrics: {"server-negotiator.queue_time_us":57}
[ OK ] Parameters/TestRpc.RpcPendingConnectionsMetric/SSL_TCP (20 ms)
[ RUN ] Parameters/TestRpc.TestRpcContextClientDeadline/SSL_TCP
I20260929 02:47:09.863068 5780 acceptor_pool.cc:254] collecting diagnostics on the listening RPC socket 0.0.0.0:39519 every 8 connection(s)
I20260929 02:47:09.863288 5781 acceptor_pool.cc:254] collecting diagnostics on the listening RPC socket 0.0.0.0:39519 every 8 connection(s)
[ OK ] Parameters/TestRpc.TestRpcContextClientDeadline/SSL_TCP (102 ms)
[ RUN ] Parameters/TestRpc.TestApplicationFeatureFlagUnsupportedServer/SSL_TCP
I20260929 02:47:09.965974 5805 acceptor_pool.cc:254] collecting diagnostics on the listening RPC socket 0.0.0.0:42285 every 8 connection(s)
I20260929 02:47:09.966202 5806 acceptor_pool.cc:254] collecting diagnostics on the listening RPC socket 0.0.0.0:42285 every 8 connection(s)
[ OK ] Parameters/TestRpc.TestApplicationFeatureFlagUnsupportedServer/SSL_TCP (48 ms)
[ RUN ] Parameters/TestRpc.TestCancellationAsync/SSL_TCP
I20260929 02:47:10.022696 5830 acceptor_pool.cc:254] collecting diagnostics on the listening RPC socket 0.0.0.0:46185 every 8 connection(s)
I20260929 02:47:10.022938 5831 acceptor_pool.cc:254] collecting diagnostics on the listening RPC socket 0.0.0.0:46185 every 8 connection(s)
I20260929 02:47:10.023981 5398 rpc-test.cc:1716] Connecting to 0.0.0.0:46185
I20260929 02:47:10.063011 5398 test_util.cc:268] Using random seed: 854949250
I20260929 02:47:10.098024 5834 rpc-test-base.h:240] got call: sleep_micros: 500 pattern: 4294967295 num_repetitions: 2097152 sidecar_idx: 0
I20260929 02:47:10.118214 5833 rpc-test-base.h:240] got call: sleep_micros: 500 pattern: 4294967295 num_repetitions: 2097152 sidecar_idx: 0
I20260929 02:47:10.144301 5832 rpc-test-base.h:240] got call: sleep_micros: 500 pattern: 4294967295 num_repetitions: 2097152 sidecar_idx: 0
I20260929 02:47:10.182657 5833 rpc-test-base.h:240] got call: sleep_micros: 500 pattern: 4294967295 num_repetitions: 2097152 sidecar_idx: 0
I20260929 02:47:10.215600 5832 rpc-test-base.h:240] got call: sleep_micros: 500 pattern: 4294967295 num_repetitions: 2097152 sidecar_idx: 0
I20260929 02:47:10.244287 5833 rpc-test-base.h:240] got call: sleep_micros: 500 pattern: 4294967295 num_repetitions: 2097152 sidecar_idx: 0
W20260929 02:47:10.270859 5828 connection.cc:698] server connection from 127.0.0.1:34650 send error: Network error: failed to write to TLS socket: Broken pipe
W20260929 02:47:10.271031 5828 connection.cc:441] server connection from 127.0.0.1:34650 torn down before Call kudu.rpc.GenericCalculatorService.SleepWithSidecar from 127.0.0.1:34650 (request call id 9) could send its response
W20260929 02:47:10.271342 5828 connection.cc:196] Error closing socket: Network error: TlsSocket::Close: Success
W20260929 02:47:10.289443 5828 connection.cc:441] server connection from 127.0.0.1:34650 torn down before Call kudu.rpc.GenericCalculatorService.SleepWithSidecar from 127.0.0.1:34650 (request call id 8) could send its response
[ OK ] Parameters/TestRpc.TestCancellationAsync/SSL_TCP (289 ms)
[ RUN ] Parameters/TestRpc.TestPerformanceBySocketType/SSL_TCP
I20260929 02:47:10.308293 5855 acceptor_pool.cc:254] collecting diagnostics on the listening RPC socket 0.0.0.0:41067 every 8 connection(s)
I20260929 02:47:10.308573 5856 acceptor_pool.cc:254] collecting diagnostics on the listening RPC socket 0.0.0.0:41067 every 8 connection(s)
I20260929 02:47:10.309412 5398 rpc-test.cc:1846] Connecting to 0.0.0.0:41067
I20260929 02:47:13.368777 5398 rpc-test.cc:1859] Sending 1024MB via ssl-enabled tcp socket: real 3.028s user 2.761s sys 2.281s
I20260929 02:47:16.359943 5398 rpc-test.cc:1859] Sending 1024MB via ssl-enabled tcp socket: real 2.991s user 2.805s sys 2.178s
I20260929 02:47:19.345944 5398 rpc-test.cc:1859] Sending 1024MB via ssl-enabled tcp socket: real 2.986s user 2.727s sys 2.224s
I20260929 02:47:22.362649 5398 rpc-test.cc:1859] Sending 1024MB via ssl-enabled tcp socket: real 3.017s user 2.845s sys 2.120s
I20260929 02:47:25.446671 5398 rpc-test.cc:1859] Sending 1024MB via ssl-enabled tcp socket: real 3.084s user 2.861s sys 2.251s
[ OK ] Parameters/TestRpc.TestPerformanceBySocketType/SSL_TCP (15162 ms)
[----------] 20 tests from Parameters/TestRpc (48698 ms total)
[----------] 1 test from Parameters/TestRpcSocketTxRxQueue
[ RUN ] Parameters/TestRpcSocketTxRxQueue.OverCapacity/0
W20260929 02:47:25.757176 5872 negotiation.cc:337] Failed RPC negotiation. Trace:
0929 02:47:25.465194 (+ 0us) reactor.cc:625] Submitting negotiation task for client connection to 0.0.0.0:46793 (local address 127.0.0.1:40672)
0929 02:47:25.465366 (+ 172us) negotiation.cc:107] Waiting for socket to connect
0929 02:47:25.465385 (+ 19us) client_negotiation.cc:174] Beginning negotiation
0929 02:47:25.465502 (+ 117us) client_negotiation.cc:252] Sending NEGOTIATE NegotiatePB request
0929 02:47:25.756751 (+291249us) negotiation.cc:327] Negotiation complete: Network error: Client connection negotiation failed: client connection to 0.0.0.0:46793: BlockingRecv error: recv error from unknown peer: Transport endpoint is not connected (error 107)
Metrics: {"client-negotiator.queue_time_us":60}
W20260929 02:47:25.757516 5908 negotiation.cc:337] Failed RPC negotiation. Trace:
0929 02:47:25.475836 (+ 0us) reactor.cc:625] Submitting negotiation task for client connection to 0.0.0.0:46793 (local address 127.0.0.1:40720)
0929 02:47:25.476014 (+ 178us) negotiation.cc:107] Waiting for socket to connect
0929 02:47:25.476030 (+ 16us) client_negotiation.cc:174] Beginning negotiation
0929 02:47:25.476135 (+ 105us) client_negotiation.cc:252] Sending NEGOTIATE NegotiatePB request
0929 02:47:25.757294 (+281159us) negotiation.cc:327] Negotiation complete: Network error: Client connection negotiation failed: client connection to 0.0.0.0:46793: BlockingRecv error: recv error from unknown peer: Transport endpoint is not connected (error 107)
Metrics: {"client-negotiator.queue_time_us":54}
W20260929 02:47:25.757627 5881 negotiation.cc:337] Failed RPC negotiation. Trace:
0929 02:47:25.467729 (+ 0us) reactor.cc:625] Submitting negotiation task for client connection to 0.0.0.0:46793 (local address 127.0.0.1:40682)
0929 02:47:25.467899 (+ 170us) negotiation.cc:107] Waiting for socket to connect
0929 02:47:25.467918 (+ 19us) client_negotiation.cc:174] Beginning negotiation
0929 02:47:25.468008 (+ 90us) client_negotiation.cc:252] Sending NEGOTIATE NegotiatePB request
0929 02:47:25.756701 (+288693us) negotiation.cc:327] Negotiation complete: Network error: Client connection negotiation failed: client connection to 0.0.0.0:46793: BlockingRecv error: recv error from unknown peer: Transport endpoint is not connected (error 107)
Metrics: {"client-negotiator.queue_time_us":60}
W20260929 02:47:25.757710 5917 negotiation.cc:337] Failed RPC negotiation. Trace:
0929 02:47:25.478501 (+ 0us) reactor.cc:625] Submitting negotiation task for client connection to 0.0.0.0:46793 (local address 127.0.0.1:40724)
0929 02:47:25.478735 (+ 234us) negotiation.cc:107] Waiting for socket to connect
0929 02:47:25.478753 (+ 18us) client_negotiation.cc:174] Beginning negotiation
0929 02:47:25.478900 (+ 147us) client_negotiation.cc:252] Sending NEGOTIATE NegotiatePB request
0929 02:47:25.757372 (+278472us) negotiation.cc:327] Negotiation complete: Network error: Client connection negotiation failed: client connection to 0.0.0.0:46793: BlockingRecv error: recv error from unknown peer: Transport endpoint is not connected (error 107)
Metrics: {"client-negotiator.queue_time_us":79}
W20260929 02:47:25.757172 5899 negotiation.cc:337] Failed RPC negotiation. Trace:
0929 02:47:25.473057 (+ 0us) reactor.cc:625] Submitting negotiation task for client connection to 0.0.0.0:46793 (local address 127.0.0.1:40706)
0929 02:47:25.473276 (+ 219us) negotiation.cc:107] Waiting for socket to connect
0929 02:47:25.473299 (+ 23us) client_negotiation.cc:174] Beginning negotiation
0929 02:47:25.473403 (+ 104us) client_negotiation.cc:252] Sending NEGOTIATE NegotiatePB request
0929 02:47:25.756701 (+283298us) negotiation.cc:327] Negotiation complete: Network error: Client connection negotiation failed: client connection to 0.0.0.0:46793: BlockingRecv error: recv error from unknown peer: Transport endpoint is not connected (error 107)
Metrics: {"client-negotiator.queue_time_us":58}
W20260929 02:47:25.757930 5890 negotiation.cc:337] Failed RPC negotiation. Trace:
0929 02:47:25.470394 (+ 0us) reactor.cc:625] Submitting negotiation task for client connection to 0.0.0.0:46793 (local address 127.0.0.1:40692)
0929 02:47:25.470563 (+ 169us) negotiation.cc:107] Waiting for socket to connect
0929 02:47:25.470582 (+ 19us) client_negotiation.cc:174] Beginning negotiation
0929 02:47:25.470694 (+ 112us) client_negotiation.cc:252] Sending NEGOTIATE NegotiatePB request
0929 02:47:25.756744 (+286050us) negotiation.cc:327] Negotiation complete: Network error: Client connection negotiation failed: client connection to 0.0.0.0:46793: BlockingRecv error: recv error from unknown peer: Transport endpoint is not connected (error 107)
Metrics: {"client-negotiator.queue_time_us":34}
[ OK ] Parameters/TestRpcSocketTxRxQueue.OverCapacity/0 (1060 ms)
[----------] 1 test from Parameters/TestRpcSocketTxRxQueue (1060 ms total)
[----------] Global test environment tear-down
[==========] 21 tests from 2 test suites ran. (49760 ms total)
[ PASSED ] 20 tests.
[ FAILED ] 1 test, listed below:
[ FAILED ] Parameters/TestRpc.TestCallWithChainCertAndChainCA/SSL_TCP, where GetParam() = (true, false)
1 FAILED TEST