Diagnosed failure

Parameters/TestRpc.TestCallWithChainCertAndRootCA/SSL_TCP: /data0/somelongdirectorytoavoidrpathissues/src/kudu/src/kudu/rpc/rpc-test.cc:303: Failure
Failed
Bad status: Runtime error: could not verify certificate chain (error with cert: subject=CN = localhost, ST = sadfjas, C = AS, emailAddress = sdflkdsajf, O = lskdfjlsad, OU = sldfkja, issuer=C = AS, ST = ASDfkjdhf, L = lskdjf, O = saldfja, OU = skdjf, CN = localhost, emailAddress = sadjflkadsj): : certificate has expired
Google Test trace:
/data0/somelongdirectorytoavoidrpathissues/src/kudu/src/kudu/rpc/rpc-test.cc:300: Connecting to 0.0.0.0:46585
I20260929 14:21:10.178040 29175 test_util.cc:175] -----------------------------------------------
I20260929 14:21:10.178231 29175 test_util.cc:176] Had fatal failures, leaving test files at /tmp/dist-test-tasknrCNFZ/test-tmp/rpc-test.1.Parameters_TestRpc.TestCallWithChainCertAndRootCA_SSL_TCP.1790691668656166-29175-0

Full log

Note: This is test shard 2 of 8.
[==========] Running 21 tests from 2 test suites.
[----------] Global test environment set-up.
[----------] 1 test from TestRpc
[ RUN      ] TestRpc.TestMethodsByName
[       OK ] TestRpc.TestMethodsByName (6 ms)
[----------] 1 test from TestRpc (6 ms total)

[----------] 20 tests from Parameters/TestRpc
[ RUN      ] Parameters/TestRpc.TestAcceptorPoolStartStop/SSL_TCP
WARNING: Logging before InitGoogleLogging() is written to STDERR
I20260929 14:21:08.783804 29190 acceptor_pool.cc:254] collecting diagnostics on the listening RPC socket 0.0.0.0:40385 every 8 connection(s)
I20260929 14:21:08.785439 29191 acceptor_pool.cc:254] collecting diagnostics on the listening RPC socket 0.0.0.0:40385 every 8 connection(s)
I20260929 14:21:09.951604 29202 acceptor_pool.cc:254] collecting diagnostics on the listening RPC socket 0.0.0.0:33213 every 8 connection(s)
I20260929 14:21:09.953136 29203 acceptor_pool.cc:254] collecting diagnostics on the listening RPC socket 0.0.0.0:33213 every 8 connection(s)
I20260929 14:21:09.976351 29213 acceptor_pool.cc:254] collecting diagnostics on the listening RPC socket 0.0.0.0:40915 every 8 connection(s)
I20260929 14:21:09.977898 29214 acceptor_pool.cc:254] collecting diagnostics on the listening RPC socket 0.0.0.0:40915 every 8 connection(s)
I20260929 14:21:09.996136 29224 acceptor_pool.cc:254] collecting diagnostics on the listening RPC socket 0.0.0.0:36401 every 8 connection(s)
I20260929 14:21:09.996941 29225 acceptor_pool.cc:254] collecting diagnostics on the listening RPC socket 0.0.0.0:36401 every 8 connection(s)
I20260929 14:21:10.021692 29235 acceptor_pool.cc:254] collecting diagnostics on the listening RPC socket 0.0.0.0:38471 every 8 connection(s)
I20260929 14:21:10.022390 29236 acceptor_pool.cc:254] collecting diagnostics on the listening RPC socket 0.0.0.0:38471 every 8 connection(s)
[       OK ] Parameters/TestRpc.TestAcceptorPoolStartStop/SSL_TCP (1307 ms)
[ RUN      ] Parameters/TestRpc.TestCall/SSL_TCP
I20260929 14:21:10.051658 29248 acceptor_pool.cc:254] collecting diagnostics on the listening RPC socket 0.0.0.0:35743 every 8 connection(s)
I20260929 14:21:10.053807 29249 acceptor_pool.cc:254] collecting diagnostics on the listening RPC socket 0.0.0.0:35743 every 8 connection(s)
I20260929 14:21:10.059506 29175 rpc-test.cc:234] Connecting to 0.0.0.0:35743
[       OK ] Parameters/TestRpc.TestCall/SSL_TCP (111 ms)
[ RUN      ] Parameters/TestRpc.TestCallWithChainCertAndRootCA/SSL_TCP
I20260929 14:21:10.155829 29273 acceptor_pool.cc:254] collecting diagnostics on the listening RPC socket 0.0.0.0:46585 every 8 connection(s)
I20260929 14:21:10.156725 29274 acceptor_pool.cc:254] collecting diagnostics on the listening RPC socket 0.0.0.0:46585 every 8 connection(s)
/data0/somelongdirectorytoavoidrpathissues/src/kudu/src/kudu/rpc/rpc-test.cc:303: Failure
Failed
Bad status: Runtime error: could not verify certificate chain (error with cert: subject=CN = localhost, ST = sadfjas, C = AS, emailAddress = sdflkdsajf, O = lskdfjlsad, OU = sldfkja, issuer=C = AS, ST = ASDfkjdhf, L = lskdjf, O = saldfja, OU = skdjf, CN = localhost, emailAddress = sadjflkadsj): : certificate has expired
Google Test trace:
/data0/somelongdirectorytoavoidrpathissues/src/kudu/src/kudu/rpc/rpc-test.cc:300: Connecting to 0.0.0.0:46585
I20260929 14:21:10.178040 29175 test_util.cc:175] -----------------------------------------------
I20260929 14:21:10.178231 29175 test_util.cc:176] Had fatal failures, leaving test files at /tmp/dist-test-tasknrCNFZ/test-tmp/rpc-test.1.Parameters_TestRpc.TestCallWithChainCertAndRootCA_SSL_TCP.1790691668656166-29175-0
[  FAILED  ] Parameters/TestRpc.TestCallWithChainCertAndRootCA/SSL_TCP, where GetParam() = (true, false) (39 ms)
[ RUN      ] Parameters/TestRpc.TestCallWithBadPasswordProtectedKey/SSL_TCP
[       OK ] Parameters/TestRpc.TestCallWithBadPasswordProtectedKey/SSL_TCP (32 ms)
[ RUN      ] Parameters/TestRpc.TestInvalidMethodCall/SSL_TCP
I20260929 14:21:10.234872 29310 acceptor_pool.cc:254] collecting diagnostics on the listening RPC socket 0.0.0.0:44369 every 8 connection(s)
I20260929 14:21:10.235707 29311 acceptor_pool.cc:254] collecting diagnostics on the listening RPC socket 0.0.0.0:44369 every 8 connection(s)
I20260929 14:21:10.239424 29175 rpc-test.cc:406] Connecting to 0.0.0.0:44369
[       OK ] Parameters/TestRpc.TestInvalidMethodCall/SSL_TCP (67 ms)
[ RUN      ] Parameters/TestRpc.TestHighFDs/SSL_TCP
I20260929 14:21:10.497329 29335 acceptor_pool.cc:254] collecting diagnostics on the listening RPC socket 0.0.0.0:44519 every 8 connection(s)
I20260929 14:21:10.498152 29336 acceptor_pool.cc:254] collecting diagnostics on the listening RPC socket 0.0.0.0:44519 every 8 connection(s)
[       OK ] Parameters/TestRpc.TestHighFDs/SSL_TCP (286 ms)
[ RUN      ] Parameters/TestRpc.TestConnectionAlwaysKeepalive/SSL_TCP
I20260929 14:21:10.581781 29358 acceptor_pool.cc:254] collecting diagnostics on the listening RPC socket 0.0.0.0:41097 every 8 connection(s)
I20260929 14:21:10.582592 29359 acceptor_pool.cc:254] collecting diagnostics on the listening RPC socket 0.0.0.0:41097 every 8 connection(s)
I20260929 14:21:10.585886 29175 rpc-test.cc:532] Connecting to 0.0.0.0:41097
[       OK ] Parameters/TestRpc.TestConnectionAlwaysKeepalive/SSL_TCP (3066 ms)
[ RUN      ] Parameters/TestRpc.TestReopenOutboundConnections/SSL_TCP
I20260929 14:21:13.652755 29381 acceptor_pool.cc:254] collecting diagnostics on the listening RPC socket 0.0.0.0:33615 every 8 connection(s)
I20260929 14:21:13.653447 29382 acceptor_pool.cc:254] collecting diagnostics on the listening RPC socket 0.0.0.0:33615 every 8 connection(s)
I20260929 14:21:13.656620 29175 rpc-test.cc:658] Connecting to 0.0.0.0:33615
[       OK ] Parameters/TestRpc.TestReopenOutboundConnections/SSL_TCP (395 ms)
[ RUN      ] Parameters/TestRpc.TestConnectionNetworkPlane/SSL_TCP
I20260929 14:21:14.048141 29404 acceptor_pool.cc:254] collecting diagnostics on the listening RPC socket 0.0.0.0:34585 every 8 connection(s)
I20260929 14:21:14.048986 29405 acceptor_pool.cc:254] collecting diagnostics on the listening RPC socket 0.0.0.0:34585 every 8 connection(s)
I20260929 14:21:14.052511 29175 rpc-test.cc:772] Connecting to 0.0.0.0:34585
[       OK ] Parameters/TestRpc.TestConnectionNetworkPlane/SSL_TCP (78 ms)
[ RUN      ] Parameters/TestRpc.TestTCPKeepalive/SSL_TCP
I20260929 14:21:14.124500 29429 acceptor_pool.cc:254] collecting diagnostics on the listening RPC socket 0.0.0.0:34511 every 8 connection(s)
I20260929 14:21:14.125166 29430 acceptor_pool.cc:254] collecting diagnostics on the listening RPC socket 0.0.0.0:34511 every 8 connection(s)
I20260929 14:21:14.150873 29433 rpc-test-base.h:222] got call: sleep_micros: 8000000 deferred: true
I20260929 14:21:22.154940 29433 rpcz_store.cc:275] Call kudu.rpc.GenericCalculatorService.Sleep from 127.0.0.1:48924 (request call id 0) took 8004 ms. Trace:
I20260929 14:21:22.155467 29433 rpcz_store.cc:276] 0929 14:21:14.150609 (+     0us) service_pool.cc:170] Inserting onto call queue
0929 14:21:14.150720 (+   111us) service_pool.cc:227] Handling call
0929 14:21:22.154750 (+8004030us) inbound_call.cc:173] Queueing success response
Metrics: {}
[       OK ] Parameters/TestRpc.TestTCPKeepalive/SSL_TCP (8063 ms)
[ RUN      ] Parameters/TestRpc.TestMaxSmallSidecars/SSL_TCP
I20260929 14:21:22.191670 29455 acceptor_pool.cc:254] collecting diagnostics on the listening RPC socket 0.0.0.0:46825 every 8 connection(s)
I20260929 14:21:22.192446 29456 acceptor_pool.cc:254] collecting diagnostics on the listening RPC socket 0.0.0.0:46825 every 8 connection(s)
[       OK ] Parameters/TestRpc.TestMaxSmallSidecars/SSL_TCP (214 ms)
[ RUN      ] Parameters/TestRpc.TestCallTimeout/SSL_TCP
I20260929 14:21:22.433615 29480 acceptor_pool.cc:254] collecting diagnostics on the listening RPC socket 0.0.0.0:46089 every 8 connection(s)
I20260929 14:21:22.434528 29481 acceptor_pool.cc:254] collecting diagnostics on the listening RPC socket 0.0.0.0:46089 every 8 connection(s)
I20260929 14:21:22.459657 29175 rpc-test-base.h:595] status: Timed out: connection negotiation to 0.0.0.0:46089 for RPC Sleep timed out after 0.000s (ON_OUTBOUND_QUEUE), seconds elapsed: 0.00242349
I20260929 14:21:22.468132 29484 rpc-test-base.h:222] got call: sleep_micros: 700000
I20260929 14:21:22.660987 29175 rpc-test-base.h:595] status: Timed out: Sleep RPC to 0.0.0.0:46089 timed out after 0.200s (SENT), seconds elapsed: 0.200933
I20260929 14:21:22.662488 29483 rpc-test-base.h:222] got call: sleep_micros: 2000000
W20260929 14:21:23.168900 29484 rpcz_store.cc:267] Call kudu.rpc.GenericCalculatorService.Sleep from 127.0.0.1:43672 (request call id 1) took 700 ms (client timeout 200 ms). Trace:
W20260929 14:21:23.169246 29484 rpcz_store.cc:269] 0929 14:21:22.467950 (+     0us) service_pool.cc:170] Inserting onto call queue
0929 14:21:22.468063 (+   113us) service_pool.cc:227] Handling call
0929 14:21:23.168821 (+700758us) inbound_call.cc:173] Queueing success response
Metrics: {}
I20260929 14:21:24.163759 29175 rpc-test-base.h:595] status: Timed out: Sleep RPC to 0.0.0.0:46089 timed out after 1.500s (SENT), seconds elapsed: 1.50242
W20260929 14:21:24.663029 29483 rpcz_store.cc:267] Call kudu.rpc.GenericCalculatorService.Sleep from 127.0.0.1:43672 (request call id 2) took 2000 ms (client timeout 1500 ms). Trace:
W20260929 14:21:24.663348 29483 rpcz_store.cc:269] 0929 14:21:22.662190 (+     0us) service_pool.cc:170] Inserting onto call queue
0929 14:21:22.662312 (+   122us) service_pool.cc:227] Handling call
0929 14:21:24.662972 (+2000660us) inbound_call.cc:173] Queueing success response
Metrics: {}
W20260929 14:21:24.663918 29477 connection.cc:441] server connection from 127.0.0.1:43672 torn down before Call kudu.rpc.GenericCalculatorService.Sleep from 127.0.0.1:43672 (request call id 2) could send its response
[       OK ] Parameters/TestRpc.TestCallTimeout/SSL_TCP (2285 ms)
[ RUN      ] Parameters/TestRpc.TestServerShutsDown/SSL_TCP
I20260929 14:21:24.671741 29175 rpc-test.cc:1125] Connecting to 0.0.0.0:38079
W20260929 14:21:24.682051 29497 negotiation.cc:337] Failed RPC negotiation. Trace:
0929 14:21:24.680506 (+     0us) reactor.cc:625] Submitting negotiation task for client connection to 0.0.0.0:38079 (local address 127.0.0.1:51858)
0929 14:21:24.680965 (+   459us) negotiation.cc:107] Waiting for socket to connect
0929 14:21:24.680996 (+    31us) client_negotiation.cc:174] Beginning negotiation
0929 14:21:24.681214 (+   218us) client_negotiation.cc:252] Sending NEGOTIATE NegotiatePB request
0929 14:21:24.681427 (+   213us) negotiation.cc:327] Negotiation complete: Network error: Client connection negotiation failed: client connection to 0.0.0.0:38079: BlockingWrite error: write error: Broken pipe (error 32)
Metrics: {"client-negotiator.queue_time_us":115}
[       OK ] Parameters/TestRpc.TestServerShutsDown/SSL_TCP (14 ms)
[ RUN      ] Parameters/TestRpc.TimedOutOnResponseMetric/SSL_TCP
I20260929 14:21:24.716708 29514 acceptor_pool.cc:254] collecting diagnostics on the listening RPC socket 0.0.0.0:46195 every 8 connection(s)
I20260929 14:21:24.717387 29515 acceptor_pool.cc:254] collecting diagnostics on the listening RPC socket 0.0.0.0:46195 every 8 connection(s)
W20260929 14:21:24.953380 29518 rpcz_store.cc:267] Call kudu.rpc_test.CalculatorService.Sleep from 127.0.0.1:33230 (request call id 3) took 50 ms (client timeout 25 ms). Trace:
W20260929 14:21:24.953743 29518 rpcz_store.cc:269] 0929 14:21:24.902722 (+     0us) service_pool.cc:170] Inserting onto call queue
0929 14:21:24.902831 (+   109us) service_pool.cc:227] Handling call
0929 14:21:24.953283 (+ 50452us) inbound_call.cc:173] Queueing success response
Related trace 'test_child':
Metrics: {"test_sleep_us":50000,"child_traces":[["test_child",{"related_trace_metric":1}]]}
W20260929 14:21:25.013309 29518 rpcz_store.cc:267] Call kudu.rpc_test.CalculatorService.Sleep from 127.0.0.1:33230 (request call id 4) took 50 ms (client timeout 50 ms). Trace:
W20260929 14:21:25.013685 29518 rpcz_store.cc:269] 0929 14:21:24.962731 (+     0us) service_pool.cc:170] Inserting onto call queue
0929 14:21:24.962863 (+   132us) service_pool.cc:227] Handling call
0929 14:21:25.013246 (+ 50383us) inbound_call.cc:173] Queueing success response
Related trace 'test_child':
Metrics: {"test_sleep_us":50000,"child_traces":[["test_child",{"related_trace_metric":1}]]}
[       OK ] Parameters/TestRpc.TimedOutOnResponseMetric/SSL_TCP (336 ms)
[ RUN      ] Parameters/TestRpc.AcceptorDispatchingTimesMetric/SSL_TCP
I20260929 14:21:25.034590 29539 acceptor_pool.cc:254] collecting diagnostics on the listening RPC socket 0.0.0.0:37261 every 8 connection(s)
I20260929 14:21:25.035378 29540 acceptor_pool.cc:254] collecting diagnostics on the listening RPC socket 0.0.0.0:37261 every 8 connection(s)
W20260929 14:21:25.041615 29535 negotiation.cc:337] Failed RPC negotiation. Trace:
0929 14:21:25.039272 (+     0us) reactor.cc:625] Submitting negotiation task for server connection from 127.0.0.1:59578 (local address 127.0.0.1:37261)
0929 14:21:25.039839 (+   567us) server_negotiation.cc:206] Beginning negotiation
0929 14:21:25.039861 (+    22us) server_negotiation.cc:399] Waiting for connection header
0929 14:21:25.040282 (+   421us) negotiation.cc:327] Negotiation complete: Network error: Server connection negotiation failed: server connection from 127.0.0.1:59578: BlockingRecv error: recv got EOF from 127.0.0.1:59578 (error 108)
Metrics: {"server-negotiator.queue_time_us":125}
[       OK ] Parameters/TestRpc.AcceptorDispatchingTimesMetric/SSL_TCP (22 ms)
[ RUN      ] Parameters/TestRpc.TestRpcCallbackDestroysMessenger/SSL_TCP
[       OK ] Parameters/TestRpc.TestRpcCallbackDestroysMessenger/SSL_TCP (26 ms)
[ RUN      ] Parameters/TestRpc.TestApplicationFeatureFlag/SSL_TCP
I20260929 14:21:25.105050 29564 acceptor_pool.cc:254] collecting diagnostics on the listening RPC socket 0.0.0.0:40667 every 8 connection(s)
I20260929 14:21:25.105803 29565 acceptor_pool.cc:254] collecting diagnostics on the listening RPC socket 0.0.0.0:40667 every 8 connection(s)
W20260929 14:21:25.141882 29561 messenger.cc:357] Unable to handle RPC call: Not implemented: call requires unsupported application feature flags: 99
[       OK ] Parameters/TestRpc.TestApplicationFeatureFlag/SSL_TCP (78 ms)
[ RUN      ] Parameters/TestRpc.TestCancellation/SSL_TCP
I20260929 14:21:25.166776 29589 acceptor_pool.cc:254] collecting diagnostics on the listening RPC socket 0.0.0.0:33393 every 8 connection(s)
I20260929 14:21:25.167534 29590 acceptor_pool.cc:254] collecting diagnostics on the listening RPC socket 0.0.0.0:33393 every 8 connection(s)
I20260929 14:21:25.170701 29175 rpc-test.cc:1648] Connecting to 0.0.0.0:33393
I20260929 14:21:25.277891 29175 rpc-test-base.h:595] status: Aborted: Sleep RPC to 0.0.0.0:33393 is cancelled in state READY, seconds elapsed: 0.000418854
I20260929 14:21:25.435221 29175 rpc-test-base.h:595] status: Aborted: Sleep RPC to 0.0.0.0:33393 is cancelled in state SENT, seconds elapsed: 0.00109215
I20260929 14:21:25.476022 29592 rpc-test-base.h:222] got call: sleep_micros: 510000
I20260929 14:21:25.624508 29175 rpc-test-base.h:595] status: Aborted: Sleep RPC to 0.0.0.0:33393 is cancelled in state SENT, seconds elapsed: 0.000973868
I20260929 14:21:25.669756 29591 rpc-test-base.h:222] got call: sleep_micros: 510000
I20260929 14:21:25.791613 29175 rpc-test-base.h:595] status: Aborted: Sleep RPC to 0.0.0.0:33393 is cancelled in state SENT, seconds elapsed: 0.000809294
W20260929 14:21:25.830641 29593 rpcz_store.cc:267] Call kudu.rpc.GenericCalculatorService.Sleep from 127.0.0.1:43162 (request call id 11) took 15 ms (client timeout 10 ms). Trace:
W20260929 14:21:25.830960 29593 rpcz_store.cc:269] 0929 14:21:25.815008 (+     0us) service_pool.cc:170] Inserting onto call queue
0929 14:21:25.830286 (+ 15278us) service_pool.cc:214] Skipping call since client already timed out
0929 14:21:25.830405 (+   119us) inbound_call.cc:173] Queueing failure response
Metrics: {}
I20260929 14:21:25.831542 29593 rpc-test-base.h:222] got call: sleep_micros: 1500000
W20260929 14:21:25.986647 29592 rpcz_store.cc:267] Call kudu.rpc.GenericCalculatorService.Sleep from 127.0.0.1:43162 (request call id 3) took 510 ms (client timeout 10 ms). Trace:
W20260929 14:21:25.987028 29592 rpcz_store.cc:269] 0929 14:21:25.475844 (+     0us) service_pool.cc:170] Inserting onto call queue
0929 14:21:25.475961 (+   117us) service_pool.cc:227] Handling call
0929 14:21:25.986590 (+510629us) inbound_call.cc:173] Queueing success response
Metrics: {}
W20260929 14:21:26.180428 29591 rpcz_store.cc:267] Call kudu.rpc.GenericCalculatorService.Sleep from 127.0.0.1:43162 (request call id 7) took 510 ms (client timeout 10 ms). Trace:
W20260929 14:21:26.180779 29591 rpcz_store.cc:269] 0929 14:21:25.669562 (+     0us) service_pool.cc:170] Inserting onto call queue
0929 14:21:25.669694 (+   132us) service_pool.cc:227] Handling call
0929 14:21:26.180372 (+510678us) inbound_call.cc:173] Queueing success response
Metrics: {}
I20260929 14:21:26.794147 29175 rpc-test-base.h:595] status: Timed out: Sleep RPC to 0.0.0.0:33393 timed out after 1.000s (SENT), seconds elapsed: 1.00221
I20260929 14:21:26.795816 29591 rpc-test-base.h:222] got call: sleep_micros: 1500000
W20260929 14:21:27.332069 29593 rpcz_store.cc:267] Call kudu.rpc.GenericCalculatorService.Sleep from 127.0.0.1:43162 (request call id 12) took 1516 ms (client timeout 1000 ms). Trace:
W20260929 14:21:27.332408 29593 rpcz_store.cc:269] 0929 14:21:25.815345 (+     0us) service_pool.cc:170] Inserting onto call queue
0929 14:21:25.831505 (+ 16160us) service_pool.cc:227] Handling call
0929 14:21:27.332018 (+1500513us) inbound_call.cc:173] Queueing success response
Metrics: {}
I20260929 14:21:27.796128 29175 rpc-test-base.h:595] status: Timed out: Sleep RPC to 0.0.0.0:33393 timed out after 1.000s (SENT), seconds elapsed: 1.00166
W20260929 14:21:27.797773 29587 messenger.cc:357] Unable to handle RPC call: Not implemented: call requires unsupported application feature flags: 99, 1
W20260929 14:21:27.799324 29587 messenger.cc:357] Unable to handle RPC call: Not implemented: call requires unsupported application feature flags: 99, 1
W20260929 14:21:28.296411 29591 rpcz_store.cc:267] Call kudu.rpc.GenericCalculatorService.Sleep from 127.0.0.1:43162 (request call id 13) took 1501 ms (client timeout 1000 ms). Trace:
W20260929 14:21:28.296726 29591 rpcz_store.cc:269] 0929 14:21:26.795341 (+     0us) service_pool.cc:170] Inserting onto call queue
0929 14:21:26.795758 (+   417us) service_pool.cc:227] Handling call
0929 14:21:28.296355 (+1500597us) inbound_call.cc:173] Queueing success response
Metrics: {}
W20260929 14:21:28.297259 29587 connection.cc:441] server connection from 127.0.0.1:43162 torn down before Call kudu.rpc.GenericCalculatorService.Sleep from 127.0.0.1:43162 (request call id 13) could send its response
[       OK ] Parameters/TestRpc.TestCancellation/SSL_TCP (3153 ms)
[ RUN      ] Parameters/TestRpc.TestCancellationMultiThreads/SSL_TCP
I20260929 14:21:28.331933 29614 acceptor_pool.cc:254] collecting diagnostics on the listening RPC socket 0.0.0.0:36761 every 8 connection(s)
I20260929 14:21:28.332664 29615 acceptor_pool.cc:254] collecting diagnostics on the listening RPC socket 0.0.0.0:36761 every 8 connection(s)
I20260929 14:21:28.335870 29175 rpc-test.cc:1808] Connecting to 0.0.0.0:36761
I20260929 14:21:28.482082 29628 test_util.cc:268] Using random seed: -436304646
I20260929 14:21:28.483340 29629 test_util.cc:268] Using random seed: -436303401
I20260929 14:21:28.485842 29630 test_util.cc:268] Using random seed: -436300873
I20260929 14:21:28.487345 29631 test_util.cc:268] Using random seed: -436299387
I20260929 14:21:28.488770 29632 test_util.cc:268] Using random seed: -436298047
I20260929 14:21:28.490243 29633 test_util.cc:268] Using random seed: -436296608
I20260929 14:21:28.492187 29634 test_util.cc:268] Using random seed: -436294707
I20260929 14:21:28.493786 29635 test_util.cc:268] Using random seed: -436293058
I20260929 14:21:28.495139 29636 test_util.cc:268] Using random seed: -436291668
I20260929 14:21:28.496691 29637 test_util.cc:268] Using random seed: -436290150
I20260929 14:21:28.498204 29638 test_util.cc:268] Using random seed: -436288603
I20260929 14:21:28.499542 29639 test_util.cc:268] Using random seed: -436287270
I20260929 14:21:28.500959 29640 test_util.cc:268] Using random seed: -436285878
I20260929 14:21:28.502269 29641 test_util.cc:268] Using random seed: -436284545
I20260929 14:21:28.503983 29642 test_util.cc:268] Using random seed: -436282862
I20260929 14:21:28.507033 29643 test_util.cc:268] Using random seed: -436279847
I20260929 14:21:28.508916 29644 test_util.cc:268] Using random seed: -436277990
I20260929 14:21:28.510586 29645 test_util.cc:268] Using random seed: -436276298
I20260929 14:21:28.512423 29646 test_util.cc:268] Using random seed: -436274505
I20260929 14:21:28.514667 29647 test_util.cc:268] Using random seed: -436272200
I20260929 14:21:28.517570 29648 test_util.cc:268] Using random seed: -436269384
I20260929 14:21:28.519484 29649 test_util.cc:268] Using random seed: -436267402
I20260929 14:21:28.521145 29650 test_util.cc:268] Using random seed: -436265741
I20260929 14:21:28.523391 29651 test_util.cc:268] Using random seed: -436263424
I20260929 14:21:28.524703 29652 test_util.cc:268] Using random seed: -436262118
I20260929 14:21:28.526193 29653 test_util.cc:268] Using random seed: -436260628
I20260929 14:21:28.527786 29654 test_util.cc:268] Using random seed: -436259071
I20260929 14:21:28.530602 29655 test_util.cc:268] Using random seed: -436256311
I20260929 14:21:28.533650 29656 test_util.cc:268] Using random seed: -436253234
I20260929 14:21:28.535531 29657 test_util.cc:268] Using random seed: -436251372
[       OK ] Parameters/TestRpc.TestCancellationMultiThreads/SSL_TCP (18298 ms)
[ RUN      ] Parameters/TestRpc.TestCallId/SSL_TCP
I20260929 14:21:46.630872 29671 acceptor_pool.cc:254] collecting diagnostics on the listening RPC socket 0.0.0.0:44985 every 8 connection(s)
I20260929 14:21:46.631716 29672 acceptor_pool.cc:254] collecting diagnostics on the listening RPC socket 0.0.0.0:44985 every 8 connection(s)
[       OK ] Parameters/TestRpc.TestCallId/SSL_TCP (80 ms)
[----------] 20 tests from Parameters/TestRpc (37963 ms total)

[----------] Global test environment tear-down
[==========] 21 tests from 2 test suites ran. (37971 ms total)
[  PASSED  ] 20 tests.
[  FAILED  ] 1 test, listed below:
[  FAILED  ] Parameters/TestRpc.TestCallWithChainCertAndRootCA/SSL_TCP, where GetParam() = (true, false)

 1 FAILED TEST