Diagnosed failure

Parameters/TestRpc.TestCallWithChainCertAndChainCA/SSL_TCP: /data0/somelongdirectorytoavoidrpathissues/src/kudu/src/kudu/rpc/rpc-test.cc:270: Failure
Failed
Bad status: Runtime error: could not verify certificate chain (error with cert: subject=CN = localhost, ST = sadfjas, C = AS, emailAddress = sdflkdsajf, O = lskdfjlsad, OU = sldfkja, issuer=C = AS, ST = ASDfkjdhf, L = lskdjf, O = saldfja, OU = skdjf, CN = localhost, emailAddress = sadjflkadsj): : certificate has expired
Google Test trace:
/data0/somelongdirectorytoavoidrpathissues/src/kudu/src/kudu/rpc/rpc-test.cc:267: Connecting to 0.0.0.0:43901
I20260926 17:59:35.224478   383 test_util.cc:175] -----------------------------------------------
I20260926 17:59:35.224538   383 test_util.cc:176] Had fatal failures, leaving test files at /tmp/dist-test-task654ljz/test-tmp/rpc-test.5.Parameters_TestRpc.TestCallWithChainCertAndChainCA_SSL_TCP.1790445575152850-383-0

Full log

Note: This is test shard 6 of 8.
[==========] Running 21 tests from 2 test suites.
[----------] Global test environment set-up.
[----------] 20 tests from Parameters/TestRpc
[ RUN      ] Parameters/TestRpc.TestMessengerCreateDestroy/SSL_TCP
WARNING: Logging before InitGoogleLogging() is written to STDERR
I20260926 17:59:35.171363   383 rpc-test.cc:169] started messenger TestCreateDestroy
[       OK ] Parameters/TestRpc.TestMessengerCreateDestroy/SSL_TCP (16 ms)
[ RUN      ] Parameters/TestRpc.TestNegotiationDeadlock/SSL_TCP
I20260926 17:59:35.186944   403 acceptor_pool.cc:254] collecting diagnostics on the listening RPC socket 0.0.0.0:39351 every 8 connection(s)
I20260926 17:59:35.186987   404 acceptor_pool.cc:254] collecting diagnostics on the listening RPC socket 0.0.0.0:39351 every 8 connection(s)
[       OK ] Parameters/TestRpc.TestNegotiationDeadlock/SSL_TCP (22 ms)
[ RUN      ] Parameters/TestRpc.TestCallWithChainCertAndChainCA/SSL_TCP
I20260926 17:59:35.219770   419 acceptor_pool.cc:254] collecting diagnostics on the listening RPC socket 0.0.0.0:43901 every 8 connection(s)
I20260926 17:59:35.219877   420 acceptor_pool.cc:254] collecting diagnostics on the listening RPC socket 0.0.0.0:43901 every 8 connection(s)
/data0/somelongdirectorytoavoidrpathissues/src/kudu/src/kudu/rpc/rpc-test.cc:270: Failure
Failed
Bad status: Runtime error: could not verify certificate chain (error with cert: subject=CN = localhost, ST = sadfjas, C = AS, emailAddress = sdflkdsajf, O = lskdfjlsad, OU = sldfkja, issuer=C = AS, ST = ASDfkjdhf, L = lskdjf, O = saldfja, OU = skdjf, CN = localhost, emailAddress = sadjflkadsj): : certificate has expired
Google Test trace:
/data0/somelongdirectorytoavoidrpathissues/src/kudu/src/kudu/rpc/rpc-test.cc:267: Connecting to 0.0.0.0:43901
I20260926 17:59:35.224478   383 test_util.cc:175] -----------------------------------------------
I20260926 17:59:35.224538   383 test_util.cc:176] Had fatal failures, leaving test files at /tmp/dist-test-task654ljz/test-tmp/rpc-test.5.Parameters_TestRpc.TestCallWithChainCertAndChainCA_SSL_TCP.1790445575152850-383-0
[  FAILED  ] Parameters/TestRpc.TestCallWithChainCertAndChainCA/SSL_TCP, where GetParam() = (true, false) (29 ms)
[ RUN      ] Parameters/TestRpc.TestCallWithPasswordProtectedKey/SSL_TCP
I20260926 17:59:35.238325   444 acceptor_pool.cc:254] collecting diagnostics on the listening RPC socket 0.0.0.0:44425 every 8 connection(s)
I20260926 17:59:35.238337   445 acceptor_pool.cc:254] collecting diagnostics on the listening RPC socket 0.0.0.0:44425 every 8 connection(s)
[       OK ] Parameters/TestRpc.TestCallWithPasswordProtectedKey/SSL_TCP (27 ms)
[ RUN      ] Parameters/TestRpc.TestCallToBadServer/SSL_TCP
I20260926 17:59:35.264528   383 rpc-test.cc:394] Status: Network error: Client connection negotiation failed: client connection to 0.0.0.0:0: connect: Connection refused (error 111)
I20260926 17:59:35.264878   383 rpc-test.cc:394] Status: Network error: Client connection negotiation failed: client connection to 0.0.0.0:0: connect: Connection refused (error 111)
I20260926 17:59:35.265157   383 rpc-test.cc:394] Status: Network error: Client connection negotiation failed: client connection to 0.0.0.0:0: connect: Connection refused (error 111)
I20260926 17:59:35.265472   383 rpc-test.cc:394] Status: Network error: Client connection negotiation failed: client connection to 0.0.0.0:0: connect: Connection refused (error 111)
I20260926 17:59:35.265697   383 rpc-test.cc:394] Status: Network error: Client connection negotiation failed: client connection to 0.0.0.0:0: connect: Connection refused (error 111)
[       OK ] Parameters/TestRpc.TestCallToBadServer/SSL_TCP (13 ms)
[ RUN      ] Parameters/TestRpc.TestWrongService/SSL_TCP
I20260926 17:59:35.284885   479 acceptor_pool.cc:254] collecting diagnostics on the listening RPC socket 0.0.0.0:34517 every 8 connection(s)
I20260926 17:59:35.284889   480 acceptor_pool.cc:254] collecting diagnostics on the listening RPC socket 0.0.0.0:34517 every 8 connection(s)
I20260926 17:59:35.309341   478 messenger.cc:345] service WrongServiceName not registered on TestServer
[       OK ] Parameters/TestRpc.TestWrongService/SSL_TCP (44 ms)
[ RUN      ] Parameters/TestRpc.TestConnectionKeepalive/SSL_TCP
I20260926 17:59:35.344947   502 acceptor_pool.cc:254] collecting diagnostics on the listening RPC socket 0.0.0.0:35089 every 8 connection(s)
I20260926 17:59:35.344982   503 acceptor_pool.cc:254] collecting diagnostics on the listening RPC socket 0.0.0.0:35089 every 8 connection(s)
I20260926 17:59:35.345150   383 rpc-test.cc:488] Connecting to 0.0.0.0:35089
[       OK ] Parameters/TestRpc.TestConnectionKeepalive/SSL_TCP (1066 ms)
[ RUN      ] Parameters/TestRpc.TestClientConnectionMetrics/SSL_TCP
I20260926 17:59:36.387688   527 acceptor_pool.cc:254] collecting diagnostics on the listening RPC socket 0.0.0.0:45605 every 8 connection(s)
I20260926 17:59:36.387724   528 acceptor_pool.cc:254] collecting diagnostics on the listening RPC socket 0.0.0.0:45605 every 8 connection(s)
I20260926 17:59:36.387892   383 rpc-test.cc:569] Connecting to 0.0.0.0:45605
[       OK ] Parameters/TestRpc.TestClientConnectionMetrics/SSL_TCP (9074 ms)
[ RUN      ] Parameters/TestRpc.TestCredentialsPolicy/SSL_TCP
I20260926 17:59:45.488533   550 acceptor_pool.cc:254] collecting diagnostics on the listening RPC socket 0.0.0.0:37227 every 8 connection(s)
I20260926 17:59:45.488642   551 acceptor_pool.cc:254] collecting diagnostics on the listening RPC socket 0.0.0.0:37227 every 8 connection(s)
I20260926 17:59:45.488754   383 rpc-test.cc:700] Connecting to 0.0.0.0:37227
[       OK ] Parameters/TestRpc.TestCredentialsPolicy/SSL_TCP (85 ms)
[ RUN      ] Parameters/TestRpc.TestCallLongerThanKeepalive/SSL_TCP
I20260926 17:59:45.548743   575 acceptor_pool.cc:254] collecting diagnostics on the listening RPC socket 0.0.0.0:36453 every 8 connection(s)
I20260926 17:59:45.548779   576 acceptor_pool.cc:254] collecting diagnostics on the listening RPC socket 0.0.0.0:36453 every 8 connection(s)
I20260926 17:59:45.579722   579 rpc-test-base.h:222] got call: sleep_micros: 3000000 deferred: true
I20260926 17:59:48.580430   579 rpcz_store.cc:275] Call kudu.rpc.GenericCalculatorService.Sleep from 127.0.0.1:37214 (request call id 0) took 3000 ms. Trace:
I20260926 17:59:48.580559   579 rpcz_store.cc:276] 0926 17:59:45.579684 (+     0us) service_pool.cc:170] Inserting onto call queue
0926 17:59:45.579705 (+    21us) service_pool.cc:227] Handling call
0926 17:59:48.580414 (+3000709us) inbound_call.cc:173] Queueing success response
Metrics: {}
[       OK ] Parameters/TestRpc.TestCallLongerThanKeepalive/SSL_TCP (3044 ms)
[ RUN      ] Parameters/TestRpc.TestRpcSidecar/SSL_TCP
I20260926 17:59:48.625649   600 acceptor_pool.cc:254] collecting diagnostics on the listening RPC socket 0.0.0.0:43365 every 8 connection(s)
I20260926 17:59:48.625749   601 acceptor_pool.cc:254] collecting diagnostics on the listening RPC socket 0.0.0.0:43365 every 8 connection(s)
[       OK ] Parameters/TestRpc.TestRpcSidecar/SSL_TCP (120 ms)
[ RUN      ] Parameters/TestRpc.TestRpcSidecarLimits/SSL_TCP
I20260926 17:59:50.531860   625 acceptor_pool.cc:254] collecting diagnostics on the listening RPC socket 0.0.0.0:33215 every 8 connection(s)
I20260926 17:59:50.531903   626 acceptor_pool.cc:254] collecting diagnostics on the listening RPC socket 0.0.0.0:33215 every 8 connection(s)
W20260926 17:59:50.548803   383 serialization.cc:72] Serialized kudu.rpc_test.PushStringsRequestPB (2147483654 bytes) is larger than the maximum configured RPC message size (52428800 bytes). Sending anyway, but peer may reject the data.
W20260926 17:59:50.552421   624 connection.cc:535] server connection from 127.0.0.1:38720 recv error: Network error: RPC frame had a length of 2147483714, but we only support messages up to 52428800 bytes long.
W20260926 17:59:50.552515   624 connection.cc:158] shutting down server connection from 127.0.0.1:38720 with pending inbound data: 4/2147483714 bytes received; last active 0 ns ago: status Network error: RPC frame had a length of 2147483714, but we only support messages up to 52428800 bytes long.
W20260926 17:59:50.552749   638 connection.cc:196] Error closing socket: Network error: TlsSocket::Close: Connection reset by peer
I20260926 17:59:50.572016   650 acceptor_pool.cc:254] collecting diagnostics on the listening RPC socket 0.0.0.0:45145 every 8 connection(s)
I20260926 17:59:50.572055   651 acceptor_pool.cc:254] collecting diagnostics on the listening RPC socket 0.0.0.0:45145 every 8 connection(s)
W20260926 17:59:54.660861   649 connection.cc:577] server connection from 127.0.0.1:41212: received bad data: 'Corruption: Invalid packet: message had a length of 2147483710, but we only support messages up to 2147483647 bytes
'
[       OK ] Parameters/TestRpc.TestRpcSidecarLimits/SSL_TCP (5959 ms)
[ RUN      ] Parameters/TestRpc.TestCallTimeoutDoesntAffectNegotiation/SSL_TCP
I20260926 17:59:54.672644   675 acceptor_pool.cc:254] collecting diagnostics on the listening RPC socket 0.0.0.0:43149 every 8 connection(s)
I20260926 17:59:54.672672   676 acceptor_pool.cc:254] collecting diagnostics on the listening RPC socket 0.0.0.0:43149 every 8 connection(s)
W20260926 17:59:54.701309   671 negotiation.cc:266] Injecting 500ms delay in negotiation
I20260926 17:59:54.751654   383 rpc-test-base.h:595] status: Timed out: connection negotiation to 0.0.0.0:43149 for RPC Sleep timed out after 0.050s (ON_OUTBOUND_QUEUE), seconds elapsed: 0.0507963
[       OK ] Parameters/TestRpc.TestCallTimeoutDoesntAffectNegotiation/SSL_TCP (543 ms)
[ RUN      ] Parameters/TestRpc.TestRpcHandlerLatencyMetric/SSL_TCP
I20260926 17:59:55.221825   700 acceptor_pool.cc:254] collecting diagnostics on the listening RPC socket 0.0.0.0:45517 every 8 connection(s)
I20260926 17:59:55.221843   701 acceptor_pool.cc:254] collecting diagnostics on the listening RPC socket 0.0.0.0:45517 every 8 connection(s)
I20260926 17:59:55.260669   383 rpc-test.cc:1236] Sleep() min lat: 20325
I20260926 17:59:55.260749   383 rpc-test.cc:1237] Sleep() mean lat: 20325
I20260926 17:59:55.260776   383 rpc-test.cc:1238] Sleep() max lat: 20325
I20260926 17:59:55.260789   383 rpc-test.cc:1239] Sleep() #calls: 1
[       OK ] Parameters/TestRpc.TestRpcHandlerLatencyMetric/SSL_TCP (55 ms)
[ RUN      ] Parameters/TestRpc.TimedOutOnResponseMetricServiceQueue/SSL_TCP
I20260926 17:59:55.280083   726 acceptor_pool.cc:254] collecting diagnostics on the listening RPC socket 0.0.0.0:46471 every 8 connection(s)
I20260926 17:59:55.280107   727 acceptor_pool.cc:254] collecting diagnostics on the listening RPC socket 0.0.0.0:46471 every 8 connection(s)
W20260926 17:59:55.355561   728 rpcz_store.cc:267] Call kudu.rpc_test.CalculatorService.Sleep from 127.0.0.1:60896 (request call id 2) took 20 ms (client timeout 20 ms). Trace:
W20260926 17:59:55.355685   728 rpcz_store.cc:269] 0926 17:59:55.335250 (+     0us) service_pool.cc:170] Inserting onto call queue
0926 17:59:55.355524 (+ 20274us) service_pool.cc:214] Skipping call since client already timed out
0926 17:59:55.355536 (+    12us) inbound_call.cc:173] Queueing failure response
Metrics: {}
[       OK ] Parameters/TestRpc.TimedOutOnResponseMetricServiceQueue/SSL_TCP (94 ms)
[ RUN      ] Parameters/TestRpc.RpcPendingConnectionsMetric/SSL_TCP
I20260926 17:59:55.359551   749 acceptor_pool.cc:254] collecting diagnostics on the listening RPC socket 0.0.0.0:35523 every 8 connection(s)
I20260926 17:59:55.359637   750 acceptor_pool.cc:254] collecting diagnostics on the listening RPC socket 0.0.0.0:35523 every 8 connection(s)
W20260926 17:59:55.368858   745 negotiation.cc:337] Failed RPC negotiation. Trace:
0926 17:59:55.368658 (+     0us) reactor.cc:625] Submitting negotiation task for server connection from 127.0.0.1:45812 (local address 127.0.0.1:35523)
0926 17:59:55.368731 (+    73us) server_negotiation.cc:206] Beginning negotiation
0926 17:59:55.368732 (+     1us) server_negotiation.cc:399] Waiting for connection header
0926 17:59:55.368797 (+    65us) negotiation.cc:327] Negotiation complete: Network error: Server connection negotiation failed: server connection from 127.0.0.1:45812: BlockingRecv error: recv got EOF from 127.0.0.1:45812 (error 108)
Metrics: {"server-negotiator.queue_time_us":24}
[       OK ] Parameters/TestRpc.RpcPendingConnectionsMetric/SSL_TCP (22 ms)
[ RUN      ] Parameters/TestRpc.TestRpcContextClientDeadline/SSL_TCP
I20260926 17:59:55.386620   765 acceptor_pool.cc:254] collecting diagnostics on the listening RPC socket 0.0.0.0:40955 every 8 connection(s)
I20260926 17:59:55.386655   766 acceptor_pool.cc:254] collecting diagnostics on the listening RPC socket 0.0.0.0:40955 every 8 connection(s)
[       OK ] Parameters/TestRpc.TestRpcContextClientDeadline/SSL_TCP (46 ms)
[ RUN      ] Parameters/TestRpc.TestApplicationFeatureFlagUnsupportedServer/SSL_TCP
I20260926 17:59:55.441361   790 acceptor_pool.cc:254] collecting diagnostics on the listening RPC socket 0.0.0.0:45235 every 8 connection(s)
I20260926 17:59:55.441370   791 acceptor_pool.cc:254] collecting diagnostics on the listening RPC socket 0.0.0.0:45235 every 8 connection(s)
[       OK ] Parameters/TestRpc.TestApplicationFeatureFlagUnsupportedServer/SSL_TCP (36 ms)
[ RUN      ] Parameters/TestRpc.TestCancellationAsync/SSL_TCP
I20260926 17:59:55.471653   815 acceptor_pool.cc:254] collecting diagnostics on the listening RPC socket 0.0.0.0:40883 every 8 connection(s)
I20260926 17:59:55.471678   816 acceptor_pool.cc:254] collecting diagnostics on the listening RPC socket 0.0.0.0:40883 every 8 connection(s)
I20260926 17:59:55.471846   383 rpc-test.cc:1716] Connecting to 0.0.0.0:40883
I20260926 17:59:55.480641   383 test_util.cc:268] Using random seed: -1716170179
I20260926 17:59:55.501000   819 rpc-test-base.h:240] got call: sleep_micros: 500 pattern: 4294967295 num_repetitions: 2097152 sidecar_idx: 0
I20260926 17:59:55.515466   819 rpc-test-base.h:240] got call: sleep_micros: 500 pattern: 4294967295 num_repetitions: 2097152 sidecar_idx: 0
I20260926 17:59:55.532835   819 rpc-test-base.h:240] got call: sleep_micros: 500 pattern: 4294967295 num_repetitions: 2097152 sidecar_idx: 0
I20260926 17:59:55.549800   819 rpc-test-base.h:240] got call: sleep_micros: 500 pattern: 4294967295 num_repetitions: 2097152 sidecar_idx: 0
I20260926 17:59:55.566439   819 rpc-test-base.h:240] got call: sleep_micros: 500 pattern: 4294967295 num_repetitions: 2097152 sidecar_idx: 0
I20260926 17:59:55.582984   819 rpc-test-base.h:240] got call: sleep_micros: 500 pattern: 4294967295 num_repetitions: 2097152 sidecar_idx: 0
I20260926 17:59:55.599367   819 rpc-test-base.h:240] got call: sleep_micros: 500 pattern: 4294967295 num_repetitions: 2097152 sidecar_idx: 0
I20260926 17:59:55.615571   819 rpc-test-base.h:240] got call: sleep_micros: 500 pattern: 4294967295 num_repetitions: 2097152 sidecar_idx: 0
W20260926 17:59:55.618939   812 connection.cc:441] server connection from 127.0.0.1:59736 torn down before Call kudu.rpc.GenericCalculatorService.SleepWithSidecar from 127.0.0.1:59736 (request call id 9) could send its response
[       OK ] Parameters/TestRpc.TestCancellationAsync/SSL_TCP (157 ms)
[ RUN      ] Parameters/TestRpc.TestPerformanceBySocketType/SSL_TCP
I20260926 17:59:55.646764   840 acceptor_pool.cc:254] collecting diagnostics on the listening RPC socket 0.0.0.0:34883 every 8 connection(s)
I20260926 17:59:55.646790   841 acceptor_pool.cc:254] collecting diagnostics on the listening RPC socket 0.0.0.0:34883 every 8 connection(s)
I20260926 17:59:55.646941   383 rpc-test.cc:1846] Connecting to 0.0.0.0:34883
I20260926 17:59:57.457747   383 rpc-test.cc:1859] Sending 1024MB via ssl-enabled tcp socket: real 1.804s	user 1.623s	sys 1.541s
I20260926 17:59:59.380669   383 rpc-test.cc:1859] Sending 1024MB via ssl-enabled tcp socket: real 1.923s	user 1.698s	sys 1.649s
I20260926 18:00:01.222380   383 rpc-test.cc:1859] Sending 1024MB via ssl-enabled tcp socket: real 1.842s	user 1.732s	sys 1.511s
I20260926 18:00:03.036120   383 rpc-test.cc:1859] Sending 1024MB via ssl-enabled tcp socket: real 1.814s	user 1.745s	sys 1.454s
I20260926 18:00:04.829689   383 rpc-test.cc:1859] Sending 1024MB via ssl-enabled tcp socket: real 1.793s	user 1.603s	sys 1.543s
[       OK ] Parameters/TestRpc.TestPerformanceBySocketType/SSL_TCP (9211 ms)
[----------] 20 tests from Parameters/TestRpc (29675 ms total)

[----------] 1 test from Parameters/TestRpcSocketTxRxQueue
[ RUN      ] Parameters/TestRpcSocketTxRxQueue.OverCapacity/0
W20260926 18:00:05.102586   884 negotiation.cc:337] Failed RPC negotiation. Trace:
0926 18:00:04.841131 (+     0us) reactor.cc:625] Submitting negotiation task for client connection to 0.0.0.0:42041 (local address 127.0.0.1:49174)
0926 18:00:04.841192 (+    61us) negotiation.cc:107] Waiting for socket to connect
0926 18:00:04.841202 (+    10us) client_negotiation.cc:174] Beginning negotiation
0926 18:00:04.841247 (+    45us) client_negotiation.cc:252] Sending NEGOTIATE NegotiatePB request
0926 18:00:05.102477 (+261230us) negotiation.cc:327] Negotiation complete: Network error: Client connection negotiation failed: client connection to 0.0.0.0:42041: BlockingRecv error: recv error from unknown peer: Transport endpoint is not connected (error 107)
Metrics: {"client-negotiator.queue_time_us":39}
W20260926 18:00:05.102586   857 negotiation.cc:337] Failed RPC negotiation. Trace:
0926 18:00:04.838022 (+     0us) reactor.cc:625] Submitting negotiation task for client connection to 0.0.0.0:42041 (local address 127.0.0.1:49146)
0926 18:00:04.838088 (+    66us) negotiation.cc:107] Waiting for socket to connect
0926 18:00:04.838100 (+    12us) client_negotiation.cc:174] Beginning negotiation
0926 18:00:04.838161 (+    61us) client_negotiation.cc:252] Sending NEGOTIATE NegotiatePB request
0926 18:00:05.102449 (+264288us) negotiation.cc:327] Negotiation complete: Network error: Client connection negotiation failed: client connection to 0.0.0.0:42041: BlockingRecv error: recv error from unknown peer: Transport endpoint is not connected (error 107)
Metrics: {"client-negotiator.queue_time_us":40}
W20260926 18:00:05.102857   866 negotiation.cc:337] Failed RPC negotiation. Trace:
0926 18:00:04.839088 (+     0us) reactor.cc:625] Submitting negotiation task for client connection to 0.0.0.0:42041 (local address 127.0.0.1:49152)
0926 18:00:04.839152 (+    64us) negotiation.cc:107] Waiting for socket to connect
0926 18:00:04.839162 (+    10us) client_negotiation.cc:174] Beginning negotiation
0926 18:00:04.839215 (+    53us) client_negotiation.cc:252] Sending NEGOTIATE NegotiatePB request
0926 18:00:05.102549 (+263334us) negotiation.cc:327] Negotiation complete: Network error: Client connection negotiation failed: client connection to 0.0.0.0:42041: BlockingRecv error: recv error from unknown peer: Transport endpoint is not connected (error 107)
Metrics: {"client-negotiator.queue_time_us":36}
W20260926 18:00:05.102968   902 negotiation.cc:337] Failed RPC negotiation. Trace:
0926 18:00:04.843322 (+     0us) reactor.cc:625] Submitting negotiation task for client connection to 0.0.0.0:42041 (local address 127.0.0.1:49188)
0926 18:00:04.843390 (+    68us) negotiation.cc:107] Waiting for socket to connect
0926 18:00:04.843401 (+    11us) client_negotiation.cc:174] Beginning negotiation
0926 18:00:04.843457 (+    56us) client_negotiation.cc:252] Sending NEGOTIATE NegotiatePB request
0926 18:00:05.102926 (+259469us) negotiation.cc:327] Negotiation complete: Network error: Client connection negotiation failed: client connection to 0.0.0.0:42041: BlockingRecv error: recv error from unknown peer: Transport endpoint is not connected (error 107)
Metrics: {"client-negotiator.queue_time_us":37}
W20260926 18:00:05.103065   893 negotiation.cc:337] Failed RPC negotiation. Trace:
0926 18:00:04.842288 (+     0us) reactor.cc:625] Submitting negotiation task for client connection to 0.0.0.0:42041 (local address 127.0.0.1:49180)
0926 18:00:04.842371 (+    83us) negotiation.cc:107] Waiting for socket to connect
0926 18:00:04.842380 (+     9us) client_negotiation.cc:174] Beginning negotiation
0926 18:00:04.842429 (+    49us) client_negotiation.cc:252] Sending NEGOTIATE NegotiatePB request
0926 18:00:05.102868 (+260439us) negotiation.cc:327] Negotiation complete: Network error: Client connection negotiation failed: client connection to 0.0.0.0:42041: BlockingRecv error: recv error from unknown peer: Transport endpoint is not connected (error 107)
Metrics: {"client-negotiator.queue_time_us":58}
W20260926 18:00:05.103204   875 negotiation.cc:337] Failed RPC negotiation. Trace:
0926 18:00:04.840071 (+     0us) reactor.cc:625] Submitting negotiation task for client connection to 0.0.0.0:42041 (local address 127.0.0.1:49168)
0926 18:00:04.840129 (+    58us) negotiation.cc:107] Waiting for socket to connect
0926 18:00:04.840138 (+     9us) client_negotiation.cc:174] Beginning negotiation
0926 18:00:04.840183 (+    45us) client_negotiation.cc:252] Sending NEGOTIATE NegotiatePB request
0926 18:00:05.102549 (+262366us) negotiation.cc:327] Negotiation complete: Network error: Client connection negotiation failed: client connection to 0.0.0.0:42041: BlockingRecv error: recv error from unknown peer: Transport endpoint is not connected (error 107)
Metrics: {"client-negotiator.queue_time_us":37}
[       OK ] Parameters/TestRpcSocketTxRxQueue.OverCapacity/0 (1042 ms)
[----------] 1 test from Parameters/TestRpcSocketTxRxQueue (1042 ms total)

[----------] Global test environment tear-down
[==========] 21 tests from 2 test suites ran. (30718 ms total)
[  PASSED  ] 20 tests.
[  FAILED  ] 1 test, listed below:
[  FAILED  ] Parameters/TestRpc.TestCallWithChainCertAndChainCA/SSL_TCP, where GetParam() = (true, false)

 1 FAILED TEST