Diagnosed failure

Parameters/TestRpc.TestCallWithChainCertAndChainCA/SSL_TCP: /data0/somelongdirectorytoavoidrpathissues/src/kudu/src/kudu/rpc/rpc-test.cc:270: Failure
Failed
Bad status: Runtime error: could not verify certificate chain (error with cert: subject=CN = localhost, ST = sadfjas, C = AS, emailAddress = sdflkdsajf, O = lskdfjlsad, OU = sldfkja, issuer=C = AS, ST = ASDfkjdhf, L = lskdjf, O = saldfja, OU = skdjf, CN = localhost, emailAddress = sadjflkadsj): : certificate has expired
Google Test trace:
/data0/somelongdirectorytoavoidrpathissues/src/kudu/src/kudu/rpc/rpc-test.cc:267: Connecting to 0.0.0.0:43439
I20260925 02:23:02.431499  7546 test_util.cc:175] -----------------------------------------------
I20260925 02:23:02.431557  7546 test_util.cc:176] Had fatal failures, leaving test files at /tmp/dist-test-taskgE5pS8/test-tmp/rpc-test.5.Parameters_TestRpc.TestCallWithChainCertAndChainCA_SSL_TCP.1790302982366309-7546-0

Full log

Note: This is test shard 6 of 8.
[==========] Running 21 tests from 2 test suites.
[----------] Global test environment set-up.
[----------] 20 tests from Parameters/TestRpc
[ RUN      ] Parameters/TestRpc.TestMessengerCreateDestroy/SSL_TCP
WARNING: Logging before InitGoogleLogging() is written to STDERR
I20260925 02:23:02.389968  7546 rpc-test.cc:169] started messenger TestCreateDestroy
[       OK ] Parameters/TestRpc.TestMessengerCreateDestroy/SSL_TCP (22 ms)
[ RUN      ] Parameters/TestRpc.TestNegotiationDeadlock/SSL_TCP
I20260925 02:23:02.399343  7570 acceptor_pool.cc:254] collecting diagnostics on the listening RPC socket 0.0.0.0:35707 every 8 connection(s)
I20260925 02:23:02.399358  7569 acceptor_pool.cc:254] collecting diagnostics on the listening RPC socket 0.0.0.0:35707 every 8 connection(s)
[       OK ] Parameters/TestRpc.TestNegotiationDeadlock/SSL_TCP (16 ms)
[ RUN      ] Parameters/TestRpc.TestCallWithChainCertAndChainCA/SSL_TCP
I20260925 02:23:02.427059  7586 acceptor_pool.cc:254] collecting diagnostics on the listening RPC socket 0.0.0.0:43439 every 8 connection(s)
I20260925 02:23:02.427059  7585 acceptor_pool.cc:254] collecting diagnostics on the listening RPC socket 0.0.0.0:43439 every 8 connection(s)
/data0/somelongdirectorytoavoidrpathissues/src/kudu/src/kudu/rpc/rpc-test.cc:270: Failure
Failed
Bad status: Runtime error: could not verify certificate chain (error with cert: subject=CN = localhost, ST = sadfjas, C = AS, emailAddress = sdflkdsajf, O = lskdfjlsad, OU = sldfkja, issuer=C = AS, ST = ASDfkjdhf, L = lskdjf, O = saldfja, OU = skdjf, CN = localhost, emailAddress = sadjflkadsj): : certificate has expired
Google Test trace:
/data0/somelongdirectorytoavoidrpathissues/src/kudu/src/kudu/rpc/rpc-test.cc:267: Connecting to 0.0.0.0:43439
I20260925 02:23:02.431499  7546 test_util.cc:175] -----------------------------------------------
I20260925 02:23:02.431557  7546 test_util.cc:176] Had fatal failures, leaving test files at /tmp/dist-test-taskgE5pS8/test-tmp/rpc-test.5.Parameters_TestRpc.TestCallWithChainCertAndChainCA_SSL_TCP.1790302982366309-7546-0
[  FAILED  ] Parameters/TestRpc.TestCallWithChainCertAndChainCA/SSL_TCP, where GetParam() = (true, false) (23 ms)
[ RUN      ] Parameters/TestRpc.TestCallWithPasswordProtectedKey/SSL_TCP
I20260925 02:23:02.444159  7611 acceptor_pool.cc:254] collecting diagnostics on the listening RPC socket 0.0.0.0:41049 every 8 connection(s)
I20260925 02:23:02.444321  7610 acceptor_pool.cc:254] collecting diagnostics on the listening RPC socket 0.0.0.0:41049 every 8 connection(s)
[       OK ] Parameters/TestRpc.TestCallWithPasswordProtectedKey/SSL_TCP (26 ms)
[ RUN      ] Parameters/TestRpc.TestCallToBadServer/SSL_TCP
I20260925 02:23:02.481300  7546 rpc-test.cc:394] Status: Network error: Client connection negotiation failed: client connection to 0.0.0.0:0: connect: Connection refused (error 111)
I20260925 02:23:02.481668  7546 rpc-test.cc:394] Status: Network error: Client connection negotiation failed: client connection to 0.0.0.0:0: connect: Connection refused (error 111)
I20260925 02:23:02.481873  7546 rpc-test.cc:394] Status: Network error: Client connection negotiation failed: client connection to 0.0.0.0:0: connect: Connection refused (error 111)
I20260925 02:23:02.482051  7546 rpc-test.cc:394] Status: Network error: Client connection negotiation failed: client connection to 0.0.0.0:0: connect: Connection refused (error 111)
I20260925 02:23:02.482318  7546 rpc-test.cc:394] Status: Network error: Client connection negotiation failed: client connection to 0.0.0.0:0: connect: Connection refused (error 111)
[       OK ] Parameters/TestRpc.TestCallToBadServer/SSL_TCP (25 ms)
[ RUN      ] Parameters/TestRpc.TestWrongService/SSL_TCP
I20260925 02:23:02.493705  7646 acceptor_pool.cc:254] collecting diagnostics on the listening RPC socket 0.0.0.0:46503 every 8 connection(s)
I20260925 02:23:02.493705  7645 acceptor_pool.cc:254] collecting diagnostics on the listening RPC socket 0.0.0.0:46503 every 8 connection(s)
I20260925 02:23:02.509955  7642 messenger.cc:345] service WrongServiceName not registered on TestServer
[       OK ] Parameters/TestRpc.TestWrongService/SSL_TCP (28 ms)
[ RUN      ] Parameters/TestRpc.TestConnectionKeepalive/SSL_TCP
I20260925 02:23:02.521207  7669 acceptor_pool.cc:254] collecting diagnostics on the listening RPC socket 0.0.0.0:40245 every 8 connection(s)
I20260925 02:23:02.521235  7670 acceptor_pool.cc:254] collecting diagnostics on the listening RPC socket 0.0.0.0:40245 every 8 connection(s)
I20260925 02:23:02.521409  7546 rpc-test.cc:488] Connecting to 0.0.0.0:40245
[       OK ] Parameters/TestRpc.TestConnectionKeepalive/SSL_TCP (1042 ms)
[ RUN      ] Parameters/TestRpc.TestClientConnectionMetrics/SSL_TCP
I20260925 02:23:03.561784  7694 acceptor_pool.cc:254] collecting diagnostics on the listening RPC socket 0.0.0.0:37511 every 8 connection(s)
I20260925 02:23:03.561896  7695 acceptor_pool.cc:254] collecting diagnostics on the listening RPC socket 0.0.0.0:37511 every 8 connection(s)
I20260925 02:23:03.562002  7546 rpc-test.cc:569] Connecting to 0.0.0.0:37511
[       OK ] Parameters/TestRpc.TestClientConnectionMetrics/SSL_TCP (9099 ms)
[ RUN      ] Parameters/TestRpc.TestCredentialsPolicy/SSL_TCP
I20260925 02:23:12.672749  7717 acceptor_pool.cc:254] collecting diagnostics on the listening RPC socket 0.0.0.0:35467 every 8 connection(s)
I20260925 02:23:12.672760  7718 acceptor_pool.cc:254] collecting diagnostics on the listening RPC socket 0.0.0.0:35467 every 8 connection(s)
I20260925 02:23:12.672959  7546 rpc-test.cc:700] Connecting to 0.0.0.0:35467
[       OK ] Parameters/TestRpc.TestCredentialsPolicy/SSL_TCP (44 ms)
[ RUN      ] Parameters/TestRpc.TestCallLongerThanKeepalive/SSL_TCP
I20260925 02:23:12.707571  7742 acceptor_pool.cc:254] collecting diagnostics on the listening RPC socket 0.0.0.0:39035 every 8 connection(s)
I20260925 02:23:12.707600  7743 acceptor_pool.cc:254] collecting diagnostics on the listening RPC socket 0.0.0.0:39035 every 8 connection(s)
I20260925 02:23:12.719128  7746 rpc-test-base.h:222] got call: sleep_micros: 3000000 deferred: true
I20260925 02:23:15.719895  7746 rpcz_store.cc:275] Call kudu.rpc.GenericCalculatorService.Sleep from 127.0.0.1:54100 (request call id 0) took 3000 ms. Trace:
I20260925 02:23:15.720008  7746 rpcz_store.cc:276] 0925 02:23:12.719057 (+     0us) service_pool.cc:170] Inserting onto call queue
0925 02:23:12.719098 (+    41us) service_pool.cc:227] Handling call
0925 02:23:15.719876 (+3000778us) inbound_call.cc:173] Queueing success response
Metrics: {}
[       OK ] Parameters/TestRpc.TestCallLongerThanKeepalive/SSL_TCP (3024 ms)
[ RUN      ] Parameters/TestRpc.TestRpcSidecar/SSL_TCP
I20260925 02:23:15.731237  7767 acceptor_pool.cc:254] collecting diagnostics on the listening RPC socket 0.0.0.0:43823 every 8 connection(s)
I20260925 02:23:15.731359  7768 acceptor_pool.cc:254] collecting diagnostics on the listening RPC socket 0.0.0.0:43823 every 8 connection(s)
[       OK ] Parameters/TestRpc.TestRpcSidecar/SSL_TCP (62 ms)
[ RUN      ] Parameters/TestRpc.TestRpcSidecarLimits/SSL_TCP
I20260925 02:23:17.600643  7793 acceptor_pool.cc:254] collecting diagnostics on the listening RPC socket 0.0.0.0:42929 every 8 connection(s)
I20260925 02:23:17.600661  7794 acceptor_pool.cc:254] collecting diagnostics on the listening RPC socket 0.0.0.0:42929 every 8 connection(s)
W20260925 02:23:17.609754  7546 serialization.cc:72] Serialized kudu.rpc_test.PushStringsRequestPB (2147483654 bytes) is larger than the maximum configured RPC message size (52428800 bytes). Sending anyway, but peer may reject the data.
W20260925 02:23:17.613271  7791 connection.cc:535] server connection from 127.0.0.1:44062 recv error: Network error: RPC frame had a length of 2147483714, but we only support messages up to 52428800 bytes long.
W20260925 02:23:17.613343  7791 connection.cc:158] shutting down server connection from 127.0.0.1:44062 with pending inbound data: 4/2147483714 bytes received; last active 0 ns ago: status Network error: RPC frame had a length of 2147483714, but we only support messages up to 52428800 bytes long.
W20260925 02:23:17.613579  7806 connection.cc:196] Error closing socket: Network error: TlsSocket::Close: Connection reset by peer
I20260925 02:23:17.622040  7818 acceptor_pool.cc:254] collecting diagnostics on the listening RPC socket 0.0.0.0:39611 every 8 connection(s)
I20260925 02:23:17.622052  7819 acceptor_pool.cc:254] collecting diagnostics on the listening RPC socket 0.0.0.0:39611 every 8 connection(s)
W20260925 02:23:21.657397  7817 connection.cc:577] server connection from 127.0.0.1:53102: received bad data: 'Corruption: Invalid packet: message had a length of 2147483710, but we only support messages up to 2147483647 bytes
'
[       OK ] Parameters/TestRpc.TestRpcSidecarLimits/SSL_TCP (5875 ms)
[ RUN      ] Parameters/TestRpc.TestCallTimeoutDoesntAffectNegotiation/SSL_TCP
I20260925 02:23:21.673862  7843 acceptor_pool.cc:254] collecting diagnostics on the listening RPC socket 0.0.0.0:43045 every 8 connection(s)
I20260925 02:23:21.674000  7844 acceptor_pool.cc:254] collecting diagnostics on the listening RPC socket 0.0.0.0:43045 every 8 connection(s)
W20260925 02:23:21.688128  7839 negotiation.cc:266] Injecting 500ms delay in negotiation
I20260925 02:23:21.738459  7546 rpc-test-base.h:595] status: Timed out: connection negotiation to 0.0.0.0:43045 for RPC Sleep timed out after 0.050s (ON_OUTBOUND_QUEUE), seconds elapsed: 0.0508268
[       OK ] Parameters/TestRpc.TestCallTimeoutDoesntAffectNegotiation/SSL_TCP (533 ms)
[ RUN      ] Parameters/TestRpc.TestRpcHandlerLatencyMetric/SSL_TCP
I20260925 02:23:22.219172  7868 acceptor_pool.cc:254] collecting diagnostics on the listening RPC socket 0.0.0.0:46061 every 8 connection(s)
I20260925 02:23:22.219180  7869 acceptor_pool.cc:254] collecting diagnostics on the listening RPC socket 0.0.0.0:46061 every 8 connection(s)
I20260925 02:23:22.253903  7546 rpc-test.cc:1236] Sleep() min lat: 20321
I20260925 02:23:22.253980  7546 rpc-test.cc:1237] Sleep() mean lat: 20321
I20260925 02:23:22.254007  7546 rpc-test.cc:1238] Sleep() max lat: 20321
I20260925 02:23:22.254020  7546 rpc-test.cc:1239] Sleep() #calls: 1
[       OK ] Parameters/TestRpc.TestRpcHandlerLatencyMetric/SSL_TCP (62 ms)
[ RUN      ] Parameters/TestRpc.TimedOutOnResponseMetricServiceQueue/SSL_TCP
I20260925 02:23:22.273357  7896 acceptor_pool.cc:254] collecting diagnostics on the listening RPC socket 0.0.0.0:35109 every 8 connection(s)
I20260925 02:23:22.273398  7895 acceptor_pool.cc:254] collecting diagnostics on the listening RPC socket 0.0.0.0:35109 every 8 connection(s)
W20260925 02:23:22.333323  7897 rpcz_store.cc:267] Call kudu.rpc_test.CalculatorService.Sleep from 127.0.0.1:43200 (request call id 2) took 20 ms (client timeout 20 ms). Trace:
W20260925 02:23:22.333451  7897 rpcz_store.cc:269] 0925 02:23:22.312936 (+     0us) service_pool.cc:170] Inserting onto call queue
0925 02:23:22.333286 (+ 20350us) service_pool.cc:214] Skipping call since client already timed out
0925 02:23:22.333299 (+    13us) inbound_call.cc:173] Queueing failure response
Metrics: {}
[       OK ] Parameters/TestRpc.TimedOutOnResponseMetricServiceQueue/SSL_TCP (79 ms)
[ RUN      ] Parameters/TestRpc.RpcPendingConnectionsMetric/SSL_TCP
I20260925 02:23:22.337153  7918 acceptor_pool.cc:254] collecting diagnostics on the listening RPC socket 0.0.0.0:42665 every 8 connection(s)
I20260925 02:23:22.337209  7919 acceptor_pool.cc:254] collecting diagnostics on the listening RPC socket 0.0.0.0:42665 every 8 connection(s)
W20260925 02:23:22.337894  7914 negotiation.cc:337] Failed RPC negotiation. Trace:
0925 02:23:22.337693 (+     0us) reactor.cc:625] Submitting negotiation task for server connection from 127.0.0.1:51480 (local address 127.0.0.1:42665)
0925 02:23:22.337757 (+    64us) server_negotiation.cc:206] Beginning negotiation
0925 02:23:22.337759 (+     2us) server_negotiation.cc:399] Waiting for connection header
0925 02:23:22.337835 (+    76us) negotiation.cc:327] Negotiation complete: Network error: Server connection negotiation failed: server connection from 127.0.0.1:51480: BlockingRecv error: recv got EOF from 127.0.0.1:51480 (error 108)
Metrics: {"server-negotiator.queue_time_us":31}
[       OK ] Parameters/TestRpc.RpcPendingConnectionsMetric/SSL_TCP (13 ms)
[ RUN      ] Parameters/TestRpc.TestRpcContextClientDeadline/SSL_TCP
I20260925 02:23:22.362591  7934 acceptor_pool.cc:254] collecting diagnostics on the listening RPC socket 0.0.0.0:36951 every 8 connection(s)
I20260925 02:23:22.362666  7935 acceptor_pool.cc:254] collecting diagnostics on the listening RPC socket 0.0.0.0:36951 every 8 connection(s)
[       OK ] Parameters/TestRpc.TestRpcContextClientDeadline/SSL_TCP (46 ms)
[ RUN      ] Parameters/TestRpc.TestApplicationFeatureFlagUnsupportedServer/SSL_TCP
I20260925 02:23:22.406432  7959 acceptor_pool.cc:254] collecting diagnostics on the listening RPC socket 0.0.0.0:39423 every 8 connection(s)
I20260925 02:23:22.406454  7961 acceptor_pool.cc:254] collecting diagnostics on the listening RPC socket 0.0.0.0:39423 every 8 connection(s)
[       OK ] Parameters/TestRpc.TestApplicationFeatureFlagUnsupportedServer/SSL_TCP (41 ms)
[ RUN      ] Parameters/TestRpc.TestCancellationAsync/SSL_TCP
I20260925 02:23:22.468873  7985 acceptor_pool.cc:254] collecting diagnostics on the listening RPC socket 0.0.0.0:42523 every 8 connection(s)
I20260925 02:23:22.468889  7986 acceptor_pool.cc:254] collecting diagnostics on the listening RPC socket 0.0.0.0:42523 every 8 connection(s)
I20260925 02:23:22.469077  7546 rpc-test.cc:1716] Connecting to 0.0.0.0:42523
I20260925 02:23:22.490660  7546 test_util.cc:268] Using random seed: 1719727905
I20260925 02:23:22.508572  7989 rpc-test-base.h:240] got call: sleep_micros: 500 pattern: 4294967295 num_repetitions: 2097152 sidecar_idx: 0
I20260925 02:23:22.521531  7989 rpc-test-base.h:240] got call: sleep_micros: 500 pattern: 4294967295 num_repetitions: 2097152 sidecar_idx: 0
I20260925 02:23:22.534938  7989 rpc-test-base.h:240] got call: sleep_micros: 500 pattern: 4294967295 num_repetitions: 2097152 sidecar_idx: 0
I20260925 02:23:22.553745  7989 rpc-test-base.h:240] got call: sleep_micros: 500 pattern: 4294967295 num_repetitions: 2097152 sidecar_idx: 0
I20260925 02:23:22.571398  7989 rpc-test-base.h:240] got call: sleep_micros: 500 pattern: 4294967295 num_repetitions: 2097152 sidecar_idx: 0
I20260925 02:23:22.586876  7989 rpc-test-base.h:240] got call: sleep_micros: 500 pattern: 4294967295 num_repetitions: 2097152 sidecar_idx: 0
I20260925 02:23:22.602603  7989 rpc-test-base.h:240] got call: sleep_micros: 500 pattern: 4294967295 num_repetitions: 2097152 sidecar_idx: 0
I20260925 02:23:22.618713  7989 rpc-test-base.h:240] got call: sleep_micros: 500 pattern: 4294967295 num_repetitions: 2097152 sidecar_idx: 0
W20260925 02:23:22.622254  7983 connection.cc:441] server connection from 127.0.0.1:33290 torn down before Call kudu.rpc.GenericCalculatorService.SleepWithSidecar from 127.0.0.1:33290 (request call id 9) could send its response
[       OK ] Parameters/TestRpc.TestCancellationAsync/SSL_TCP (186 ms)
[ RUN      ] Parameters/TestRpc.TestPerformanceBySocketType/SSL_TCP
I20260925 02:23:22.637768  8010 acceptor_pool.cc:254] collecting diagnostics on the listening RPC socket 0.0.0.0:36853 every 8 connection(s)
I20260925 02:23:22.637826  8011 acceptor_pool.cc:254] collecting diagnostics on the listening RPC socket 0.0.0.0:36853 every 8 connection(s)
I20260925 02:23:22.638021  7546 rpc-test.cc:1846] Connecting to 0.0.0.0:36853
I20260925 02:23:24.392990  7546 rpc-test.cc:1859] Sending 1024MB via ssl-enabled tcp socket: real 1.749s	user 1.697s	sys 1.375s
I20260925 02:23:26.257702  7546 rpc-test.cc:1859] Sending 1024MB via ssl-enabled tcp socket: real 1.865s	user 1.788s	sys 1.501s
I20260925 02:23:28.168593  7546 rpc-test.cc:1859] Sending 1024MB via ssl-enabled tcp socket: real 1.911s	user 1.715s	sys 1.639s
I20260925 02:23:30.015582  7546 rpc-test.cc:1859] Sending 1024MB via ssl-enabled tcp socket: real 1.847s	user 1.633s	sys 1.599s
I20260925 02:23:31.793563  7546 rpc-test.cc:1859] Sending 1024MB via ssl-enabled tcp socket: real 1.778s	user 1.723s	sys 1.397s
[       OK ] Parameters/TestRpc.TestPerformanceBySocketType/SSL_TCP (9172 ms)
[----------] 20 tests from Parameters/TestRpc (29427 ms total)

[----------] 1 test from Parameters/TestRpcSocketTxRxQueue
[ RUN      ] Parameters/TestRpcSocketTxRxQueue.OverCapacity/0
W20260925 02:23:32.071044  8036 negotiation.cc:337] Failed RPC negotiation. Trace:
0925 02:23:31.807186 (+     0us) reactor.cc:625] Submitting negotiation task for client connection to 0.0.0.0:46579 (local address 127.0.0.1:44442)
0925 02:23:31.807251 (+    65us) negotiation.cc:107] Waiting for socket to connect
0925 02:23:31.807261 (+    10us) client_negotiation.cc:174] Beginning negotiation
0925 02:23:31.807316 (+    55us) client_negotiation.cc:252] Sending NEGOTIATE NegotiatePB request
0925 02:23:32.070895 (+263579us) negotiation.cc:327] Negotiation complete: Network error: Client connection negotiation failed: client connection to 0.0.0.0:46579: BlockingRecv error: recv error from unknown peer: Transport endpoint is not connected (error 107)
Metrics: {"client-negotiator.queue_time_us":35}
W20260925 02:23:32.071127  8063 negotiation.cc:337] Failed RPC negotiation. Trace:
0925 02:23:31.810375 (+     0us) reactor.cc:625] Submitting negotiation task for client connection to 0.0.0.0:46579 (local address 127.0.0.1:44472)
0925 02:23:31.810441 (+    66us) negotiation.cc:107] Waiting for socket to connect
0925 02:23:31.810451 (+    10us) client_negotiation.cc:174] Beginning negotiation
0925 02:23:31.810495 (+    44us) client_negotiation.cc:252] Sending NEGOTIATE NegotiatePB request
0925 02:23:32.071091 (+260596us) negotiation.cc:327] Negotiation complete: Network error: Client connection negotiation failed: client connection to 0.0.0.0:46579: BlockingRecv error: recv error from unknown peer: Transport endpoint is not connected (error 107)
Metrics: {"client-negotiator.queue_time_us":42}
W20260925 02:23:32.071045  8026 negotiation.cc:337] Failed RPC negotiation. Trace:
0925 02:23:31.805978 (+     0us) reactor.cc:625] Submitting negotiation task for client connection to 0.0.0.0:46579 (local address 127.0.0.1:44428)
0925 02:23:31.806062 (+    84us) negotiation.cc:107] Waiting for socket to connect
0925 02:23:31.806073 (+    11us) client_negotiation.cc:174] Beginning negotiation
0925 02:23:31.806142 (+    69us) client_negotiation.cc:252] Sending NEGOTIATE NegotiatePB request
0925 02:23:32.070927 (+264785us) negotiation.cc:327] Negotiation complete: Network error: Client connection negotiation failed: client connection to 0.0.0.0:46579: BlockingRecv error: recv error from unknown peer: Transport endpoint is not connected (error 107)
Metrics: {"client-negotiator.queue_time_us":50}
W20260925 02:23:32.071048  8045 negotiation.cc:337] Failed RPC negotiation. Trace:
0925 02:23:31.808261 (+     0us) reactor.cc:625] Submitting negotiation task for client connection to 0.0.0.0:46579 (local address 127.0.0.1:44452)
0925 02:23:31.808324 (+    63us) negotiation.cc:107] Waiting for socket to connect
0925 02:23:31.808379 (+    55us) client_negotiation.cc:174] Beginning negotiation
0925 02:23:31.808435 (+    56us) client_negotiation.cc:252] Sending NEGOTIATE NegotiatePB request
0925 02:23:32.070942 (+262507us) negotiation.cc:327] Negotiation complete: Network error: Client connection negotiation failed: client connection to 0.0.0.0:46579: BlockingRecv error: recv error from unknown peer: Transport endpoint is not connected (error 107)
Metrics: {"client-negotiator.queue_time_us":36}
W20260925 02:23:32.071331  8072 negotiation.cc:337] Failed RPC negotiation. Trace:
0925 02:23:31.811184 (+     0us) reactor.cc:625] Submitting negotiation task for client connection to 0.0.0.0:46579 (local address 127.0.0.1:44476)
0925 02:23:31.811246 (+    62us) negotiation.cc:107] Waiting for socket to connect
0925 02:23:31.811255 (+     9us) client_negotiation.cc:174] Beginning negotiation
0925 02:23:31.811298 (+    43us) client_negotiation.cc:252] Sending NEGOTIATE NegotiatePB request
0925 02:23:32.071172 (+259874us) negotiation.cc:327] Negotiation complete: Network error: Client connection negotiation failed: client connection to 0.0.0.0:46579: BlockingRecv error: recv error from unknown peer: Transport endpoint is not connected (error 107)
Metrics: {"client-negotiator.queue_time_us":38}
W20260925 02:23:32.071416  8054 negotiation.cc:337] Failed RPC negotiation. Trace:
0925 02:23:31.809287 (+     0us) reactor.cc:625] Submitting negotiation task for client connection to 0.0.0.0:46579 (local address 127.0.0.1:44456)
0925 02:23:31.809355 (+    68us) negotiation.cc:107] Waiting for socket to connect
0925 02:23:31.809365 (+    10us) client_negotiation.cc:174] Beginning negotiation
0925 02:23:31.809415 (+    50us) client_negotiation.cc:252] Sending NEGOTIATE NegotiatePB request
0925 02:23:32.070906 (+261491us) negotiation.cc:327] Negotiation complete: Network error: Client connection negotiation failed: client connection to 0.0.0.0:46579: BlockingRecv error: recv error from unknown peer: Transport endpoint is not connected (error 107)
Metrics: {"client-negotiator.queue_time_us":35}
[       OK ] Parameters/TestRpcSocketTxRxQueue.OverCapacity/0 (1052 ms)
[----------] 1 test from Parameters/TestRpcSocketTxRxQueue (1052 ms total)

[----------] Global test environment tear-down
[==========] 21 tests from 2 test suites ran. (30480 ms total)
[  PASSED  ] 20 tests.
[  FAILED  ] 1 test, listed below:
[  FAILED  ] Parameters/TestRpc.TestCallWithChainCertAndChainCA/SSL_TCP, where GetParam() = (true, false)

 1 FAILED TEST