Diagnosed failure

Parameters/TestRpc.TestCallWithChainCertAndChainCA/SSL_TCP: /data0/somelongdirectorytoavoidrpathissues/src/kudu/src/kudu/rpc/rpc-test.cc:270: Failure
Failed
Bad status: Runtime error: could not verify certificate chain (error with cert: subject=CN = localhost, ST = sadfjas, C = AS, emailAddress = sdflkdsajf, O = lskdfjlsad, OU = sldfkja, issuer=C = AS, ST = ASDfkjdhf, L = lskdjf, O = saldfja, OU = skdjf, CN = localhost, emailAddress = sadjflkadsj): : certificate has expired
Google Test trace:
/data0/somelongdirectorytoavoidrpathissues/src/kudu/src/kudu/rpc/rpc-test.cc:267: Connecting to 0.0.0.0:40367
I20260926 19:32:20.464673  6350 test_util.cc:175] -----------------------------------------------
I20260926 19:32:20.464792  6350 test_util.cc:176] Had fatal failures, leaving test files at /tmp/dist-test-taskMk05Ed/test-tmp/rpc-test.5.Parameters_TestRpc.TestCallWithChainCertAndChainCA_SSL_TCP.1790451140348365-6350-0

Full log

Note: This is test shard 6 of 8.
[==========] Running 21 tests from 2 test suites.
[----------] Global test environment set-up.
[----------] 20 tests from Parameters/TestRpc
[ RUN      ] Parameters/TestRpc.TestMessengerCreateDestroy/SSL_TCP
WARNING: Logging before InitGoogleLogging() is written to STDERR
I20260926 19:32:20.389513  6350 rpc-test.cc:169] started messenger TestCreateDestroy
[       OK ] Parameters/TestRpc.TestMessengerCreateDestroy/SSL_TCP (25 ms)
[ RUN      ] Parameters/TestRpc.TestNegotiationDeadlock/SSL_TCP
I20260926 19:32:20.414631  6370 acceptor_pool.cc:254] collecting diagnostics on the listening RPC socket 0.0.0.0:46839 every 8 connection(s)
I20260926 19:32:20.414844  6371 acceptor_pool.cc:254] collecting diagnostics on the listening RPC socket 0.0.0.0:46839 every 8 connection(s)
[       OK ] Parameters/TestRpc.TestNegotiationDeadlock/SSL_TCP (42 ms)
[ RUN      ] Parameters/TestRpc.TestCallWithChainCertAndChainCA/SSL_TCP
I20260926 19:32:20.453364  6386 acceptor_pool.cc:254] collecting diagnostics on the listening RPC socket 0.0.0.0:40367 every 8 connection(s)
I20260926 19:32:20.453617  6387 acceptor_pool.cc:254] collecting diagnostics on the listening RPC socket 0.0.0.0:40367 every 8 connection(s)
/data0/somelongdirectorytoavoidrpathissues/src/kudu/src/kudu/rpc/rpc-test.cc:270: Failure
Failed
Bad status: Runtime error: could not verify certificate chain (error with cert: subject=CN = localhost, ST = sadfjas, C = AS, emailAddress = sdflkdsajf, O = lskdfjlsad, OU = sldfkja, issuer=C = AS, ST = ASDfkjdhf, L = lskdjf, O = saldfja, OU = skdjf, CN = localhost, emailAddress = sadjflkadsj): : certificate has expired
Google Test trace:
/data0/somelongdirectorytoavoidrpathissues/src/kudu/src/kudu/rpc/rpc-test.cc:267: Connecting to 0.0.0.0:40367
I20260926 19:32:20.464673  6350 test_util.cc:175] -----------------------------------------------
I20260926 19:32:20.464792  6350 test_util.cc:176] Had fatal failures, leaving test files at /tmp/dist-test-taskMk05Ed/test-tmp/rpc-test.5.Parameters_TestRpc.TestCallWithChainCertAndChainCA_SSL_TCP.1790451140348365-6350-0
[  FAILED  ] Parameters/TestRpc.TestCallWithChainCertAndChainCA/SSL_TCP, where GetParam() = (true, false) (29 ms)
[ RUN      ] Parameters/TestRpc.TestCallWithPasswordProtectedKey/SSL_TCP
I20260926 19:32:20.474515  6411 acceptor_pool.cc:254] collecting diagnostics on the listening RPC socket 0.0.0.0:33391 every 8 connection(s)
I20260926 19:32:20.474761  6412 acceptor_pool.cc:254] collecting diagnostics on the listening RPC socket 0.0.0.0:33391 every 8 connection(s)
[       OK ] Parameters/TestRpc.TestCallWithPasswordProtectedKey/SSL_TCP (44 ms)
[ RUN      ] Parameters/TestRpc.TestCallToBadServer/SSL_TCP
I20260926 19:32:20.549935  6350 rpc-test.cc:394] Status: Network error: Client connection negotiation failed: client connection to 0.0.0.0:0: connect: Connection refused (error 111)
I20260926 19:32:20.550628  6350 rpc-test.cc:394] Status: Network error: Client connection negotiation failed: client connection to 0.0.0.0:0: connect: Connection refused (error 111)
I20260926 19:32:20.551307  6350 rpc-test.cc:394] Status: Network error: Client connection negotiation failed: client connection to 0.0.0.0:0: connect: Connection refused (error 111)
I20260926 19:32:20.551885  6350 rpc-test.cc:394] Status: Network error: Client connection negotiation failed: client connection to 0.0.0.0:0: connect: Connection refused (error 111)
I20260926 19:32:20.552409  6350 rpc-test.cc:394] Status: Network error: Client connection negotiation failed: client connection to 0.0.0.0:0: connect: Connection refused (error 111)
[       OK ] Parameters/TestRpc.TestCallToBadServer/SSL_TCP (44 ms)
[ RUN      ] Parameters/TestRpc.TestWrongService/SSL_TCP
I20260926 19:32:20.573652  6446 acceptor_pool.cc:254] collecting diagnostics on the listening RPC socket 0.0.0.0:36681 every 8 connection(s)
I20260926 19:32:20.573927  6447 acceptor_pool.cc:254] collecting diagnostics on the listening RPC socket 0.0.0.0:36681 every 8 connection(s)
I20260926 19:32:20.604327  6443 messenger.cc:345] service WrongServiceName not registered on TestServer
[       OK ] Parameters/TestRpc.TestWrongService/SSL_TCP (54 ms)
[ RUN      ] Parameters/TestRpc.TestConnectionKeepalive/SSL_TCP
I20260926 19:32:20.623399  6469 acceptor_pool.cc:254] collecting diagnostics on the listening RPC socket 0.0.0.0:32911 every 8 connection(s)
I20260926 19:32:20.623631  6470 acceptor_pool.cc:254] collecting diagnostics on the listening RPC socket 0.0.0.0:32911 every 8 connection(s)
I20260926 19:32:20.624611  6350 rpc-test.cc:488] Connecting to 0.0.0.0:32911
[       OK ] Parameters/TestRpc.TestConnectionKeepalive/SSL_TCP (1043 ms)
[ RUN      ] Parameters/TestRpc.TestClientConnectionMetrics/SSL_TCP
I20260926 19:32:21.671572  6494 acceptor_pool.cc:254] collecting diagnostics on the listening RPC socket 0.0.0.0:45395 every 8 connection(s)
I20260926 19:32:21.671832  6495 acceptor_pool.cc:254] collecting diagnostics on the listening RPC socket 0.0.0.0:45395 every 8 connection(s)
I20260926 19:32:21.672827  6350 rpc-test.cc:569] Connecting to 0.0.0.0:45395
[       OK ] Parameters/TestRpc.TestClientConnectionMetrics/SSL_TCP (19408 ms)
[ RUN      ] Parameters/TestRpc.TestCredentialsPolicy/SSL_TCP
I20260926 19:32:41.081820  6517 acceptor_pool.cc:254] collecting diagnostics on the listening RPC socket 0.0.0.0:46005 every 8 connection(s)
I20260926 19:32:41.082058  6518 acceptor_pool.cc:254] collecting diagnostics on the listening RPC socket 0.0.0.0:46005 every 8 connection(s)
I20260926 19:32:41.083030  6350 rpc-test.cc:700] Connecting to 0.0.0.0:46005
[       OK ] Parameters/TestRpc.TestCredentialsPolicy/SSL_TCP (58 ms)
[ RUN      ] Parameters/TestRpc.TestCallLongerThanKeepalive/SSL_TCP
I20260926 19:32:41.139866  6542 acceptor_pool.cc:254] collecting diagnostics on the listening RPC socket 0.0.0.0:35775 every 8 connection(s)
I20260926 19:32:41.140089  6543 acceptor_pool.cc:254] collecting diagnostics on the listening RPC socket 0.0.0.0:35775 every 8 connection(s)
I20260926 19:32:41.173306  6546 rpc-test-base.h:222] got call: sleep_micros: 3000000 deferred: true
I20260926 19:32:44.174997  6546 rpcz_store.cc:275] Call kudu.rpc.GenericCalculatorService.Sleep from 127.0.0.1:34410 (request call id 0) took 3001 ms. Trace:
I20260926 19:32:44.175158  6546 rpcz_store.cc:276] 0926 19:32:41.173204 (+     0us) service_pool.cc:170] Inserting onto call queue
0926 19:32:41.173263 (+    59us) service_pool.cc:227] Handling call
0926 19:32:44.174949 (+3001686us) inbound_call.cc:173] Queueing success response
Metrics: {}
[       OK ] Parameters/TestRpc.TestCallLongerThanKeepalive/SSL_TCP (3060 ms)
[ RUN      ] Parameters/TestRpc.TestRpcSidecar/SSL_TCP
I20260926 19:32:44.205473  6567 acceptor_pool.cc:254] collecting diagnostics on the listening RPC socket 0.0.0.0:42529 every 8 connection(s)
I20260926 19:32:44.205708  6568 acceptor_pool.cc:254] collecting diagnostics on the listening RPC socket 0.0.0.0:42529 every 8 connection(s)
[       OK ] Parameters/TestRpc.TestRpcSidecar/SSL_TCP (112 ms)
[ RUN      ] Parameters/TestRpc.TestRpcSidecarLimits/SSL_TCP
I20260926 19:32:46.305359  6592 acceptor_pool.cc:254] collecting diagnostics on the listening RPC socket 0.0.0.0:38959 every 8 connection(s)
I20260926 19:32:46.305665  6593 acceptor_pool.cc:254] collecting diagnostics on the listening RPC socket 0.0.0.0:38959 every 8 connection(s)
W20260926 19:32:46.342880  6350 serialization.cc:72] Serialized kudu.rpc_test.PushStringsRequestPB (2147483654 bytes) is larger than the maximum configured RPC message size (52428800 bytes). Sending anyway, but peer may reject the data.
W20260926 19:32:46.349547  6590 connection.cc:535] server connection from 127.0.0.1:50850 recv error: Network error: RPC frame had a length of 2147483714, but we only support messages up to 52428800 bytes long.
W20260926 19:32:46.349658  6590 connection.cc:158] shutting down server connection from 127.0.0.1:50850 with pending inbound data: 4/2147483714 bytes received; last active 0 ns ago: status Network error: RPC frame had a length of 2147483714, but we only support messages up to 52428800 bytes long.
W20260926 19:32:46.350126  6605 connection.cc:196] Error closing socket: Network error: TlsSocket::Close: Connection reset by peer
I20260926 19:32:46.360376  6617 acceptor_pool.cc:254] collecting diagnostics on the listening RPC socket 0.0.0.0:45461 every 8 connection(s)
I20260926 19:32:46.360536  6618 acceptor_pool.cc:254] collecting diagnostics on the listening RPC socket 0.0.0.0:45461 every 8 connection(s)
W20260926 19:32:51.447851  6615 connection.cc:577] server connection from 127.0.0.1:39450: received bad data: 'Corruption: Invalid packet: message had a length of 2147483710, but we only support messages up to 2147483647 bytes
'
[       OK ] Parameters/TestRpc.TestRpcSidecarLimits/SSL_TCP (7620 ms)
[ RUN      ] Parameters/TestRpc.TestCallTimeoutDoesntAffectNegotiation/SSL_TCP
I20260926 19:32:51.939313  6642 acceptor_pool.cc:254] collecting diagnostics on the listening RPC socket 0.0.0.0:33813 every 8 connection(s)
I20260926 19:32:51.939592  6643 acceptor_pool.cc:254] collecting diagnostics on the listening RPC socket 0.0.0.0:33813 every 8 connection(s)
W20260926 19:32:51.956346  6638 negotiation.cc:266] Injecting 500ms delay in negotiation
I20260926 19:32:52.006827  6350 rpc-test-base.h:595] status: Timed out: connection negotiation to 0.0.0.0:33813 for RPC Sleep timed out after 0.050s (ON_OUTBOUND_QUEUE), seconds elapsed: 0.0511526
[       OK ] Parameters/TestRpc.TestCallTimeoutDoesntAffectNegotiation/SSL_TCP (553 ms)
[ RUN      ] Parameters/TestRpc.TestRpcHandlerLatencyMetric/SSL_TCP
I20260926 19:32:52.484244  6667 acceptor_pool.cc:254] collecting diagnostics on the listening RPC socket 0.0.0.0:39789 every 8 connection(s)
I20260926 19:32:52.484462  6668 acceptor_pool.cc:254] collecting diagnostics on the listening RPC socket 0.0.0.0:39789 every 8 connection(s)
I20260926 19:32:52.522629  6350 rpc-test.cc:1236] Sleep() min lat: 20545
I20260926 19:32:52.522727  6350 rpc-test.cc:1237] Sleep() mean lat: 20545
I20260926 19:32:52.522781  6350 rpc-test.cc:1238] Sleep() max lat: 20545
I20260926 19:32:52.522819  6350 rpc-test.cc:1239] Sleep() #calls: 1
[       OK ] Parameters/TestRpc.TestRpcHandlerLatencyMetric/SSL_TCP (60 ms)
[ RUN      ] Parameters/TestRpc.TimedOutOnResponseMetricServiceQueue/SSL_TCP
I20260926 19:32:52.551110  6693 acceptor_pool.cc:254] collecting diagnostics on the listening RPC socket 0.0.0.0:37613 every 8 connection(s)
I20260926 19:32:52.551431  6694 acceptor_pool.cc:254] collecting diagnostics on the listening RPC socket 0.0.0.0:37613 every 8 connection(s)
W20260926 19:32:52.610242  6695 rpcz_store.cc:267] Call kudu.rpc_test.CalculatorService.Sleep from 127.0.0.1:40574 (request call id 2) took 20 ms (client timeout 20 ms). Trace:
W20260926 19:32:52.610459  6695 rpcz_store.cc:269] 0926 19:32:52.589836 (+     0us) service_pool.cc:170] Inserting onto call queue
0926 19:32:52.610135 (+ 20299us) service_pool.cc:214] Skipping call since client already timed out
0926 19:32:52.610186 (+    51us) inbound_call.cc:173] Queueing failure response
Metrics: {}
[       OK ] Parameters/TestRpc.TimedOutOnResponseMetricServiceQueue/SSL_TCP (87 ms)
[ RUN      ] Parameters/TestRpc.RpcPendingConnectionsMetric/SSL_TCP
I20260926 19:32:52.619599  6716 acceptor_pool.cc:254] collecting diagnostics on the listening RPC socket 0.0.0.0:35031 every 8 connection(s)
I20260926 19:32:52.619840  6717 acceptor_pool.cc:254] collecting diagnostics on the listening RPC socket 0.0.0.0:35031 every 8 connection(s)
W20260926 19:32:52.621728  6712 negotiation.cc:337] Failed RPC negotiation. Trace:
0926 19:32:52.621150 (+     0us) reactor.cc:625] Submitting negotiation task for server connection from 127.0.0.1:58024 (local address 127.0.0.1:35031)
0926 19:32:52.621294 (+   144us) server_negotiation.cc:206] Beginning negotiation
0926 19:32:52.621298 (+     4us) server_negotiation.cc:399] Waiting for connection header
0926 19:32:52.621429 (+   131us) negotiation.cc:327] Negotiation complete: Network error: Server connection negotiation failed: server connection from 127.0.0.1:58024: BlockingRecv error: recv got EOF from 127.0.0.1:58024 (error 108)
Metrics: {"server-negotiator.queue_time_us":47}
[       OK ] Parameters/TestRpc.RpcPendingConnectionsMetric/SSL_TCP (19 ms)
[ RUN      ] Parameters/TestRpc.TestRpcContextClientDeadline/SSL_TCP
I20260926 19:32:52.650445  6732 acceptor_pool.cc:254] collecting diagnostics on the listening RPC socket 0.0.0.0:45445 every 8 connection(s)
I20260926 19:32:52.650676  6733 acceptor_pool.cc:254] collecting diagnostics on the listening RPC socket 0.0.0.0:45445 every 8 connection(s)
[       OK ] Parameters/TestRpc.TestRpcContextClientDeadline/SSL_TCP (61 ms)
[ RUN      ] Parameters/TestRpc.TestApplicationFeatureFlagUnsupportedServer/SSL_TCP
I20260926 19:32:52.727810  6757 acceptor_pool.cc:254] collecting diagnostics on the listening RPC socket 0.0.0.0:43417 every 8 connection(s)
I20260926 19:32:52.728052  6758 acceptor_pool.cc:254] collecting diagnostics on the listening RPC socket 0.0.0.0:43417 every 8 connection(s)
[       OK ] Parameters/TestRpc.TestApplicationFeatureFlagUnsupportedServer/SSL_TCP (59 ms)
[ RUN      ] Parameters/TestRpc.TestCancellationAsync/SSL_TCP
I20260926 19:32:52.784320  6782 acceptor_pool.cc:254] collecting diagnostics on the listening RPC socket 0.0.0.0:40793 every 8 connection(s)
I20260926 19:32:52.784574  6783 acceptor_pool.cc:254] collecting diagnostics on the listening RPC socket 0.0.0.0:40793 every 8 connection(s)
I20260926 19:32:52.785449  6350 rpc-test.cc:1716] Connecting to 0.0.0.0:40793
I20260926 19:32:52.798637  6350 test_util.cc:268] Using random seed: -433819501
I20260926 19:32:52.832019  6786 rpc-test-base.h:240] got call: sleep_micros: 500 pattern: 4294967295 num_repetitions: 2097152 sidecar_idx: 0
I20260926 19:32:52.850839  6785 rpc-test-base.h:240] got call: sleep_micros: 500 pattern: 4294967295 num_repetitions: 2097152 sidecar_idx: 0
I20260926 19:32:52.875712  6784 rpc-test-base.h:240] got call: sleep_micros: 500 pattern: 4294967295 num_repetitions: 2097152 sidecar_idx: 0
I20260926 19:32:52.915635  6785 rpc-test-base.h:240] got call: sleep_micros: 500 pattern: 4294967295 num_repetitions: 2097152 sidecar_idx: 0
I20260926 19:32:52.948448  6784 rpc-test-base.h:240] got call: sleep_micros: 500 pattern: 4294967295 num_repetitions: 2097152 sidecar_idx: 0
I20260926 19:32:52.980451  6785 rpc-test-base.h:240] got call: sleep_micros: 500 pattern: 4294967295 num_repetitions: 2097152 sidecar_idx: 0
W20260926 19:32:53.009231  6780 connection.cc:196] Error closing socket: Network error: TlsSocket::Close: Broken pipe
W20260926 19:32:53.021127  6780 connection.cc:441] server connection from 127.0.0.1:34518 torn down before Call kudu.rpc.GenericCalculatorService.SleepWithSidecar from 127.0.0.1:34518 (request call id 8) could send its response
[       OK ] Parameters/TestRpc.TestCancellationAsync/SSL_TCP (268 ms)
[ RUN      ] Parameters/TestRpc.TestPerformanceBySocketType/SSL_TCP
I20260926 19:32:53.043735  6807 acceptor_pool.cc:254] collecting diagnostics on the listening RPC socket 0.0.0.0:34501 every 8 connection(s)
I20260926 19:32:53.043979  6808 acceptor_pool.cc:254] collecting diagnostics on the listening RPC socket 0.0.0.0:34501 every 8 connection(s)
I20260926 19:32:53.044862  6350 rpc-test.cc:1846] Connecting to 0.0.0.0:34501
I20260926 19:32:55.872619  6350 rpc-test.cc:1859] Sending 1024MB via ssl-enabled tcp socket: real 2.788s	user 2.543s	sys 2.101s
I20260926 19:32:58.686005  6350 rpc-test.cc:1859] Sending 1024MB via ssl-enabled tcp socket: real 2.813s	user 2.507s	sys 2.154s
I20260926 19:33:01.428390  6350 rpc-test.cc:1859] Sending 1024MB via ssl-enabled tcp socket: real 2.742s	user 2.408s	sys 2.131s
I20260926 19:33:04.190112  6350 rpc-test.cc:1859] Sending 1024MB via ssl-enabled tcp socket: real 2.762s	user 2.438s	sys 2.130s
I20260926 19:33:07.002481  6350 rpc-test.cc:1859] Sending 1024MB via ssl-enabled tcp socket: real 2.812s	user 2.577s	sys 2.083s
[       OK ] Parameters/TestRpc.TestPerformanceBySocketType/SSL_TCP (13987 ms)
[----------] 20 tests from Parameters/TestRpc (46644 ms total)

[----------] 1 test from Parameters/TestRpcSocketTxRxQueue
[ RUN      ] Parameters/TestRpcSocketTxRxQueue.OverCapacity/0
W20260926 19:33:07.305917  6824 negotiation.cc:337] Failed RPC negotiation. Trace:
0926 19:33:07.016216 (+     0us) reactor.cc:625] Submitting negotiation task for client connection to 0.0.0.0:40077 (local address 127.0.0.1:44498)
0926 19:33:07.016387 (+   171us) negotiation.cc:107] Waiting for socket to connect
0926 19:33:07.016412 (+    25us) client_negotiation.cc:174] Beginning negotiation
0926 19:33:07.016514 (+   102us) client_negotiation.cc:252] Sending NEGOTIATE NegotiatePB request
0926 19:33:07.305528 (+289014us) negotiation.cc:327] Negotiation complete: Network error: Client connection negotiation failed: client connection to 0.0.0.0:40077: BlockingRecv error: recv error from unknown peer: Transport endpoint is not connected (error 107)
Metrics: {"client-negotiator.queue_time_us":51}
W20260926 19:33:07.307103  6851 negotiation.cc:337] Failed RPC negotiation. Trace:
0926 19:33:07.023369 (+     0us) reactor.cc:625] Submitting negotiation task for client connection to 0.0.0.0:40077 (local address 127.0.0.1:44506)
0926 19:33:07.023525 (+   156us) negotiation.cc:107] Waiting for socket to connect
0926 19:33:07.023543 (+    18us) client_negotiation.cc:174] Beginning negotiation
0926 19:33:07.023644 (+   101us) client_negotiation.cc:252] Sending NEGOTIATE NegotiatePB request
0926 19:33:07.305502 (+281858us) negotiation.cc:327] Negotiation complete: Network error: Client connection negotiation failed: client connection to 0.0.0.0:40077: BlockingRecv error: recv error from unknown peer: Transport endpoint is not connected (error 107)
Metrics: {"client-negotiator.queue_time_us":32}
W20260926 19:33:07.307173  6833 negotiation.cc:337] Failed RPC negotiation. Trace:
0926 19:33:07.018501 (+     0us) reactor.cc:625] Submitting negotiation task for client connection to 0.0.0.0:40077 (local address 127.0.0.1:44500)
0926 19:33:07.018669 (+   168us) negotiation.cc:107] Waiting for socket to connect
0926 19:33:07.018684 (+    15us) client_negotiation.cc:174] Beginning negotiation
0926 19:33:07.018779 (+    95us) client_negotiation.cc:252] Sending NEGOTIATE NegotiatePB request
0926 19:33:07.305626 (+286847us) negotiation.cc:327] Negotiation complete: Network error: Client connection negotiation failed: client connection to 0.0.0.0:40077: BlockingRecv error: recv error from unknown peer: Transport endpoint is not connected (error 107)
Metrics: {"client-negotiator.queue_time_us":54}
W20260926 19:33:07.308096  6842 negotiation.cc:337] Failed RPC negotiation. Trace:
0926 19:33:07.020787 (+     0us) reactor.cc:625] Submitting negotiation task for client connection to 0.0.0.0:40077 (local address 127.0.0.1:44502)
0926 19:33:07.020949 (+   162us) negotiation.cc:107] Waiting for socket to connect
0926 19:33:07.020968 (+    19us) client_negotiation.cc:174] Beginning negotiation
0926 19:33:07.021054 (+    86us) client_negotiation.cc:252] Sending NEGOTIATE NegotiatePB request
0926 19:33:07.305502 (+284448us) negotiation.cc:327] Negotiation complete: Network error: Client connection negotiation failed: client connection to 0.0.0.0:40077: BlockingRecv error: recv error from unknown peer: Transport endpoint is not connected (error 107)
Metrics: {"client-negotiator.queue_time_us":52}
W20260926 19:33:07.309716  6869 negotiation.cc:337] Failed RPC negotiation. Trace:
0926 19:33:07.028542 (+     0us) reactor.cc:625] Submitting negotiation task for client connection to 0.0.0.0:40077 (local address 127.0.0.1:44532)
0926 19:33:07.028711 (+   169us) negotiation.cc:107] Waiting for socket to connect
0926 19:33:07.028728 (+    17us) client_negotiation.cc:174] Beginning negotiation
0926 19:33:07.028805 (+    77us) client_negotiation.cc:252] Sending NEGOTIATE NegotiatePB request
0926 19:33:07.305849 (+277044us) negotiation.cc:327] Negotiation complete: Network error: Client connection negotiation failed: client connection to 0.0.0.0:40077: BlockingRecv error: recv error from unknown peer: Transport endpoint is not connected (error 107)
Metrics: {"client-negotiator.queue_time_us":50}
W20260926 19:33:07.311111  6860 negotiation.cc:337] Failed RPC negotiation. Trace:
0926 19:33:07.025813 (+     0us) reactor.cc:625] Submitting negotiation task for client connection to 0.0.0.0:40077 (local address 127.0.0.1:44522)
0926 19:33:07.026011 (+   198us) negotiation.cc:107] Waiting for socket to connect
0926 19:33:07.026029 (+    18us) client_negotiation.cc:174] Beginning negotiation
0926 19:33:07.026124 (+    95us) client_negotiation.cc:252] Sending NEGOTIATE NegotiatePB request
0926 19:33:07.305913 (+279789us) negotiation.cc:327] Negotiation complete: Network error: Client connection negotiation failed: client connection to 0.0.0.0:40077: BlockingRecv error: recv error from unknown peer: Transport endpoint is not connected (error 107)
Metrics: {"client-negotiator.queue_time_us":49}
[       OK ] Parameters/TestRpcSocketTxRxQueue.OverCapacity/0 (1068 ms)
[----------] 1 test from Parameters/TestRpcSocketTxRxQueue (1068 ms total)

[----------] Global test environment tear-down
[==========] 21 tests from 2 test suites ran. (47713 ms total)
[  PASSED  ] 20 tests.
[  FAILED  ] 1 test, listed below:
[  FAILED  ] Parameters/TestRpc.TestCallWithChainCertAndChainCA/SSL_TCP, where GetParam() = (true, false)

 1 FAILED TEST