Diagnosed failure

Parameters/TestRpc.TestCallWithChainCertAndChainCA/SSL_UnixSocket: /data0/somelongdirectorytoavoidrpathissues/src/kudu/src/kudu/rpc/rpc-test.cc:270: Failure
Failed
Bad status: Runtime error: could not verify certificate chain (error with cert: subject=CN = localhost, ST = sadfjas, C = AS, emailAddress = sdflkdsajf, O = lskdfjlsad, OU = sldfkja, issuer=C = AS, ST = ASDfkjdhf, L = lskdjf, O = saldfja, OU = skdjf, CN = localhost, emailAddress = sadjflkadsj): : certificate has expired
Google Test trace:
/data0/somelongdirectorytoavoidrpathissues/src/kudu/src/kudu/rpc/rpc-test.cc:267: Connecting to unix:/tmp/dist-test-taskAmevhA/test-tmp/rpc-test-6edb5f559c0b45e99e611f6b555fac64.sock
I20260925 02:23:05.507275 14345 test_util.cc:175] -----------------------------------------------
I20260925 02:23:05.507325 14345 test_util.cc:176] Had fatal failures, leaving test files at /tmp/dist-test-taskAmevhA/test-tmp/rpc-test.6.Parameters_TestRpc.TestCallWithChainCertAndChainCA_SSL_UnixSocket.1790302985440686-14345-0

Full log

Note: This is test shard 7 of 8.
[==========] Running 21 tests from 2 test suites.
[----------] Global test environment set-up.
[----------] 20 tests from Parameters/TestRpc
[ RUN      ] Parameters/TestRpc.TestMessengerCreateDestroy/SSL_UnixSocket
WARNING: Logging before InitGoogleLogging() is written to STDERR
I20260925 02:23:05.466960 14345 rpc-test.cc:169] started messenger TestCreateDestroy
[       OK ] Parameters/TestRpc.TestMessengerCreateDestroy/SSL_UnixSocket (24 ms)
[ RUN      ] Parameters/TestRpc.TestNegotiationDeadlock/SSL_UnixSocket
I20260925 02:23:05.480842 14365 acceptor_pool.cc:254] collecting diagnostics on the listening RPC socket unix:/tmp/dist-test-taskAmevhA/test-tmp/rpc-test-fd86bd614ac1496dac8db19441634d47.sock every 8 connection(s)
I20260925 02:23:05.480873 14366 acceptor_pool.cc:254] collecting diagnostics on the listening RPC socket unix:/tmp/dist-test-taskAmevhA/test-tmp/rpc-test-fd86bd614ac1496dac8db19441634d47.sock every 8 connection(s)
[       OK ] Parameters/TestRpc.TestNegotiationDeadlock/SSL_UnixSocket (19 ms)
[ RUN      ] Parameters/TestRpc.TestCallWithChainCertAndChainCA/SSL_UnixSocket
I20260925 02:23:05.503165 14382 acceptor_pool.cc:254] collecting diagnostics on the listening RPC socket unix:/tmp/dist-test-taskAmevhA/test-tmp/rpc-test-6edb5f559c0b45e99e611f6b555fac64.sock every 8 connection(s)
I20260925 02:23:05.503165 14381 acceptor_pool.cc:254] collecting diagnostics on the listening RPC socket unix:/tmp/dist-test-taskAmevhA/test-tmp/rpc-test-6edb5f559c0b45e99e611f6b555fac64.sock every 8 connection(s)
/data0/somelongdirectorytoavoidrpathissues/src/kudu/src/kudu/rpc/rpc-test.cc:270: Failure
Failed
Bad status: Runtime error: could not verify certificate chain (error with cert: subject=CN = localhost, ST = sadfjas, C = AS, emailAddress = sdflkdsajf, O = lskdfjlsad, OU = sldfkja, issuer=C = AS, ST = ASDfkjdhf, L = lskdjf, O = saldfja, OU = skdjf, CN = localhost, emailAddress = sadjflkadsj): : certificate has expired
Google Test trace:
/data0/somelongdirectorytoavoidrpathissues/src/kudu/src/kudu/rpc/rpc-test.cc:267: Connecting to unix:/tmp/dist-test-taskAmevhA/test-tmp/rpc-test-6edb5f559c0b45e99e611f6b555fac64.sock
I20260925 02:23:05.507275 14345 test_util.cc:175] -----------------------------------------------
I20260925 02:23:05.507325 14345 test_util.cc:176] Had fatal failures, leaving test files at /tmp/dist-test-taskAmevhA/test-tmp/rpc-test.6.Parameters_TestRpc.TestCallWithChainCertAndChainCA_SSL_UnixSocket.1790302985440686-14345-0
[  FAILED  ] Parameters/TestRpc.TestCallWithChainCertAndChainCA/SSL_UnixSocket, where GetParam() = (true, true) (20 ms)
[ RUN      ] Parameters/TestRpc.TestCallWithPasswordProtectedKey/SSL_UnixSocket
I20260925 02:23:05.517843 14406 acceptor_pool.cc:254] collecting diagnostics on the listening RPC socket unix:/tmp/dist-test-taskAmevhA/test-tmp/rpc-test-58da70270bda4d4999d1dcf75c1813b0.sock every 8 connection(s)
I20260925 02:23:05.517884 14407 acceptor_pool.cc:254] collecting diagnostics on the listening RPC socket unix:/tmp/dist-test-taskAmevhA/test-tmp/rpc-test-58da70270bda4d4999d1dcf75c1813b0.sock every 8 connection(s)
W20260925 02:23:05.528622 14403 connection.cc:196] Error closing socket: Network error: TlsSocket::Close: Broken pipe
[       OK ] Parameters/TestRpc.TestCallWithPasswordProtectedKey/SSL_UnixSocket (22 ms)
[ RUN      ] Parameters/TestRpc.TestCallToBadServer/SSL_UnixSocket
I20260925 02:23:05.542024 14345 rpc-test.cc:394] Status: Network error: Client connection negotiation failed: client connection to 0.0.0.0:0: connect: Connection refused (error 111)
I20260925 02:23:05.542335 14345 rpc-test.cc:394] Status: Network error: Client connection negotiation failed: client connection to 0.0.0.0:0: connect: Connection refused (error 111)
I20260925 02:23:05.542634 14345 rpc-test.cc:394] Status: Network error: Client connection negotiation failed: client connection to 0.0.0.0:0: connect: Connection refused (error 111)
I20260925 02:23:05.542881 14345 rpc-test.cc:394] Status: Network error: Client connection negotiation failed: client connection to 0.0.0.0:0: connect: Connection refused (error 111)
I20260925 02:23:05.543161 14345 rpc-test.cc:394] Status: Network error: Client connection negotiation failed: client connection to 0.0.0.0:0: connect: Connection refused (error 111)
[       OK ] Parameters/TestRpc.TestCallToBadServer/SSL_UnixSocket (13 ms)
[ RUN      ] Parameters/TestRpc.TestWrongService/SSL_UnixSocket
I20260925 02:23:05.571204 14441 acceptor_pool.cc:254] collecting diagnostics on the listening RPC socket unix:/tmp/dist-test-taskAmevhA/test-tmp/rpc-test-32746312ee5541ea94eed0edaef612c3.sock every 8 connection(s)
I20260925 02:23:05.571229 14442 acceptor_pool.cc:254] collecting diagnostics on the listening RPC socket unix:/tmp/dist-test-taskAmevhA/test-tmp/rpc-test-32746312ee5541ea94eed0edaef612c3.sock every 8 connection(s)
I20260925 02:23:05.585111 14438 messenger.cc:345] service WrongServiceName not registered on TestServer
W20260925 02:23:05.585760 14438 connection.cc:196] Error closing socket: Network error: TlsSocket::Close: Broken pipe
[       OK ] Parameters/TestRpc.TestWrongService/SSL_UnixSocket (43 ms)
[ RUN      ] Parameters/TestRpc.TestConnectionKeepalive/SSL_UnixSocket
I20260925 02:23:05.591570 14464 acceptor_pool.cc:254] collecting diagnostics on the listening RPC socket unix:/tmp/dist-test-taskAmevhA/test-tmp/rpc-test-80484530d36d439884b541c1a19b9ed2.sock every 8 connection(s)
I20260925 02:23:05.591637 14465 acceptor_pool.cc:254] collecting diagnostics on the listening RPC socket unix:/tmp/dist-test-taskAmevhA/test-tmp/rpc-test-80484530d36d439884b541c1a19b9ed2.sock every 8 connection(s)
I20260925 02:23:05.591796 14345 rpc-test.cc:488] Connecting to unix:/tmp/dist-test-taskAmevhA/test-tmp/rpc-test-80484530d36d439884b541c1a19b9ed2.sock
W20260925 02:23:06.088505 14477 connection.cc:196] Error closing socket: Network error: TlsSocket::Close: Broken pipe
[       OK ] Parameters/TestRpc.TestConnectionKeepalive/SSL_UnixSocket (1027 ms)
[ RUN      ] Parameters/TestRpc.TestClientConnectionMetrics/SSL_UnixSocket
I20260925 02:23:06.637925 14489 acceptor_pool.cc:254] collecting diagnostics on the listening RPC socket unix:/tmp/dist-test-taskAmevhA/test-tmp/rpc-test-7eb026a9dd2b4297aa42a6542d86e71c.sock every 8 connection(s)
I20260925 02:23:06.637980 14490 acceptor_pool.cc:254] collecting diagnostics on the listening RPC socket unix:/tmp/dist-test-taskAmevhA/test-tmp/rpc-test-7eb026a9dd2b4297aa42a6542d86e71c.sock every 8 connection(s)
I20260925 02:23:06.638144 14345 rpc-test.cc:569] Connecting to unix:/tmp/dist-test-taskAmevhA/test-tmp/rpc-test-7eb026a9dd2b4297aa42a6542d86e71c.sock
W20260925 02:23:15.192811 14486 connection.cc:196] Error closing socket: Network error: TlsSocket::Close: Broken pipe
[       OK ] Parameters/TestRpc.TestClientConnectionMetrics/SSL_UnixSocket (8580 ms)
[ RUN      ] Parameters/TestRpc.TestCredentialsPolicy/SSL_UnixSocket
I20260925 02:23:15.217983 14512 acceptor_pool.cc:254] collecting diagnostics on the listening RPC socket unix:/tmp/dist-test-taskAmevhA/test-tmp/rpc-test-d22b14a010ed49938bebd72ab00547b5.sock every 8 connection(s)
I20260925 02:23:15.218029 14513 acceptor_pool.cc:254] collecting diagnostics on the listening RPC socket unix:/tmp/dist-test-taskAmevhA/test-tmp/rpc-test-d22b14a010ed49938bebd72ab00547b5.sock every 8 connection(s)
I20260925 02:23:15.218196 14345 rpc-test.cc:700] Connecting to unix:/tmp/dist-test-taskAmevhA/test-tmp/rpc-test-d22b14a010ed49938bebd72ab00547b5.sock
W20260925 02:23:15.242630 14511 connection.cc:196] Error closing socket: Network error: TlsSocket::Close: Broken pipe
[       OK ] Parameters/TestRpc.TestCredentialsPolicy/SSL_UnixSocket (52 ms)
[ RUN      ] Parameters/TestRpc.TestCallLongerThanKeepalive/SSL_UnixSocket
I20260925 02:23:15.256253 14537 acceptor_pool.cc:254] collecting diagnostics on the listening RPC socket unix:/tmp/dist-test-taskAmevhA/test-tmp/rpc-test-dd084c866d0a4967967387a4d0918f6c.sock every 8 connection(s)
I20260925 02:23:15.256280 14538 acceptor_pool.cc:254] collecting diagnostics on the listening RPC socket unix:/tmp/dist-test-taskAmevhA/test-tmp/rpc-test-dd084c866d0a4967967387a4d0918f6c.sock every 8 connection(s)
I20260925 02:23:15.290045 14541 rpc-test-base.h:222] got call: sleep_micros: 3000000 deferred: true
I20260925 02:23:18.290706 14541 rpcz_store.cc:275] Call kudu.rpc.GenericCalculatorService.Sleep from unix:<unnamed> (request call id 0) took 3000 ms. Trace:
I20260925 02:23:18.290808 14541 rpcz_store.cc:276] 0925 02:23:15.289991 (+     0us) service_pool.cc:170] Inserting onto call queue
0925 02:23:15.290028 (+    37us) service_pool.cc:227] Handling call
0925 02:23:18.290689 (+3000661us) inbound_call.cc:173] Queueing success response
Metrics: {}
W20260925 02:23:18.291754 14534 connection.cc:196] Error closing socket: Network error: TlsSocket::Close: Broken pipe
[       OK ] Parameters/TestRpc.TestCallLongerThanKeepalive/SSL_UnixSocket (3045 ms)
[ RUN      ] Parameters/TestRpc.TestRpcSidecar/SSL_UnixSocket
I20260925 02:23:18.332114 14562 acceptor_pool.cc:254] collecting diagnostics on the listening RPC socket unix:/tmp/dist-test-taskAmevhA/test-tmp/rpc-test-16a113f3ae6344f89fa161f2323da52d.sock every 8 connection(s)
I20260925 02:23:18.332142 14563 acceptor_pool.cc:254] collecting diagnostics on the listening RPC socket unix:/tmp/dist-test-taskAmevhA/test-tmp/rpc-test-16a113f3ae6344f89fa161f2323da52d.sock every 8 connection(s)
W20260925 02:23:18.369882 14559 connection.cc:196] Error closing socket: Network error: TlsSocket::Close: Broken pipe
[       OK ] Parameters/TestRpc.TestRpcSidecar/SSL_UnixSocket (78 ms)
[ RUN      ] Parameters/TestRpc.TestRpcSidecarLimits/SSL_UnixSocket
I20260925 02:23:20.027942 14587 acceptor_pool.cc:254] collecting diagnostics on the listening RPC socket unix:/tmp/dist-test-taskAmevhA/test-tmp/rpc-test-50dbd02d83ea4cfa9ac45d3f9c0e06b6.sock every 8 connection(s)
I20260925 02:23:20.028003 14588 acceptor_pool.cc:254] collecting diagnostics on the listening RPC socket unix:/tmp/dist-test-taskAmevhA/test-tmp/rpc-test-50dbd02d83ea4cfa9ac45d3f9c0e06b6.sock every 8 connection(s)
W20260925 02:23:20.045667 14345 serialization.cc:72] Serialized kudu.rpc_test.PushStringsRequestPB (2147483654 bytes) is larger than the maximum configured RPC message size (52428800 bytes). Sending anyway, but peer may reject the data.
W20260925 02:23:20.049084 14584 connection.cc:535] server connection from unix:<unnamed> recv error: Network error: RPC frame had a length of 2147483714, but we only support messages up to 52428800 bytes long.
W20260925 02:23:20.049147 14584 connection.cc:158] shutting down server connection from unix:<unnamed> with pending inbound data: 4/2147483714 bytes received; last active 0 ns ago: status Network error: RPC frame had a length of 2147483714, but we only support messages up to 52428800 bytes long.
W20260925 02:23:20.049275 14600 connection.cc:698] client connection to unix:/tmp/dist-test-taskAmevhA/test-tmp/rpc-test-50dbd02d83ea4cfa9ac45d3f9c0e06b6.sock send error: Network error: failed to write to TLS socket: Broken pipe
W20260925 02:23:20.049434 14600 connection.cc:196] Error closing socket: Network error: TlsSocket::Close: Success
I20260925 02:23:20.063140 14612 acceptor_pool.cc:254] collecting diagnostics on the listening RPC socket unix:/tmp/dist-test-taskAmevhA/test-tmp/rpc-test-50dbd02d83ea4cfa9ac45d3f9c0e06b6.sock every 8 connection(s)
I20260925 02:23:20.063221 14613 acceptor_pool.cc:254] collecting diagnostics on the listening RPC socket unix:/tmp/dist-test-taskAmevhA/test-tmp/rpc-test-50dbd02d83ea4cfa9ac45d3f9c0e06b6.sock every 8 connection(s)
W20260925 02:23:24.310009 14609 connection.cc:577] server connection from unix:<unnamed>: received bad data: 'Corruption: Invalid packet: message had a length of 2147483710, but we only support messages up to 2147483647 bytes
'
W20260925 02:23:24.310379 14625 connection.cc:196] Error closing socket: Network error: TlsSocket::Close: Broken pipe
[       OK ] Parameters/TestRpc.TestRpcSidecarLimits/SSL_UnixSocket (5941 ms)
[ RUN      ] Parameters/TestRpc.TestCallTimeoutDoesntAffectNegotiation/SSL_UnixSocket
I20260925 02:23:24.330005 14638 acceptor_pool.cc:254] collecting diagnostics on the listening RPC socket unix:/tmp/dist-test-taskAmevhA/test-tmp/rpc-test-e2983d0c34274a0eaf2dcffd7083aef6.sock every 8 connection(s)
I20260925 02:23:24.330027 14637 acceptor_pool.cc:254] collecting diagnostics on the listening RPC socket unix:/tmp/dist-test-taskAmevhA/test-tmp/rpc-test-e2983d0c34274a0eaf2dcffd7083aef6.sock every 8 connection(s)
W20260925 02:23:24.356178 14633 negotiation.cc:266] Injecting 500ms delay in negotiation
I20260925 02:23:24.406427 14345 rpc-test-base.h:595] status: Timed out: connection negotiation to unix:/tmp/dist-test-taskAmevhA/test-tmp/rpc-test-e2983d0c34274a0eaf2dcffd7083aef6.sock for RPC Sleep timed out after 0.050s (ON_OUTBOUND_QUEUE), seconds elapsed: 0.0506124
W20260925 02:23:24.860687 14634 connection.cc:196] Error closing socket: Network error: TlsSocket::Close: Broken pipe
[       OK ] Parameters/TestRpc.TestCallTimeoutDoesntAffectNegotiation/SSL_UnixSocket (548 ms)
[ RUN      ] Parameters/TestRpc.TestRpcHandlerLatencyMetric/SSL_UnixSocket
I20260925 02:23:24.902561 14662 acceptor_pool.cc:254] collecting diagnostics on the listening RPC socket unix:/tmp/dist-test-taskAmevhA/test-tmp/rpc-test-4993f2cfdb03491ea50708406329630e.sock every 8 connection(s)
I20260925 02:23:24.902603 14663 acceptor_pool.cc:254] collecting diagnostics on the listening RPC socket unix:/tmp/dist-test-taskAmevhA/test-tmp/rpc-test-4993f2cfdb03491ea50708406329630e.sock every 8 connection(s)
I20260925 02:23:24.940284 14345 rpc-test.cc:1236] Sleep() min lat: 20326
I20260925 02:23:24.940403 14345 rpc-test.cc:1237] Sleep() mean lat: 20326
I20260925 02:23:24.940441 14345 rpc-test.cc:1238] Sleep() max lat: 20326
I20260925 02:23:24.940462 14345 rpc-test.cc:1239] Sleep() #calls: 1
W20260925 02:23:24.941141 14659 connection.cc:196] Error closing socket: Network error: TlsSocket::Close: Broken pipe
[       OK ] Parameters/TestRpc.TestRpcHandlerLatencyMetric/SSL_UnixSocket (80 ms)
[ RUN      ] Parameters/TestRpc.TimedOutOnResponseMetricServiceQueue/SSL_UnixSocket
I20260925 02:23:24.950327 14688 acceptor_pool.cc:254] collecting diagnostics on the listening RPC socket unix:/tmp/dist-test-taskAmevhA/test-tmp/rpc-test-f873be97e1294650854da2d6fa82b4a7.sock every 8 connection(s)
I20260925 02:23:24.950330 14689 acceptor_pool.cc:254] collecting diagnostics on the listening RPC socket unix:/tmp/dist-test-taskAmevhA/test-tmp/rpc-test-f873be97e1294650854da2d6fa82b4a7.sock every 8 connection(s)
W20260925 02:23:25.006984 14690 rpcz_store.cc:267] Call kudu.rpc_test.CalculatorService.Sleep from unix:<unnamed> (request call id 2) took 20 ms (client timeout 20 ms). Trace:
W20260925 02:23:25.007114 14690 rpcz_store.cc:269] 0925 02:23:24.986727 (+     0us) service_pool.cc:170] Inserting onto call queue
0925 02:23:25.006953 (+ 20226us) service_pool.cc:214] Skipping call since client already timed out
0925 02:23:25.006965 (+    12us) inbound_call.cc:173] Queueing failure response
Metrics: {}
W20260925 02:23:25.007761 14685 connection.cc:196] Error closing socket: Network error: TlsSocket::Close: Broken pipe
[       OK ] Parameters/TestRpc.TimedOutOnResponseMetricServiceQueue/SSL_UnixSocket (66 ms)
[ RUN      ] Parameters/TestRpc.RpcPendingConnectionsMetric/SSL_UnixSocket
I20260925 02:23:25.010501 14711 acceptor_pool.cc:254] collecting diagnostics on the listening RPC socket 0.0.0.0:34211 every 8 connection(s)
I20260925 02:23:25.010550 14712 acceptor_pool.cc:254] collecting diagnostics on the listening RPC socket 0.0.0.0:34211 every 8 connection(s)
W20260925 02:23:25.011173 14707 negotiation.cc:337] Failed RPC negotiation. Trace:
0925 02:23:25.010999 (+     0us) reactor.cc:625] Submitting negotiation task for server connection from 127.0.0.1:40966 (local address 127.0.0.1:34211)
0925 02:23:25.011058 (+    59us) server_negotiation.cc:206] Beginning negotiation
0925 02:23:25.011060 (+     2us) server_negotiation.cc:399] Waiting for connection header
0925 02:23:25.011126 (+    66us) negotiation.cc:327] Negotiation complete: Network error: Server connection negotiation failed: server connection from 127.0.0.1:40966: BlockingRecv error: recv got EOF from 127.0.0.1:40966 (error 108)
Metrics: {"server-negotiator.queue_time_us":30}
[       OK ] Parameters/TestRpc.RpcPendingConnectionsMetric/SSL_UnixSocket (13 ms)
[ RUN      ] Parameters/TestRpc.TestRpcContextClientDeadline/SSL_UnixSocket
I20260925 02:23:25.043738 14727 acceptor_pool.cc:254] collecting diagnostics on the listening RPC socket unix:/tmp/dist-test-taskAmevhA/test-tmp/rpc-test-c29dfc90383a46f781596b21c420862a.sock every 8 connection(s)
I20260925 02:23:25.043776 14728 acceptor_pool.cc:254] collecting diagnostics on the listening RPC socket unix:/tmp/dist-test-taskAmevhA/test-tmp/rpc-test-c29dfc90383a46f781596b21c420862a.sock every 8 connection(s)
W20260925 02:23:25.083794 14724 connection.cc:196] Error closing socket: Network error: TlsSocket::Close: Broken pipe
[       OK ] Parameters/TestRpc.TestRpcContextClientDeadline/SSL_UnixSocket (62 ms)
[ RUN      ] Parameters/TestRpc.TestApplicationFeatureFlagUnsupportedServer/SSL_UnixSocket
I20260925 02:23:25.099050 14752 acceptor_pool.cc:254] collecting diagnostics on the listening RPC socket unix:/tmp/dist-test-taskAmevhA/test-tmp/rpc-test-6d94ee4bbff54f4b83a97438e6f3139d.sock every 8 connection(s)
I20260925 02:23:25.099095 14753 acceptor_pool.cc:254] collecting diagnostics on the listening RPC socket unix:/tmp/dist-test-taskAmevhA/test-tmp/rpc-test-6d94ee4bbff54f4b83a97438e6f3139d.sock every 8 connection(s)
[       OK ] Parameters/TestRpc.TestApplicationFeatureFlagUnsupportedServer/SSL_UnixSocket (27 ms)
[ RUN      ] Parameters/TestRpc.TestCancellationAsync/SSL_UnixSocket
I20260925 02:23:25.119473 14777 acceptor_pool.cc:254] collecting diagnostics on the listening RPC socket unix:/tmp/dist-test-taskAmevhA/test-tmp/rpc-test-b0e83c668519440bb5456285c17ef2cc.sock every 8 connection(s)
I20260925 02:23:25.119532 14778 acceptor_pool.cc:254] collecting diagnostics on the listening RPC socket unix:/tmp/dist-test-taskAmevhA/test-tmp/rpc-test-b0e83c668519440bb5456285c17ef2cc.sock every 8 connection(s)
I20260925 02:23:25.119714 14345 rpc-test.cc:1716] Connecting to unix:/tmp/dist-test-taskAmevhA/test-tmp/rpc-test-b0e83c668519440bb5456285c17ef2cc.sock
I20260925 02:23:25.133399 14345 test_util.cc:268] Using random seed: 1722370643
I20260925 02:23:25.150533 14781 rpc-test-base.h:240] got call: sleep_micros: 500 pattern: 4294967295 num_repetitions: 2097152 sidecar_idx: 0
I20260925 02:23:25.161643 14781 rpc-test-base.h:240] got call: sleep_micros: 500 pattern: 4294967295 num_repetitions: 2097152 sidecar_idx: 0
I20260925 02:23:25.171998 14781 rpc-test-base.h:240] got call: sleep_micros: 500 pattern: 4294967295 num_repetitions: 2097152 sidecar_idx: 0
I20260925 02:23:25.182402 14781 rpc-test-base.h:240] got call: sleep_micros: 500 pattern: 4294967295 num_repetitions: 2097152 sidecar_idx: 0
I20260925 02:23:25.192857 14781 rpc-test-base.h:240] got call: sleep_micros: 500 pattern: 4294967295 num_repetitions: 2097152 sidecar_idx: 0
I20260925 02:23:25.203270 14781 rpc-test-base.h:240] got call: sleep_micros: 500 pattern: 4294967295 num_repetitions: 2097152 sidecar_idx: 0
I20260925 02:23:25.213800 14781 rpc-test-base.h:240] got call: sleep_micros: 500 pattern: 4294967295 num_repetitions: 2097152 sidecar_idx: 0
I20260925 02:23:25.224015 14781 rpc-test-base.h:240] got call: sleep_micros: 500 pattern: 4294967295 num_repetitions: 2097152 sidecar_idx: 0
W20260925 02:23:25.225371 14774 connection.cc:196] Error closing socket: Network error: TlsSocket::Close: Broken pipe
W20260925 02:23:25.227197 14774 connection.cc:441] server connection from unix:<unnamed> torn down before Call kudu.rpc.GenericCalculatorService.SleepWithSidecar from unix:<unnamed> (request call id 9) could send its response
[       OK ] Parameters/TestRpc.TestCancellationAsync/SSL_UnixSocket (115 ms)
[ RUN      ] Parameters/TestRpc.TestPerformanceBySocketType/SSL_UnixSocket
I20260925 02:23:25.245221 14802 acceptor_pool.cc:254] collecting diagnostics on the listening RPC socket unix:/tmp/dist-test-taskAmevhA/test-tmp/rpc-test-79c7babe4f154e0e994b57502e29473c.sock every 8 connection(s)
I20260925 02:23:25.245270 14803 acceptor_pool.cc:254] collecting diagnostics on the listening RPC socket unix:/tmp/dist-test-taskAmevhA/test-tmp/rpc-test-79c7babe4f154e0e994b57502e29473c.sock every 8 connection(s)
I20260925 02:23:25.245525 14345 rpc-test.cc:1846] Connecting to unix:/tmp/dist-test-taskAmevhA/test-tmp/rpc-test-79c7babe4f154e0e994b57502e29473c.sock
I20260925 02:23:26.458588 14345 rpc-test.cc:1859] Sending 1024MB via ssl-enabled unix socket: real 1.195s	user 1.366s	sys 0.804s
I20260925 02:23:27.667431 14345 rpc-test.cc:1859] Sending 1024MB via ssl-enabled unix socket: real 1.209s	user 1.381s	sys 0.808s
I20260925 02:23:28.871709 14345 rpc-test.cc:1859] Sending 1024MB via ssl-enabled unix socket: real 1.204s	user 1.345s	sys 0.834s
I20260925 02:23:30.082511 14345 rpc-test.cc:1859] Sending 1024MB via ssl-enabled unix socket: real 1.211s	user 1.410s	sys 0.772s
I20260925 02:23:31.289692 14345 rpc-test.cc:1859] Sending 1024MB via ssl-enabled unix socket: real 1.207s	user 1.340s	sys 0.840s
W20260925 02:23:31.290496 14799 connection.cc:196] Error closing socket: Network error: TlsSocket::Close: Broken pipe
[       OK ] Parameters/TestRpc.TestPerformanceBySocketType/SSL_UnixSocket (6064 ms)
[----------] 20 tests from Parameters/TestRpc (25849 ms total)

[----------] 1 test from Parameters/TestRpcSocketTxRxQueue
[ RUN      ] Parameters/TestRpcSocketTxRxQueue.AcceptorRxQueueSizeMetric/0
I20260925 02:23:31.294415 14827 acceptor_pool.cc:254] collecting diagnostics on the listening RPC socket 0.0.0.0:37335 every 1 connection(s)
I20260925 02:23:31.294480 14828 acceptor_pool.cc:254] collecting diagnostics on the listening RPC socket 0.0.0.0:37335 every 1 connection(s)
W20260925 02:23:31.294991 14823 negotiation.cc:337] Failed RPC negotiation. Trace:
0925 02:23:31.294843 (+     0us) reactor.cc:625] Submitting negotiation task for server connection from 127.0.0.1:52236 (local address 127.0.0.1:37335)
0925 02:23:31.294884 (+    41us) server_negotiation.cc:206] Beginning negotiation
0925 02:23:31.294886 (+     2us) server_negotiation.cc:399] Waiting for connection header
0925 02:23:31.294963 (+    77us) negotiation.cc:327] Negotiation complete: Network error: Server connection negotiation failed: server connection from 127.0.0.1:52236: BlockingRecv error: recv got EOF from 127.0.0.1:52236 (error 108)
Metrics: {"server-negotiator.queue_time_us":14}
[       OK ] Parameters/TestRpcSocketTxRxQueue.AcceptorRxQueueSizeMetric/0 (4 ms)
[----------] 1 test from Parameters/TestRpcSocketTxRxQueue (4 ms total)

[----------] Global test environment tear-down
[==========] 21 tests from 2 test suites ran. (25854 ms total)
[  PASSED  ] 20 tests.
[  FAILED  ] 1 test, listed below:
[  FAILED  ] Parameters/TestRpc.TestCallWithChainCertAndChainCA/SSL_UnixSocket, where GetParam() = (true, true)

 1 FAILED TEST