Diagnosed failure

Parameters/TestRpc.TestCallWithChainCertAndChainCA/SSL_TCP: /data0/somelongdirectorytoavoidrpathissues/src/kudu/src/kudu/rpc/rpc-test.cc:270: Failure
Failed
Bad status: Runtime error: could not verify certificate chain (error with cert: subject=CN = localhost, ST = sadfjas, C = AS, emailAddress = sdflkdsajf, O = lskdfjlsad, OU = sldfkja, issuer=C = AS, ST = ASDfkjdhf, L = lskdjf, O = saldfja, OU = skdjf, CN = localhost, emailAddress = sadjflkadsj): : certificate has expired
Google Test trace:
/data0/somelongdirectorytoavoidrpathissues/src/kudu/src/kudu/rpc/rpc-test.cc:267: Connecting to 0.0.0.0:35283
I20260927 03:53:42.653443  5343 test_util.cc:175] -----------------------------------------------
I20260927 03:53:42.653503  5343 test_util.cc:176] Had fatal failures, leaving test files at /tmp/dist-test-task8JMOlZ/test-tmp/rpc-test.5.Parameters_TestRpc.TestCallWithChainCertAndChainCA_SSL_TCP.1790481222572935-5343-0

Full log

Note: This is test shard 6 of 8.
[==========] Running 21 tests from 2 test suites.
[----------] Global test environment set-up.
[----------] 20 tests from Parameters/TestRpc
[ RUN      ] Parameters/TestRpc.TestMessengerCreateDestroy/SSL_TCP
WARNING: Logging before InitGoogleLogging() is written to STDERR
I20260927 03:53:42.601395  5343 rpc-test.cc:169] started messenger TestCreateDestroy
[       OK ] Parameters/TestRpc.TestMessengerCreateDestroy/SSL_TCP (27 ms)
[ RUN      ] Parameters/TestRpc.TestNegotiationDeadlock/SSL_TCP
I20260927 03:53:42.630525  5364 acceptor_pool.cc:254] collecting diagnostics on the listening RPC socket 0.0.0.0:40475 every 8 connection(s)
I20260927 03:53:42.630549  5363 acceptor_pool.cc:254] collecting diagnostics on the listening RPC socket 0.0.0.0:40475 every 8 connection(s)
[       OK ] Parameters/TestRpc.TestNegotiationDeadlock/SSL_TCP (35 ms)
[ RUN      ] Parameters/TestRpc.TestCallWithChainCertAndChainCA/SSL_TCP
I20260927 03:53:42.649128  5379 acceptor_pool.cc:254] collecting diagnostics on the listening RPC socket 0.0.0.0:35283 every 8 connection(s)
I20260927 03:53:42.649147  5380 acceptor_pool.cc:254] collecting diagnostics on the listening RPC socket 0.0.0.0:35283 every 8 connection(s)
/data0/somelongdirectorytoavoidrpathissues/src/kudu/src/kudu/rpc/rpc-test.cc:270: Failure
Failed
Bad status: Runtime error: could not verify certificate chain (error with cert: subject=CN = localhost, ST = sadfjas, C = AS, emailAddress = sdflkdsajf, O = lskdfjlsad, OU = sldfkja, issuer=C = AS, ST = ASDfkjdhf, L = lskdjf, O = saldfja, OU = skdjf, CN = localhost, emailAddress = sadjflkadsj): : certificate has expired
Google Test trace:
/data0/somelongdirectorytoavoidrpathissues/src/kudu/src/kudu/rpc/rpc-test.cc:267: Connecting to 0.0.0.0:35283
I20260927 03:53:42.653443  5343 test_util.cc:175] -----------------------------------------------
I20260927 03:53:42.653503  5343 test_util.cc:176] Had fatal failures, leaving test files at /tmp/dist-test-task8JMOlZ/test-tmp/rpc-test.5.Parameters_TestRpc.TestCallWithChainCertAndChainCA_SSL_TCP.1790481222572935-5343-0
[  FAILED  ] Parameters/TestRpc.TestCallWithChainCertAndChainCA/SSL_TCP, where GetParam() = (true, false) (15 ms)
[ RUN      ] Parameters/TestRpc.TestCallWithPasswordProtectedKey/SSL_TCP
I20260927 03:53:42.667681  5404 acceptor_pool.cc:254] collecting diagnostics on the listening RPC socket 0.0.0.0:43511 every 8 connection(s)
I20260927 03:53:42.667713  5405 acceptor_pool.cc:254] collecting diagnostics on the listening RPC socket 0.0.0.0:43511 every 8 connection(s)
[       OK ] Parameters/TestRpc.TestCallWithPasswordProtectedKey/SSL_TCP (30 ms)
[ RUN      ] Parameters/TestRpc.TestCallToBadServer/SSL_TCP
I20260927 03:53:42.709421  5343 rpc-test.cc:394] Status: Network error: Client connection negotiation failed: client connection to 0.0.0.0:0: connect: Connection refused (error 111)
I20260927 03:53:42.709914  5343 rpc-test.cc:394] Status: Network error: Client connection negotiation failed: client connection to 0.0.0.0:0: connect: Connection refused (error 111)
I20260927 03:53:42.710500  5343 rpc-test.cc:394] Status: Network error: Client connection negotiation failed: client connection to 0.0.0.0:0: connect: Connection refused (error 111)
I20260927 03:53:42.710770  5343 rpc-test.cc:394] Status: Network error: Client connection negotiation failed: client connection to 0.0.0.0:0: connect: Connection refused (error 111)
I20260927 03:53:42.711099  5343 rpc-test.cc:394] Status: Network error: Client connection negotiation failed: client connection to 0.0.0.0:0: connect: Connection refused (error 111)
[       OK ] Parameters/TestRpc.TestCallToBadServer/SSL_TCP (27 ms)
[ RUN      ] Parameters/TestRpc.TestWrongService/SSL_TCP
I20260927 03:53:42.719410  5439 acceptor_pool.cc:254] collecting diagnostics on the listening RPC socket 0.0.0.0:40205 every 8 connection(s)
I20260927 03:53:42.719450  5440 acceptor_pool.cc:254] collecting diagnostics on the listening RPC socket 0.0.0.0:40205 every 8 connection(s)
I20260927 03:53:42.731055  5436 messenger.cc:345] service WrongServiceName not registered on TestServer
[       OK ] Parameters/TestRpc.TestWrongService/SSL_TCP (21 ms)
[ RUN      ] Parameters/TestRpc.TestConnectionKeepalive/SSL_TCP
I20260927 03:53:42.752321  5462 acceptor_pool.cc:254] collecting diagnostics on the listening RPC socket 0.0.0.0:38805 every 8 connection(s)
I20260927 03:53:42.752519  5343 rpc-test.cc:488] Connecting to 0.0.0.0:38805
I20260927 03:53:42.752341  5463 acceptor_pool.cc:254] collecting diagnostics on the listening RPC socket 0.0.0.0:38805 every 8 connection(s)
[       OK ] Parameters/TestRpc.TestConnectionKeepalive/SSL_TCP (1035 ms)
[ RUN      ] Parameters/TestRpc.TestClientConnectionMetrics/SSL_TCP
I20260927 03:53:43.790927  5487 acceptor_pool.cc:254] collecting diagnostics on the listening RPC socket 0.0.0.0:39629 every 8 connection(s)
I20260927 03:53:43.790963  5488 acceptor_pool.cc:254] collecting diagnostics on the listening RPC socket 0.0.0.0:39629 every 8 connection(s)
I20260927 03:53:43.791141  5343 rpc-test.cc:569] Connecting to 0.0.0.0:39629
[       OK ] Parameters/TestRpc.TestClientConnectionMetrics/SSL_TCP (8610 ms)
[ RUN      ] Parameters/TestRpc.TestCredentialsPolicy/SSL_TCP
I20260927 03:53:52.390513  5510 acceptor_pool.cc:254] collecting diagnostics on the listening RPC socket 0.0.0.0:41271 every 8 connection(s)
I20260927 03:53:52.390683  5511 acceptor_pool.cc:254] collecting diagnostics on the listening RPC socket 0.0.0.0:41271 every 8 connection(s)
I20260927 03:53:52.390832  5343 rpc-test.cc:700] Connecting to 0.0.0.0:41271
[       OK ] Parameters/TestRpc.TestCredentialsPolicy/SSL_TCP (48 ms)
[ RUN      ] Parameters/TestRpc.TestCallLongerThanKeepalive/SSL_TCP
I20260927 03:53:52.451344  5535 acceptor_pool.cc:254] collecting diagnostics on the listening RPC socket 0.0.0.0:42393 every 8 connection(s)
I20260927 03:53:52.451377  5536 acceptor_pool.cc:254] collecting diagnostics on the listening RPC socket 0.0.0.0:42393 every 8 connection(s)
I20260927 03:53:52.463871  5539 rpc-test-base.h:222] got call: sleep_micros: 3000000 deferred: true
I20260927 03:53:55.464670  5539 rpcz_store.cc:275] Call kudu.rpc.GenericCalculatorService.Sleep from 127.0.0.1:36898 (request call id 0) took 3000 ms. Trace:
I20260927 03:53:55.465011  5539 rpcz_store.cc:276] 0927 03:53:52.463780 (+     0us) service_pool.cc:170] Inserting onto call queue
0927 03:53:52.463834 (+    54us) service_pool.cc:227] Handling call
0927 03:53:55.464653 (+3000819us) inbound_call.cc:173] Queueing success response
Metrics: {}
[       OK ] Parameters/TestRpc.TestCallLongerThanKeepalive/SSL_TCP (3038 ms)
[ RUN      ] Parameters/TestRpc.TestRpcSidecar/SSL_TCP
I20260927 03:53:55.478395  5560 acceptor_pool.cc:254] collecting diagnostics on the listening RPC socket 0.0.0.0:36625 every 8 connection(s)
I20260927 03:53:55.478492  5561 acceptor_pool.cc:254] collecting diagnostics on the listening RPC socket 0.0.0.0:36625 every 8 connection(s)
[       OK ] Parameters/TestRpc.TestRpcSidecar/SSL_TCP (47 ms)
[ RUN      ] Parameters/TestRpc.TestRpcSidecarLimits/SSL_TCP
I20260927 03:53:57.268356  5585 acceptor_pool.cc:254] collecting diagnostics on the listening RPC socket 0.0.0.0:36431 every 8 connection(s)
I20260927 03:53:57.268409  5586 acceptor_pool.cc:254] collecting diagnostics on the listening RPC socket 0.0.0.0:36431 every 8 connection(s)
W20260927 03:53:57.290859  5343 serialization.cc:72] Serialized kudu.rpc_test.PushStringsRequestPB (2147483654 bytes) is larger than the maximum configured RPC message size (52428800 bytes). Sending anyway, but peer may reject the data.
W20260927 03:53:57.295481  5582 connection.cc:535] server connection from 127.0.0.1:45004 recv error: Network error: RPC frame had a length of 2147483714, but we only support messages up to 52428800 bytes long.
W20260927 03:53:57.295593  5582 connection.cc:158] shutting down server connection from 127.0.0.1:45004 with pending inbound data: 4/2147483714 bytes received; last active 0 ns ago: status Network error: RPC frame had a length of 2147483714, but we only support messages up to 52428800 bytes long.
W20260927 03:53:57.295823  5598 connection.cc:196] Error closing socket: Network error: TlsSocket::Close: Connection reset by peer
I20260927 03:53:57.306680  5611 acceptor_pool.cc:254] collecting diagnostics on the listening RPC socket 0.0.0.0:41945 every 8 connection(s)
I20260927 03:53:57.306680  5610 acceptor_pool.cc:254] collecting diagnostics on the listening RPC socket 0.0.0.0:41945 every 8 connection(s)
W20260927 03:54:01.502419  5607 connection.cc:577] server connection from 127.0.0.1:41718: received bad data: 'Corruption: Invalid packet: message had a length of 2147483710, but we only support messages up to 2147483647 bytes
'
[       OK ] Parameters/TestRpc.TestRpcSidecarLimits/SSL_TCP (5989 ms)
[ RUN      ] Parameters/TestRpc.TestCallTimeoutDoesntAffectNegotiation/SSL_TCP
I20260927 03:54:01.520776  5635 acceptor_pool.cc:254] collecting diagnostics on the listening RPC socket 0.0.0.0:36445 every 8 connection(s)
I20260927 03:54:01.520889  5636 acceptor_pool.cc:254] collecting diagnostics on the listening RPC socket 0.0.0.0:36445 every 8 connection(s)
W20260927 03:54:01.532387  5631 negotiation.cc:266] Injecting 500ms delay in negotiation
I20260927 03:54:01.582696  5343 rpc-test-base.h:595] status: Timed out: connection negotiation to 0.0.0.0:36445 for RPC Sleep timed out after 0.050s (ON_OUTBOUND_QUEUE), seconds elapsed: 0.0507842
[       OK ] Parameters/TestRpc.TestCallTimeoutDoesntAffectNegotiation/SSL_TCP (533 ms)
[ RUN      ] Parameters/TestRpc.TestRpcHandlerLatencyMetric/SSL_TCP
I20260927 03:54:02.049801  5660 acceptor_pool.cc:254] collecting diagnostics on the listening RPC socket 0.0.0.0:44655 every 8 connection(s)
I20260927 03:54:02.049832  5661 acceptor_pool.cc:254] collecting diagnostics on the listening RPC socket 0.0.0.0:44655 every 8 connection(s)
I20260927 03:54:02.082516  5343 rpc-test.cc:1236] Sleep() min lat: 20318
I20260927 03:54:02.082592  5343 rpc-test.cc:1237] Sleep() mean lat: 20318
I20260927 03:54:02.082644  5343 rpc-test.cc:1238] Sleep() max lat: 20318
I20260927 03:54:02.082659  5343 rpc-test.cc:1239] Sleep() #calls: 1
[       OK ] Parameters/TestRpc.TestRpcHandlerLatencyMetric/SSL_TCP (46 ms)
[ RUN      ] Parameters/TestRpc.TimedOutOnResponseMetricServiceQueue/SSL_TCP
I20260927 03:54:02.095863  5687 acceptor_pool.cc:254] collecting diagnostics on the listening RPC socket 0.0.0.0:45795 every 8 connection(s)
I20260927 03:54:02.095837  5686 acceptor_pool.cc:254] collecting diagnostics on the listening RPC socket 0.0.0.0:45795 every 8 connection(s)
W20260927 03:54:02.155889  5688 rpcz_store.cc:267] Call kudu.rpc_test.CalculatorService.Sleep from 127.0.0.1:51456 (request call id 2) took 20 ms (client timeout 20 ms). Trace:
W20260927 03:54:02.156024  5688 rpcz_store.cc:269] 0927 03:54:02.135629 (+     0us) service_pool.cc:170] Inserting onto call queue
0927 03:54:02.155860 (+ 20231us) service_pool.cc:214] Skipping call since client already timed out
0927 03:54:02.155872 (+    12us) inbound_call.cc:173] Queueing failure response
Metrics: {}
[       OK ] Parameters/TestRpc.TimedOutOnResponseMetricServiceQueue/SSL_TCP (73 ms)
[ RUN      ] Parameters/TestRpc.RpcPendingConnectionsMetric/SSL_TCP
I20260927 03:54:02.159420  5709 acceptor_pool.cc:254] collecting diagnostics on the listening RPC socket 0.0.0.0:44091 every 8 connection(s)
I20260927 03:54:02.159479  5710 acceptor_pool.cc:254] collecting diagnostics on the listening RPC socket 0.0.0.0:44091 every 8 connection(s)
W20260927 03:54:02.160108  5705 negotiation.cc:337] Failed RPC negotiation. Trace:
0927 03:54:02.159940 (+     0us) reactor.cc:625] Submitting negotiation task for server connection from 127.0.0.1:43166 (local address 127.0.0.1:44091)
0927 03:54:02.159984 (+    44us) server_negotiation.cc:206] Beginning negotiation
0927 03:54:02.159991 (+     7us) server_negotiation.cc:399] Waiting for connection header
0927 03:54:02.160058 (+    67us) negotiation.cc:327] Negotiation complete: Network error: Server connection negotiation failed: server connection from 127.0.0.1:43166: BlockingRecv error: recv got EOF from 127.0.0.1:43166 (error 108)
Metrics: {"server-negotiator.queue_time_us":13}
[       OK ] Parameters/TestRpc.RpcPendingConnectionsMetric/SSL_TCP (13 ms)
[ RUN      ] Parameters/TestRpc.TestRpcContextClientDeadline/SSL_TCP
I20260927 03:54:02.182840  5725 acceptor_pool.cc:254] collecting diagnostics on the listening RPC socket 0.0.0.0:46721 every 8 connection(s)
I20260927 03:54:02.182873  5726 acceptor_pool.cc:254] collecting diagnostics on the listening RPC socket 0.0.0.0:46721 every 8 connection(s)
[       OK ] Parameters/TestRpc.TestRpcContextClientDeadline/SSL_TCP (60 ms)
[ RUN      ] Parameters/TestRpc.TestApplicationFeatureFlagUnsupportedServer/SSL_TCP
I20260927 03:54:02.250507  5750 acceptor_pool.cc:254] collecting diagnostics on the listening RPC socket 0.0.0.0:42697 every 8 connection(s)
I20260927 03:54:02.250542  5751 acceptor_pool.cc:254] collecting diagnostics on the listening RPC socket 0.0.0.0:42697 every 8 connection(s)
[       OK ] Parameters/TestRpc.TestApplicationFeatureFlagUnsupportedServer/SSL_TCP (34 ms)
[ RUN      ] Parameters/TestRpc.TestCancellationAsync/SSL_TCP
I20260927 03:54:02.284111  5775 acceptor_pool.cc:254] collecting diagnostics on the listening RPC socket 0.0.0.0:37225 every 8 connection(s)
I20260927 03:54:02.284175  5776 acceptor_pool.cc:254] collecting diagnostics on the listening RPC socket 0.0.0.0:37225 every 8 connection(s)
I20260927 03:54:02.284320  5343 rpc-test.cc:1716] Connecting to 0.0.0.0:37225
I20260927 03:54:02.298544  5343 test_util.cc:268] Using random seed: -429090643
I20260927 03:54:02.313556  5779 rpc-test-base.h:240] got call: sleep_micros: 500 pattern: 4294967295 num_repetitions: 2097152 sidecar_idx: 0
I20260927 03:54:02.325161  5779 rpc-test-base.h:240] got call: sleep_micros: 500 pattern: 4294967295 num_repetitions: 2097152 sidecar_idx: 0
I20260927 03:54:02.337610  5779 rpc-test-base.h:240] got call: sleep_micros: 500 pattern: 4294967295 num_repetitions: 2097152 sidecar_idx: 0
I20260927 03:54:02.350298  5779 rpc-test-base.h:240] got call: sleep_micros: 500 pattern: 4294967295 num_repetitions: 2097152 sidecar_idx: 0
I20260927 03:54:02.363236  5779 rpc-test-base.h:240] got call: sleep_micros: 500 pattern: 4294967295 num_repetitions: 2097152 sidecar_idx: 0
I20260927 03:54:02.376704  5779 rpc-test-base.h:240] got call: sleep_micros: 500 pattern: 4294967295 num_repetitions: 2097152 sidecar_idx: 0
I20260927 03:54:02.389405  5779 rpc-test-base.h:240] got call: sleep_micros: 500 pattern: 4294967295 num_repetitions: 2097152 sidecar_idx: 0
I20260927 03:54:02.402086  5779 rpc-test-base.h:240] got call: sleep_micros: 500 pattern: 4294967295 num_repetitions: 2097152 sidecar_idx: 0
W20260927 03:54:02.405316  5772 connection.cc:441] server connection from 127.0.0.1:36326 torn down before Call kudu.rpc.GenericCalculatorService.SleepWithSidecar from 127.0.0.1:36326 (request call id 9) could send its response
[       OK ] Parameters/TestRpc.TestCancellationAsync/SSL_TCP (139 ms)
[ RUN      ] Parameters/TestRpc.TestPerformanceBySocketType/SSL_TCP
I20260927 03:54:02.425480  5800 acceptor_pool.cc:254] collecting diagnostics on the listening RPC socket 0.0.0.0:35885 every 8 connection(s)
I20260927 03:54:02.425527  5801 acceptor_pool.cc:254] collecting diagnostics on the listening RPC socket 0.0.0.0:35885 every 8 connection(s)
I20260927 03:54:02.425675  5343 rpc-test.cc:1846] Connecting to 0.0.0.0:35885
I20260927 03:54:04.130612  5343 rpc-test.cc:1859] Sending 1024MB via ssl-enabled tcp socket: real 1.679s	user 1.487s	sys 1.501s
I20260927 03:54:05.823606  5343 rpc-test.cc:1859] Sending 1024MB via ssl-enabled tcp socket: real 1.693s	user 1.549s	sys 1.450s
I20260927 03:54:07.551689  5343 rpc-test.cc:1859] Sending 1024MB via ssl-enabled tcp socket: real 1.728s	user 1.685s	sys 1.379s
I20260927 03:54:09.228065  5343 rpc-test.cc:1859] Sending 1024MB via ssl-enabled tcp socket: real 1.676s	user 1.568s	sys 1.411s
I20260927 03:54:10.920884  5343 rpc-test.cc:1859] Sending 1024MB via ssl-enabled tcp socket: real 1.693s	user 1.550s	sys 1.474s
[       OK ] Parameters/TestRpc.TestPerformanceBySocketType/SSL_TCP (8516 ms)
[----------] 20 tests from Parameters/TestRpc (28347 ms total)

[----------] 1 test from Parameters/TestRpcSocketTxRxQueue
[ RUN      ] Parameters/TestRpcSocketTxRxQueue.OverCapacity/0
W20260927 03:54:11.189078  5835 negotiation.cc:337] Failed RPC negotiation. Trace:
0927 03:54:10.926380 (+     0us) reactor.cc:625] Submitting negotiation task for client connection to 0.0.0.0:46355 (local address 127.0.0.1:34002)
0927 03:54:10.926416 (+    36us) negotiation.cc:107] Waiting for socket to connect
0927 03:54:10.926424 (+     8us) client_negotiation.cc:174] Beginning negotiation
0927 03:54:10.926459 (+    35us) client_negotiation.cc:252] Sending NEGOTIATE NegotiatePB request
0927 03:54:11.188913 (+262454us) negotiation.cc:327] Negotiation complete: Network error: Client connection negotiation failed: client connection to 0.0.0.0:46355: BlockingRecv error: recv error from unknown peer: Transport endpoint is not connected (error 107)
Metrics: {"client-negotiator.queue_time_us":18}
W20260927 03:54:11.189195  5817 negotiation.cc:337] Failed RPC negotiation. Trace:
0927 03:54:10.924571 (+     0us) reactor.cc:625] Submitting negotiation task for client connection to 0.0.0.0:46355 (local address 127.0.0.1:33988)
0927 03:54:10.924609 (+    38us) negotiation.cc:107] Waiting for socket to connect
0927 03:54:10.924619 (+    10us) client_negotiation.cc:174] Beginning negotiation
0927 03:54:10.924666 (+    47us) client_negotiation.cc:252] Sending NEGOTIATE NegotiatePB request
0927 03:54:11.188922 (+264256us) negotiation.cc:327] Negotiation complete: Network error: Client connection negotiation failed: client connection to 0.0.0.0:46355: BlockingRecv error: recv error from unknown peer: Transport endpoint is not connected (error 107)
Metrics: {"client-negotiator.queue_time_us":16}
W20260927 03:54:11.189216  5826 negotiation.cc:337] Failed RPC negotiation. Trace:
0927 03:54:10.925472 (+     0us) reactor.cc:625] Submitting negotiation task for client connection to 0.0.0.0:46355 (local address 127.0.0.1:34000)
0927 03:54:10.925512 (+    40us) negotiation.cc:107] Waiting for socket to connect
0927 03:54:10.925522 (+    10us) client_negotiation.cc:174] Beginning negotiation
0927 03:54:10.925568 (+    46us) client_negotiation.cc:252] Sending NEGOTIATE NegotiatePB request
0927 03:54:11.188922 (+263354us) negotiation.cc:327] Negotiation complete: Network error: Client connection negotiation failed: client connection to 0.0.0.0:46355: BlockingRecv error: recv error from unknown peer: Transport endpoint is not connected (error 107)
Metrics: {"client-negotiator.queue_time_us":17}
W20260927 03:54:11.189325  5853 negotiation.cc:337] Failed RPC negotiation. Trace:
0927 03:54:10.928146 (+     0us) reactor.cc:625] Submitting negotiation task for client connection to 0.0.0.0:46355 (local address 127.0.0.1:34016)
0927 03:54:10.928205 (+    59us) negotiation.cc:107] Waiting for socket to connect
0927 03:54:10.928215 (+    10us) client_negotiation.cc:174] Beginning negotiation
0927 03:54:10.928260 (+    45us) client_negotiation.cc:252] Sending NEGOTIATE NegotiatePB request
0927 03:54:11.189124 (+260864us) negotiation.cc:327] Negotiation complete: Network error: Client connection negotiation failed: client connection to 0.0.0.0:46355: BlockingRecv error: recv error from unknown peer: Transport endpoint is not connected (error 107)
Metrics: {"client-negotiator.queue_time_us":36}
W20260927 03:54:11.189201  5862 negotiation.cc:337] Failed RPC negotiation. Trace:
0927 03:54:10.929102 (+     0us) reactor.cc:625] Submitting negotiation task for client connection to 0.0.0.0:46355 (local address 127.0.0.1:34024)
0927 03:54:10.929164 (+    62us) negotiation.cc:107] Waiting for socket to connect
0927 03:54:10.929173 (+     9us) client_negotiation.cc:174] Beginning negotiation
0927 03:54:10.929212 (+    39us) client_negotiation.cc:252] Sending NEGOTIATE NegotiatePB request
0927 03:54:11.189073 (+259861us) negotiation.cc:327] Negotiation complete: Network error: Client connection negotiation failed: client connection to 0.0.0.0:46355: BlockingRecv error: recv error from unknown peer: Transport endpoint is not connected (error 107)
Metrics: {"client-negotiator.queue_time_us":41}
W20260927 03:54:11.189078  5844 negotiation.cc:337] Failed RPC negotiation. Trace:
0927 03:54:10.927150 (+     0us) reactor.cc:625] Submitting negotiation task for client connection to 0.0.0.0:46355 (local address 127.0.0.1:34006)
0927 03:54:10.927218 (+    68us) negotiation.cc:107] Waiting for socket to connect
0927 03:54:10.927227 (+     9us) client_negotiation.cc:174] Beginning negotiation
0927 03:54:10.927267 (+    40us) client_negotiation.cc:252] Sending NEGOTIATE NegotiatePB request
0927 03:54:11.188969 (+261702us) negotiation.cc:327] Negotiation complete: Network error: Client connection negotiation failed: client connection to 0.0.0.0:46355: BlockingRecv error: recv error from unknown peer: Transport endpoint is not connected (error 107)
Metrics: {"client-negotiator.queue_time_us":47}
[       OK ] Parameters/TestRpcSocketTxRxQueue.OverCapacity/0 (1021 ms)
[----------] 1 test from Parameters/TestRpcSocketTxRxQueue (1021 ms total)

[----------] Global test environment tear-down
[==========] 21 tests from 2 test suites ran. (29369 ms total)
[  PASSED  ] 20 tests.
[  FAILED  ] 1 test, listed below:
[  FAILED  ] Parameters/TestRpc.TestCallWithChainCertAndChainCA/SSL_TCP, where GetParam() = (true, false)

 1 FAILED TEST