Diagnosed failure

Parameters/TestRpc.TestCallWithChainCertAndChainCA/SSL_TCP: /data0/somelongdirectorytoavoidrpathissues/src/kudu/src/kudu/rpc/rpc-test.cc:270: Failure
Failed
Bad status: Runtime error: could not verify certificate chain (error with cert: subject=CN = localhost, ST = sadfjas, C = AS, emailAddress = sdflkdsajf, O = lskdfjlsad, OU = sldfkja, issuer=C = AS, ST = ASDfkjdhf, L = lskdjf, O = saldfja, OU = skdjf, CN = localhost, emailAddress = sadjflkadsj): : certificate has expired
Google Test trace:
/data0/somelongdirectorytoavoidrpathissues/src/kudu/src/kudu/rpc/rpc-test.cc:267: Connecting to 0.0.0.0:42369
I20260927 06:59:45.175870 23553 test_util.cc:175] -----------------------------------------------
I20260927 06:59:45.175918 23553 test_util.cc:176] Had fatal failures, leaving test files at /tmp/dist-test-taskE5hDkw/test-tmp/rpc-test.5.Parameters_TestRpc.TestCallWithChainCertAndChainCA_SSL_TCP.1790492385113923-23553-0

Full log

Note: This is test shard 6 of 8.
[==========] Running 21 tests from 2 test suites.
[----------] Global test environment set-up.
[----------] 20 tests from Parameters/TestRpc
[ RUN      ] Parameters/TestRpc.TestMessengerCreateDestroy/SSL_TCP
WARNING: Logging before InitGoogleLogging() is written to STDERR
I20260927 06:59:45.136472 23553 rpc-test.cc:169] started messenger TestCreateDestroy
[       OK ] Parameters/TestRpc.TestMessengerCreateDestroy/SSL_TCP (20 ms)
[ RUN      ] Parameters/TestRpc.TestNegotiationDeadlock/SSL_TCP
I20260927 06:59:45.153012 23574 acceptor_pool.cc:254] collecting diagnostics on the listening RPC socket 0.0.0.0:38003 every 8 connection(s)
I20260927 06:59:45.153012 23573 acceptor_pool.cc:254] collecting diagnostics on the listening RPC socket 0.0.0.0:38003 every 8 connection(s)
[       OK ] Parameters/TestRpc.TestNegotiationDeadlock/SSL_TCP (22 ms)
[ RUN      ] Parameters/TestRpc.TestCallWithChainCertAndChainCA/SSL_TCP
I20260927 06:59:45.171928 23589 acceptor_pool.cc:254] collecting diagnostics on the listening RPC socket 0.0.0.0:42369 every 8 connection(s)
I20260927 06:59:45.171989 23590 acceptor_pool.cc:254] collecting diagnostics on the listening RPC socket 0.0.0.0:42369 every 8 connection(s)
/data0/somelongdirectorytoavoidrpathissues/src/kudu/src/kudu/rpc/rpc-test.cc:270: Failure
Failed
Bad status: Runtime error: could not verify certificate chain (error with cert: subject=CN = localhost, ST = sadfjas, C = AS, emailAddress = sdflkdsajf, O = lskdfjlsad, OU = sldfkja, issuer=C = AS, ST = ASDfkjdhf, L = lskdjf, O = saldfja, OU = skdjf, CN = localhost, emailAddress = sadjflkadsj): : certificate has expired
Google Test trace:
/data0/somelongdirectorytoavoidrpathissues/src/kudu/src/kudu/rpc/rpc-test.cc:267: Connecting to 0.0.0.0:42369
I20260927 06:59:45.175870 23553 test_util.cc:175] -----------------------------------------------
I20260927 06:59:45.175918 23553 test_util.cc:176] Had fatal failures, leaving test files at /tmp/dist-test-taskE5hDkw/test-tmp/rpc-test.5.Parameters_TestRpc.TestCallWithChainCertAndChainCA_SSL_TCP.1790492385113923-23553-0
[  FAILED  ] Parameters/TestRpc.TestCallWithChainCertAndChainCA/SSL_TCP, where GetParam() = (true, false) (15 ms)
[ RUN      ] Parameters/TestRpc.TestCallWithPasswordProtectedKey/SSL_TCP
I20260927 06:59:45.186352 23614 acceptor_pool.cc:254] collecting diagnostics on the listening RPC socket 0.0.0.0:44541 every 8 connection(s)
I20260927 06:59:45.186390 23615 acceptor_pool.cc:254] collecting diagnostics on the listening RPC socket 0.0.0.0:44541 every 8 connection(s)
[       OK ] Parameters/TestRpc.TestCallWithPasswordProtectedKey/SSL_TCP (22 ms)
[ RUN      ] Parameters/TestRpc.TestCallToBadServer/SSL_TCP
I20260927 06:59:45.215926 23553 rpc-test.cc:394] Status: Network error: Client connection negotiation failed: client connection to 0.0.0.0:0: connect: Connection refused (error 111)
I20260927 06:59:45.216226 23553 rpc-test.cc:394] Status: Network error: Client connection negotiation failed: client connection to 0.0.0.0:0: connect: Connection refused (error 111)
I20260927 06:59:45.216488 23553 rpc-test.cc:394] Status: Network error: Client connection negotiation failed: client connection to 0.0.0.0:0: connect: Connection refused (error 111)
I20260927 06:59:45.216717 23553 rpc-test.cc:394] Status: Network error: Client connection negotiation failed: client connection to 0.0.0.0:0: connect: Connection refused (error 111)
I20260927 06:59:45.216956 23553 rpc-test.cc:394] Status: Network error: Client connection negotiation failed: client connection to 0.0.0.0:0: connect: Connection refused (error 111)
[       OK ] Parameters/TestRpc.TestCallToBadServer/SSL_TCP (18 ms)
[ RUN      ] Parameters/TestRpc.TestWrongService/SSL_TCP
I20260927 06:59:45.232349 23649 acceptor_pool.cc:254] collecting diagnostics on the listening RPC socket 0.0.0.0:37309 every 8 connection(s)
I20260927 06:59:45.232414 23650 acceptor_pool.cc:254] collecting diagnostics on the listening RPC socket 0.0.0.0:37309 every 8 connection(s)
I20260927 06:59:45.250204 23648 messenger.cc:345] service WrongServiceName not registered on TestServer
[       OK ] Parameters/TestRpc.TestWrongService/SSL_TCP (34 ms)
[ RUN      ] Parameters/TestRpc.TestConnectionKeepalive/SSL_TCP
I20260927 06:59:45.256664 23672 acceptor_pool.cc:254] collecting diagnostics on the listening RPC socket 0.0.0.0:35103 every 8 connection(s)
I20260927 06:59:45.256721 23673 acceptor_pool.cc:254] collecting diagnostics on the listening RPC socket 0.0.0.0:35103 every 8 connection(s)
I20260927 06:59:45.256924 23553 rpc-test.cc:488] Connecting to 0.0.0.0:35103
[       OK ] Parameters/TestRpc.TestConnectionKeepalive/SSL_TCP (1023 ms)
[ RUN      ] Parameters/TestRpc.TestClientConnectionMetrics/SSL_TCP
I20260927 06:59:46.286610 23697 acceptor_pool.cc:254] collecting diagnostics on the listening RPC socket 0.0.0.0:41577 every 8 connection(s)
I20260927 06:59:46.286700 23698 acceptor_pool.cc:254] collecting diagnostics on the listening RPC socket 0.0.0.0:41577 every 8 connection(s)
I20260927 06:59:46.286823 23553 rpc-test.cc:569] Connecting to 0.0.0.0:41577
[       OK ] Parameters/TestRpc.TestClientConnectionMetrics/SSL_TCP (10818 ms)
[ RUN      ] Parameters/TestRpc.TestCredentialsPolicy/SSL_TCP
I20260927 06:59:57.113646 23720 acceptor_pool.cc:254] collecting diagnostics on the listening RPC socket 0.0.0.0:38087 every 8 connection(s)
I20260927 06:59:57.113682 23721 acceptor_pool.cc:254] collecting diagnostics on the listening RPC socket 0.0.0.0:38087 every 8 connection(s)
I20260927 06:59:57.113838 23553 rpc-test.cc:700] Connecting to 0.0.0.0:38087
[       OK ] Parameters/TestRpc.TestCredentialsPolicy/SSL_TCP (54 ms)
[ RUN      ] Parameters/TestRpc.TestCallLongerThanKeepalive/SSL_TCP
I20260927 06:59:57.163368 23745 acceptor_pool.cc:254] collecting diagnostics on the listening RPC socket 0.0.0.0:39693 every 8 connection(s)
I20260927 06:59:57.163410 23746 acceptor_pool.cc:254] collecting diagnostics on the listening RPC socket 0.0.0.0:39693 every 8 connection(s)
I20260927 06:59:57.194244 23749 rpc-test-base.h:222] got call: sleep_micros: 3000000 deferred: true
I20260927 07:00:00.195019 23749 rpcz_store.cc:275] Call kudu.rpc.GenericCalculatorService.Sleep from 127.0.0.1:41440 (request call id 0) took 3000 ms. Trace:
I20260927 07:00:00.195124 23749 rpcz_store.cc:276] 0927 06:59:57.194182 (+     0us) service_pool.cc:170] Inserting onto call queue
0927 06:59:57.194226 (+    44us) service_pool.cc:227] Handling call
0927 07:00:00.195000 (+3000774us) inbound_call.cc:173] Queueing success response
Metrics: {}
[       OK ] Parameters/TestRpc.TestCallLongerThanKeepalive/SSL_TCP (3049 ms)
[ RUN      ] Parameters/TestRpc.TestRpcSidecar/SSL_TCP
I20260927 07:00:00.208755 23770 acceptor_pool.cc:254] collecting diagnostics on the listening RPC socket 0.0.0.0:42015 every 8 connection(s)
I20260927 07:00:00.208775 23771 acceptor_pool.cc:254] collecting diagnostics on the listening RPC socket 0.0.0.0:42015 every 8 connection(s)
[       OK ] Parameters/TestRpc.TestRpcSidecar/SSL_TCP (62 ms)
[ RUN      ] Parameters/TestRpc.TestRpcSidecarLimits/SSL_TCP
I20260927 07:00:01.860112 23795 acceptor_pool.cc:254] collecting diagnostics on the listening RPC socket 0.0.0.0:33385 every 8 connection(s)
I20260927 07:00:01.860150 23796 acceptor_pool.cc:254] collecting diagnostics on the listening RPC socket 0.0.0.0:33385 every 8 connection(s)
W20260927 07:00:01.879119 23553 serialization.cc:72] Serialized kudu.rpc_test.PushStringsRequestPB (2147483654 bytes) is larger than the maximum configured RPC message size (52428800 bytes). Sending anyway, but peer may reject the data.
W20260927 07:00:01.882488 23792 connection.cc:535] server connection from 127.0.0.1:40622 recv error: Network error: RPC frame had a length of 2147483714, but we only support messages up to 52428800 bytes long.
W20260927 07:00:01.882561 23792 connection.cc:158] shutting down server connection from 127.0.0.1:40622 with pending inbound data: 4/2147483714 bytes received; last active 0 ns ago: status Network error: RPC frame had a length of 2147483714, but we only support messages up to 52428800 bytes long.
W20260927 07:00:01.882828 23808 connection.cc:196] Error closing socket: Network error: TlsSocket::Close: Connection reset by peer
I20260927 07:00:01.896723 23820 acceptor_pool.cc:254] collecting diagnostics on the listening RPC socket 0.0.0.0:34245 every 8 connection(s)
I20260927 07:00:01.896749 23821 acceptor_pool.cc:254] collecting diagnostics on the listening RPC socket 0.0.0.0:34245 every 8 connection(s)
W20260927 07:00:05.696732 23818 connection.cc:577] server connection from 127.0.0.1:48736: received bad data: 'Corruption: Invalid packet: message had a length of 2147483710, but we only support messages up to 2147483647 bytes
'
[       OK ] Parameters/TestRpc.TestRpcSidecarLimits/SSL_TCP (5437 ms)
[ RUN      ] Parameters/TestRpc.TestCallTimeoutDoesntAffectNegotiation/SSL_TCP
I20260927 07:00:05.716526 23845 acceptor_pool.cc:254] collecting diagnostics on the listening RPC socket 0.0.0.0:37587 every 8 connection(s)
I20260927 07:00:05.716574 23846 acceptor_pool.cc:254] collecting diagnostics on the listening RPC socket 0.0.0.0:37587 every 8 connection(s)
W20260927 07:00:05.729437 23841 negotiation.cc:266] Injecting 500ms delay in negotiation
I20260927 07:00:05.779733 23553 rpc-test-base.h:595] status: Timed out: connection negotiation to 0.0.0.0:37587 for RPC Sleep timed out after 0.050s (ON_OUTBOUND_QUEUE), seconds elapsed: 0.0507033
[       OK ] Parameters/TestRpc.TestCallTimeoutDoesntAffectNegotiation/SSL_TCP (535 ms)
[ RUN      ] Parameters/TestRpc.TestRpcHandlerLatencyMetric/SSL_TCP
I20260927 07:00:06.246097 23870 acceptor_pool.cc:254] collecting diagnostics on the listening RPC socket 0.0.0.0:33843 every 8 connection(s)
I20260927 07:00:06.246243 23871 acceptor_pool.cc:254] collecting diagnostics on the listening RPC socket 0.0.0.0:33843 every 8 connection(s)
I20260927 07:00:06.278864 23553 rpc-test.cc:1236] Sleep() min lat: 20355
I20260927 07:00:06.278950 23553 rpc-test.cc:1237] Sleep() mean lat: 20355
I20260927 07:00:06.278987 23553 rpc-test.cc:1238] Sleep() max lat: 20355
I20260927 07:00:06.279013 23553 rpc-test.cc:1239] Sleep() #calls: 1
[       OK ] Parameters/TestRpc.TestRpcHandlerLatencyMetric/SSL_TCP (45 ms)
[ RUN      ] Parameters/TestRpc.TimedOutOnResponseMetricServiceQueue/SSL_TCP
I20260927 07:00:06.298842 23896 acceptor_pool.cc:254] collecting diagnostics on the listening RPC socket 0.0.0.0:39715 every 8 connection(s)
I20260927 07:00:06.298878 23897 acceptor_pool.cc:254] collecting diagnostics on the listening RPC socket 0.0.0.0:39715 every 8 connection(s)
W20260927 07:00:06.353606 23898 rpcz_store.cc:267] Call kudu.rpc_test.CalculatorService.Sleep from 127.0.0.1:50888 (request call id 2) took 20 ms (client timeout 20 ms). Trace:
W20260927 07:00:06.353744 23898 rpcz_store.cc:269] 0927 07:00:06.333309 (+     0us) service_pool.cc:170] Inserting onto call queue
0927 07:00:06.353568 (+ 20259us) service_pool.cc:214] Skipping call since client already timed out
0927 07:00:06.353579 (+    11us) inbound_call.cc:173] Queueing failure response
Metrics: {}
[       OK ] Parameters/TestRpc.TimedOutOnResponseMetricServiceQueue/SSL_TCP (74 ms)
[ RUN      ] Parameters/TestRpc.RpcPendingConnectionsMetric/SSL_TCP
I20260927 07:00:06.357085 23919 acceptor_pool.cc:254] collecting diagnostics on the listening RPC socket 0.0.0.0:37493 every 8 connection(s)
I20260927 07:00:06.357173 23920 acceptor_pool.cc:254] collecting diagnostics on the listening RPC socket 0.0.0.0:37493 every 8 connection(s)
W20260927 07:00:06.357785 23915 negotiation.cc:337] Failed RPC negotiation. Trace:
0927 07:00:06.357601 (+     0us) reactor.cc:625] Submitting negotiation task for server connection from 127.0.0.1:35862 (local address 127.0.0.1:37493)
0927 07:00:06.357660 (+    59us) server_negotiation.cc:206] Beginning negotiation
0927 07:00:06.357661 (+     1us) server_negotiation.cc:399] Waiting for connection header
0927 07:00:06.357731 (+    70us) negotiation.cc:327] Negotiation complete: Network error: Server connection negotiation failed: server connection from 127.0.0.1:35862: BlockingRecv error: recv got EOF from 127.0.0.1:35862 (error 108)
Metrics: {"server-negotiator.queue_time_us":30}
[       OK ] Parameters/TestRpc.RpcPendingConnectionsMetric/SSL_TCP (13 ms)
[ RUN      ] Parameters/TestRpc.TestRpcContextClientDeadline/SSL_TCP
I20260927 07:00:06.383966 23935 acceptor_pool.cc:254] collecting diagnostics on the listening RPC socket 0.0.0.0:41257 every 8 connection(s)
I20260927 07:00:06.384019 23936 acceptor_pool.cc:254] collecting diagnostics on the listening RPC socket 0.0.0.0:41257 every 8 connection(s)
[       OK ] Parameters/TestRpc.TestRpcContextClientDeadline/SSL_TCP (48 ms)
[ RUN      ] Parameters/TestRpc.TestApplicationFeatureFlagUnsupportedServer/SSL_TCP
I20260927 07:00:06.427467 23960 acceptor_pool.cc:254] collecting diagnostics on the listening RPC socket 0.0.0.0:44249 every 8 connection(s)
I20260927 07:00:06.427518 23961 acceptor_pool.cc:254] collecting diagnostics on the listening RPC socket 0.0.0.0:44249 every 8 connection(s)
[       OK ] Parameters/TestRpc.TestApplicationFeatureFlagUnsupportedServer/SSL_TCP (21 ms)
[ RUN      ] Parameters/TestRpc.TestCancellationAsync/SSL_TCP
I20260927 07:00:06.453828 23985 acceptor_pool.cc:254] collecting diagnostics on the listening RPC socket 0.0.0.0:34905 every 8 connection(s)
I20260927 07:00:06.453903 23986 acceptor_pool.cc:254] collecting diagnostics on the listening RPC socket 0.0.0.0:34905 every 8 connection(s)
I20260927 07:00:06.454031 23553 rpc-test.cc:1716] Connecting to 0.0.0.0:34905
I20260927 07:00:06.464104 23553 test_util.cc:268] Using random seed: 2145140325
I20260927 07:00:06.479203 23989 rpc-test-base.h:240] got call: sleep_micros: 500 pattern: 4294967295 num_repetitions: 2097152 sidecar_idx: 0
I20260927 07:00:06.492395 23989 rpc-test-base.h:240] got call: sleep_micros: 500 pattern: 4294967295 num_repetitions: 2097152 sidecar_idx: 0
I20260927 07:00:06.504258 23989 rpc-test-base.h:240] got call: sleep_micros: 500 pattern: 4294967295 num_repetitions: 2097152 sidecar_idx: 0
I20260927 07:00:06.516707 23989 rpc-test-base.h:240] got call: sleep_micros: 500 pattern: 4294967295 num_repetitions: 2097152 sidecar_idx: 0
I20260927 07:00:06.529145 23989 rpc-test-base.h:240] got call: sleep_micros: 500 pattern: 4294967295 num_repetitions: 2097152 sidecar_idx: 0
I20260927 07:00:06.542300 23989 rpc-test-base.h:240] got call: sleep_micros: 500 pattern: 4294967295 num_repetitions: 2097152 sidecar_idx: 0
I20260927 07:00:06.555049 23989 rpc-test-base.h:240] got call: sleep_micros: 500 pattern: 4294967295 num_repetitions: 2097152 sidecar_idx: 0
I20260927 07:00:06.567646 23989 rpc-test-base.h:240] got call: sleep_micros: 500 pattern: 4294967295 num_repetitions: 2097152 sidecar_idx: 0
W20260927 07:00:06.571063 23984 connection.cc:441] server connection from 127.0.0.1:41466 torn down before Call kudu.rpc.GenericCalculatorService.SleepWithSidecar from 127.0.0.1:41466 (request call id 9) could send its response
[       OK ] Parameters/TestRpc.TestCancellationAsync/SSL_TCP (133 ms)
[ RUN      ] Parameters/TestRpc.TestPerformanceBySocketType/SSL_TCP
I20260927 07:00:06.589095 24010 acceptor_pool.cc:254] collecting diagnostics on the listening RPC socket 0.0.0.0:43677 every 8 connection(s)
I20260927 07:00:06.589135 24011 acceptor_pool.cc:254] collecting diagnostics on the listening RPC socket 0.0.0.0:43677 every 8 connection(s)
I20260927 07:00:06.589296 23553 rpc-test.cc:1846] Connecting to 0.0.0.0:43677
I20260927 07:00:08.285959 23553 rpc-test.cc:1859] Sending 1024MB via ssl-enabled tcp socket: real 1.678s	user 1.557s	sys 1.421s
I20260927 07:00:09.956468 23553 rpc-test.cc:1859] Sending 1024MB via ssl-enabled tcp socket: real 1.670s	user 1.475s	sys 1.466s
I20260927 07:00:11.650728 23553 rpc-test.cc:1859] Sending 1024MB via ssl-enabled tcp socket: real 1.694s	user 1.522s	sys 1.476s
I20260927 07:00:13.267201 23553 rpc-test.cc:1859] Sending 1024MB via ssl-enabled tcp socket: real 1.616s	user 1.401s	sys 1.473s
I20260927 07:00:14.891063 23553 rpc-test.cc:1859] Sending 1024MB via ssl-enabled tcp socket: real 1.624s	user 1.394s	sys 1.489s
[       OK ] Parameters/TestRpc.TestPerformanceBySocketType/SSL_TCP (8320 ms)
[----------] 20 tests from Parameters/TestRpc (29776 ms total)

[----------] 1 test from Parameters/TestRpcSocketTxRxQueue
[ RUN      ] Parameters/TestRpcSocketTxRxQueue.OverCapacity/0
W20260927 07:00:15.163050 24027 negotiation.cc:337] Failed RPC negotiation. Trace:
0927 07:00:14.898824 (+     0us) reactor.cc:625] Submitting negotiation task for client connection to 0.0.0.0:46741 (local address 127.0.0.1:52878)
0927 07:00:14.898893 (+    69us) negotiation.cc:107] Waiting for socket to connect
0927 07:00:14.898904 (+    11us) client_negotiation.cc:174] Beginning negotiation
0927 07:00:14.898958 (+    54us) client_negotiation.cc:252] Sending NEGOTIATE NegotiatePB request
0927 07:00:15.162903 (+263945us) negotiation.cc:327] Negotiation complete: Network error: Client connection negotiation failed: client connection to 0.0.0.0:46741: BlockingRecv error: recv error from unknown peer: Transport endpoint is not connected (error 107)
Metrics: {"client-negotiator.queue_time_us":40}
W20260927 07:00:15.163175 24072 negotiation.cc:337] Failed RPC negotiation. Trace:
0927 07:00:14.903370 (+     0us) reactor.cc:625] Submitting negotiation task for client connection to 0.0.0.0:46741 (local address 127.0.0.1:52922)
0927 07:00:14.903433 (+    63us) negotiation.cc:107] Waiting for socket to connect
0927 07:00:14.903442 (+     9us) client_negotiation.cc:174] Beginning negotiation
0927 07:00:14.903481 (+    39us) client_negotiation.cc:252] Sending NEGOTIATE NegotiatePB request
0927 07:00:15.163142 (+259661us) negotiation.cc:327] Negotiation complete: Network error: Client connection negotiation failed: client connection to 0.0.0.0:46741: BlockingRecv error: recv error from unknown peer: Transport endpoint is not connected (error 107)
Metrics: {"client-negotiator.queue_time_us":43}
W20260927 07:00:15.163255 24036 negotiation.cc:337] Failed RPC negotiation. Trace:
0927 07:00:14.899731 (+     0us) reactor.cc:625] Submitting negotiation task for client connection to 0.0.0.0:46741 (local address 127.0.0.1:52892)
0927 07:00:14.899791 (+    60us) negotiation.cc:107] Waiting for socket to connect
0927 07:00:14.899800 (+     9us) client_negotiation.cc:174] Beginning negotiation
0927 07:00:14.899847 (+    47us) client_negotiation.cc:252] Sending NEGOTIATE NegotiatePB request
0927 07:00:15.162953 (+263106us) negotiation.cc:327] Negotiation complete: Network error: Client connection negotiation failed: client connection to 0.0.0.0:46741: BlockingRecv error: recv error from unknown peer: Transport endpoint is not connected (error 107)
Metrics: {"client-negotiator.queue_time_us":36}
W20260927 07:00:15.163074 24045 negotiation.cc:337] Failed RPC negotiation. Trace:
0927 07:00:14.900586 (+     0us) reactor.cc:625] Submitting negotiation task for client connection to 0.0.0.0:46741 (local address 127.0.0.1:52896)
0927 07:00:14.900643 (+    57us) negotiation.cc:107] Waiting for socket to connect
0927 07:00:14.900652 (+     9us) client_negotiation.cc:174] Beginning negotiation
0927 07:00:14.900692 (+    40us) client_negotiation.cc:252] Sending NEGOTIATE NegotiatePB request
0927 07:00:15.162954 (+262262us) negotiation.cc:327] Negotiation complete: Network error: Client connection negotiation failed: client connection to 0.0.0.0:46741: BlockingRecv error: recv error from unknown peer: Transport endpoint is not connected (error 107)
Metrics: {"client-negotiator.queue_time_us":36}
W20260927 07:00:15.163511 24054 negotiation.cc:337] Failed RPC negotiation. Trace:
0927 07:00:14.901451 (+     0us) reactor.cc:625] Submitting negotiation task for client connection to 0.0.0.0:46741 (local address 127.0.0.1:52906)
0927 07:00:14.901505 (+    54us) negotiation.cc:107] Waiting for socket to connect
0927 07:00:14.901514 (+     9us) client_negotiation.cc:174] Beginning negotiation
0927 07:00:14.901552 (+    38us) client_negotiation.cc:252] Sending NEGOTIATE NegotiatePB request
0927 07:00:15.162945 (+261393us) negotiation.cc:327] Negotiation complete: Network error: Client connection negotiation failed: client connection to 0.0.0.0:46741: BlockingRecv error: recv error from unknown peer: Transport endpoint is not connected (error 107)
Metrics: {"client-negotiator.queue_time_us":33}
W20260927 07:00:15.163666 24063 negotiation.cc:337] Failed RPC negotiation. Trace:
0927 07:00:14.902417 (+     0us) reactor.cc:625] Submitting negotiation task for client connection to 0.0.0.0:46741 (local address 127.0.0.1:52910)
0927 07:00:14.902504 (+    87us) negotiation.cc:107] Waiting for socket to connect
0927 07:00:14.902513 (+     9us) client_negotiation.cc:174] Beginning negotiation
0927 07:00:14.902552 (+    39us) client_negotiation.cc:252] Sending NEGOTIATE NegotiatePB request
0927 07:00:15.163024 (+260472us) negotiation.cc:327] Negotiation complete: Network error: Client connection negotiation failed: client connection to 0.0.0.0:46741: BlockingRecv error: recv error from unknown peer: Transport endpoint is not connected (error 107)
Metrics: {"client-negotiator.queue_time_us":67}
[       OK ] Parameters/TestRpcSocketTxRxQueue.OverCapacity/0 (1042 ms)
[----------] 1 test from Parameters/TestRpcSocketTxRxQueue (1042 ms total)

[----------] Global test environment tear-down
[==========] 21 tests from 2 test suites ran. (30818 ms total)
[  PASSED  ] 20 tests.
[  FAILED  ] 1 test, listed below:
[  FAILED  ] Parameters/TestRpc.TestCallWithChainCertAndChainCA/SSL_TCP, where GetParam() = (true, false)

 1 FAILED TEST