Diagnosed failure
Parameters/TestRpc.TestCallWithChainCertAndChainCA/SSL_UnixSocket: /data0/somelongdirectorytoavoidrpathissues/src/kudu/src/kudu/rpc/rpc-test.cc:270: Failure
Failed
Bad status: Runtime error: could not verify certificate chain (error with cert: subject=CN = localhost, ST = sadfjas, C = AS, emailAddress = sdflkdsajf, O = lskdfjlsad, OU = sldfkja, issuer=C = AS, ST = ASDfkjdhf, L = lskdjf, O = saldfja, OU = skdjf, CN = localhost, emailAddress = sadjflkadsj): : certificate has expired
Google Test trace:
/data0/somelongdirectorytoavoidrpathissues/src/kudu/src/kudu/rpc/rpc-test.cc:267: Connecting to unix:/tmp/dist-test-taskIhWyri/test-tmp/rpc-test-b3b91183d96445debeac5940424fb733.sock
I20260927 03:53:41.006440 1230 test_util.cc:175] -----------------------------------------------
I20260927 03:53:41.006517 1230 test_util.cc:176] Had fatal failures, leaving test files at /tmp/dist-test-taskIhWyri/test-tmp/rpc-test.6.Parameters_TestRpc.TestCallWithChainCertAndChainCA_SSL_UnixSocket.1790481220928977-1230-0
Full log
Note: This is test shard 7 of 8.
[==========] Running 21 tests from 2 test suites.
[----------] Global test environment set-up.
[----------] 20 tests from Parameters/TestRpc
[ RUN ] Parameters/TestRpc.TestMessengerCreateDestroy/SSL_UnixSocket
WARNING: Logging before InitGoogleLogging() is written to STDERR
I20260927 03:53:40.956815 1230 rpc-test.cc:169] started messenger TestCreateDestroy
[ OK ] Parameters/TestRpc.TestMessengerCreateDestroy/SSL_UnixSocket (25 ms)
[ RUN ] Parameters/TestRpc.TestNegotiationDeadlock/SSL_UnixSocket
I20260927 03:53:40.971807 1251 acceptor_pool.cc:254] collecting diagnostics on the listening RPC socket unix:/tmp/dist-test-taskIhWyri/test-tmp/rpc-test-5c0bdee7a14b450ba3f987773d9417d1.sock every 8 connection(s)
I20260927 03:53:40.971807 1250 acceptor_pool.cc:254] collecting diagnostics on the listening RPC socket unix:/tmp/dist-test-taskIhWyri/test-tmp/rpc-test-5c0bdee7a14b450ba3f987773d9417d1.sock every 8 connection(s)
[ OK ] Parameters/TestRpc.TestNegotiationDeadlock/SSL_UnixSocket (20 ms)
[ RUN ] Parameters/TestRpc.TestCallWithChainCertAndChainCA/SSL_UnixSocket
I20260927 03:53:41.002166 1266 acceptor_pool.cc:254] collecting diagnostics on the listening RPC socket unix:/tmp/dist-test-taskIhWyri/test-tmp/rpc-test-b3b91183d96445debeac5940424fb733.sock every 8 connection(s)
I20260927 03:53:41.002166 1267 acceptor_pool.cc:254] collecting diagnostics on the listening RPC socket unix:/tmp/dist-test-taskIhWyri/test-tmp/rpc-test-b3b91183d96445debeac5940424fb733.sock every 8 connection(s)
/data0/somelongdirectorytoavoidrpathissues/src/kudu/src/kudu/rpc/rpc-test.cc:270: Failure
Failed
Bad status: Runtime error: could not verify certificate chain (error with cert: subject=CN = localhost, ST = sadfjas, C = AS, emailAddress = sdflkdsajf, O = lskdfjlsad, OU = sldfkja, issuer=C = AS, ST = ASDfkjdhf, L = lskdjf, O = saldfja, OU = skdjf, CN = localhost, emailAddress = sadjflkadsj): : certificate has expired
Google Test trace:
/data0/somelongdirectorytoavoidrpathissues/src/kudu/src/kudu/rpc/rpc-test.cc:267: Connecting to unix:/tmp/dist-test-taskIhWyri/test-tmp/rpc-test-b3b91183d96445debeac5940424fb733.sock
I20260927 03:53:41.006440 1230 test_util.cc:175] -----------------------------------------------
I20260927 03:53:41.006517 1230 test_util.cc:176] Had fatal failures, leaving test files at /tmp/dist-test-taskIhWyri/test-tmp/rpc-test.6.Parameters_TestRpc.TestCallWithChainCertAndChainCA_SSL_UnixSocket.1790481220928977-1230-0
[ FAILED ] Parameters/TestRpc.TestCallWithChainCertAndChainCA/SSL_UnixSocket, where GetParam() = (true, true) (27 ms)
[ RUN ] Parameters/TestRpc.TestCallWithPasswordProtectedKey/SSL_UnixSocket
I20260927 03:53:41.013343 1292 acceptor_pool.cc:254] collecting diagnostics on the listening RPC socket unix:/tmp/dist-test-taskIhWyri/test-tmp/rpc-test-df62935151c641bba02e573c31274ba8.sock every 8 connection(s)
I20260927 03:53:41.013343 1291 acceptor_pool.cc:254] collecting diagnostics on the listening RPC socket unix:/tmp/dist-test-taskIhWyri/test-tmp/rpc-test-df62935151c641bba02e573c31274ba8.sock every 8 connection(s)
W20260927 03:53:41.025429 1288 connection.cc:196] Error closing socket: Network error: TlsSocket::Close: Broken pipe
[ OK ] Parameters/TestRpc.TestCallWithPasswordProtectedKey/SSL_UnixSocket (19 ms)
[ RUN ] Parameters/TestRpc.TestCallToBadServer/SSL_UnixSocket
I20260927 03:53:41.046123 1230 rpc-test.cc:394] Status: Network error: Client connection negotiation failed: client connection to 0.0.0.0:0: connect: Connection refused (error 111)
I20260927 03:53:41.046675 1230 rpc-test.cc:394] Status: Network error: Client connection negotiation failed: client connection to 0.0.0.0:0: connect: Connection refused (error 111)
I20260927 03:53:41.047075 1230 rpc-test.cc:394] Status: Network error: Client connection negotiation failed: client connection to 0.0.0.0:0: connect: Connection refused (error 111)
I20260927 03:53:41.047344 1230 rpc-test.cc:394] Status: Network error: Client connection negotiation failed: client connection to 0.0.0.0:0: connect: Connection refused (error 111)
I20260927 03:53:41.047636 1230 rpc-test.cc:394] Status: Network error: Client connection negotiation failed: client connection to 0.0.0.0:0: connect: Connection refused (error 111)
[ OK ] Parameters/TestRpc.TestCallToBadServer/SSL_UnixSocket (21 ms)
[ RUN ] Parameters/TestRpc.TestWrongService/SSL_UnixSocket
I20260927 03:53:41.059105 1326 acceptor_pool.cc:254] collecting diagnostics on the listening RPC socket unix:/tmp/dist-test-taskIhWyri/test-tmp/rpc-test-1242b551885b4a61b9f1078eadf6c360.sock every 8 connection(s)
I20260927 03:53:41.059168 1327 acceptor_pool.cc:254] collecting diagnostics on the listening RPC socket unix:/tmp/dist-test-taskIhWyri/test-tmp/rpc-test-1242b551885b4a61b9f1078eadf6c360.sock every 8 connection(s)
I20260927 03:53:41.073835 1323 messenger.cc:345] service WrongServiceName not registered on TestServer
[ OK ] Parameters/TestRpc.TestWrongService/SSL_UnixSocket (27 ms)
[ RUN ] Parameters/TestRpc.TestConnectionKeepalive/SSL_UnixSocket
I20260927 03:53:41.085011 1349 acceptor_pool.cc:254] collecting diagnostics on the listening RPC socket unix:/tmp/dist-test-taskIhWyri/test-tmp/rpc-test-30d0223851d5427d9c61174ebb63b605.sock every 8 connection(s)
I20260927 03:53:41.085250 1230 rpc-test.cc:488] Connecting to unix:/tmp/dist-test-taskIhWyri/test-tmp/rpc-test-30d0223851d5427d9c61174ebb63b605.sock
I20260927 03:53:41.085029 1350 acceptor_pool.cc:254] collecting diagnostics on the listening RPC socket unix:/tmp/dist-test-taskIhWyri/test-tmp/rpc-test-30d0223851d5427d9c61174ebb63b605.sock every 8 connection(s)
W20260927 03:53:41.577236 1362 connection.cc:196] Error closing socket: Network error: TlsSocket::Close: Broken pipe
[ OK ] Parameters/TestRpc.TestConnectionKeepalive/SSL_UnixSocket (1025 ms)
[ RUN ] Parameters/TestRpc.TestClientConnectionMetrics/SSL_UnixSocket
I20260927 03:53:42.119215 1374 acceptor_pool.cc:254] collecting diagnostics on the listening RPC socket unix:/tmp/dist-test-taskIhWyri/test-tmp/rpc-test-f3c9e11ab7e643148b21034d60defd67.sock every 8 connection(s)
I20260927 03:53:42.119251 1375 acceptor_pool.cc:254] collecting diagnostics on the listening RPC socket unix:/tmp/dist-test-taskIhWyri/test-tmp/rpc-test-f3c9e11ab7e643148b21034d60defd67.sock every 8 connection(s)
I20260927 03:53:42.119488 1230 rpc-test.cc:569] Connecting to unix:/tmp/dist-test-taskIhWyri/test-tmp/rpc-test-f3c9e11ab7e643148b21034d60defd67.sock
W20260927 03:53:50.600419 1371 connection.cc:196] Error closing socket: Network error: TlsSocket::Close: Broken pipe
[ OK ] Parameters/TestRpc.TestClientConnectionMetrics/SSL_UnixSocket (8500 ms)
[ RUN ] Parameters/TestRpc.TestCredentialsPolicy/SSL_UnixSocket
I20260927 03:53:50.618858 1397 acceptor_pool.cc:254] collecting diagnostics on the listening RPC socket unix:/tmp/dist-test-taskIhWyri/test-tmp/rpc-test-dbfb2c7eb76a42149500dd18329750b8.sock every 8 connection(s)
I20260927 03:53:50.619000 1398 acceptor_pool.cc:254] collecting diagnostics on the listening RPC socket unix:/tmp/dist-test-taskIhWyri/test-tmp/rpc-test-dbfb2c7eb76a42149500dd18329750b8.sock every 8 connection(s)
I20260927 03:53:50.619099 1230 rpc-test.cc:700] Connecting to unix:/tmp/dist-test-taskIhWyri/test-tmp/rpc-test-dbfb2c7eb76a42149500dd18329750b8.sock
W20260927 03:53:50.643971 1396 connection.cc:196] Error closing socket: Network error: TlsSocket::Close: Broken pipe
W20260927 03:53:50.647891 1396 connection.cc:196] Error closing socket: Network error: TlsSocket::Close: Broken pipe
[ OK ] Parameters/TestRpc.TestCredentialsPolicy/SSL_UnixSocket (47 ms)
[ RUN ] Parameters/TestRpc.TestCallLongerThanKeepalive/SSL_UnixSocket
I20260927 03:53:50.659932 1422 acceptor_pool.cc:254] collecting diagnostics on the listening RPC socket unix:/tmp/dist-test-taskIhWyri/test-tmp/rpc-test-43f6712c3ac64867884b5beb2075d8de.sock every 8 connection(s)
I20260927 03:53:50.659986 1423 acceptor_pool.cc:254] collecting diagnostics on the listening RPC socket unix:/tmp/dist-test-taskIhWyri/test-tmp/rpc-test-43f6712c3ac64867884b5beb2075d8de.sock every 8 connection(s)
I20260927 03:53:50.690656 1426 rpc-test-base.h:222] got call: sleep_micros: 3000000 deferred: true
I20260927 03:53:53.691354 1426 rpcz_store.cc:275] Call kudu.rpc.GenericCalculatorService.Sleep from unix:<unnamed> (request call id 0) took 3000 ms. Trace:
I20260927 03:53:53.691576 1426 rpcz_store.cc:276] 0927 03:53:50.690576 (+ 0us) service_pool.cc:170] Inserting onto call queue
0927 03:53:50.690633 (+ 57us) service_pool.cc:227] Handling call
0927 03:53:53.691335 (+3000702us) inbound_call.cc:173] Queueing success response
Metrics: {}
[ OK ] Parameters/TestRpc.TestCallLongerThanKeepalive/SSL_UnixSocket (3045 ms)
[ RUN ] Parameters/TestRpc.TestRpcSidecar/SSL_UnixSocket
I20260927 03:53:53.711591 1447 acceptor_pool.cc:254] collecting diagnostics on the listening RPC socket unix:/tmp/dist-test-taskIhWyri/test-tmp/rpc-test-955cdd4e92154a828a1f96ac45f39bb7.sock every 8 connection(s)
I20260927 03:53:53.711618 1448 acceptor_pool.cc:254] collecting diagnostics on the listening RPC socket unix:/tmp/dist-test-taskIhWyri/test-tmp/rpc-test-955cdd4e92154a828a1f96ac45f39bb7.sock every 8 connection(s)
[ OK ] Parameters/TestRpc.TestRpcSidecar/SSL_UnixSocket (78 ms)
[ RUN ] Parameters/TestRpc.TestRpcSidecarLimits/SSL_UnixSocket
I20260927 03:53:55.560578 1472 acceptor_pool.cc:254] collecting diagnostics on the listening RPC socket unix:/tmp/dist-test-taskIhWyri/test-tmp/rpc-test-29c12b9c15ad4367962ca4a56c3ea8db.sock every 8 connection(s)
I20260927 03:53:55.560618 1473 acceptor_pool.cc:254] collecting diagnostics on the listening RPC socket unix:/tmp/dist-test-taskIhWyri/test-tmp/rpc-test-29c12b9c15ad4367962ca4a56c3ea8db.sock every 8 connection(s)
W20260927 03:53:55.570902 1230 serialization.cc:72] Serialized kudu.rpc_test.PushStringsRequestPB (2147483654 bytes) is larger than the maximum configured RPC message size (52428800 bytes). Sending anyway, but peer may reject the data.
W20260927 03:53:55.574378 1469 connection.cc:535] server connection from unix:<unnamed> recv error: Network error: RPC frame had a length of 2147483714, but we only support messages up to 52428800 bytes long.
W20260927 03:53:55.574429 1469 connection.cc:158] shutting down server connection from unix:<unnamed> with pending inbound data: 4/2147483714 bytes received; last active 0 ns ago: status Network error: RPC frame had a length of 2147483714, but we only support messages up to 52428800 bytes long.
W20260927 03:53:55.574551 1485 connection.cc:698] client connection to unix:/tmp/dist-test-taskIhWyri/test-tmp/rpc-test-29c12b9c15ad4367962ca4a56c3ea8db.sock send error: Network error: failed to write to TLS socket: Broken pipe
W20260927 03:53:55.574694 1485 connection.cc:196] Error closing socket: Network error: TlsSocket::Close: Success
I20260927 03:53:55.588331 1497 acceptor_pool.cc:254] collecting diagnostics on the listening RPC socket unix:/tmp/dist-test-taskIhWyri/test-tmp/rpc-test-29c12b9c15ad4367962ca4a56c3ea8db.sock every 8 connection(s)
I20260927 03:53:55.588333 1498 acceptor_pool.cc:254] collecting diagnostics on the listening RPC socket unix:/tmp/dist-test-taskIhWyri/test-tmp/rpc-test-29c12b9c15ad4367962ca4a56c3ea8db.sock every 8 connection(s)
W20260927 03:54:00.058130 1494 connection.cc:577] server connection from unix:<unnamed>: received bad data: 'Corruption: Invalid packet: message had a length of 2147483710, but we only support messages up to 2147483647 bytes
'
W20260927 03:54:00.058468 1510 connection.cc:196] Error closing socket: Network error: TlsSocket::Close: Broken pipe
[ OK ] Parameters/TestRpc.TestRpcSidecarLimits/SSL_UnixSocket (6288 ms)
[ RUN ] Parameters/TestRpc.TestCallTimeoutDoesntAffectNegotiation/SSL_UnixSocket
I20260927 03:54:00.066939 1522 acceptor_pool.cc:254] collecting diagnostics on the listening RPC socket unix:/tmp/dist-test-taskIhWyri/test-tmp/rpc-test-46df2d46036948e29e3b403efaa4def9.sock every 8 connection(s)
I20260927 03:54:00.067082 1523 acceptor_pool.cc:254] collecting diagnostics on the listening RPC socket unix:/tmp/dist-test-taskIhWyri/test-tmp/rpc-test-46df2d46036948e29e3b403efaa4def9.sock every 8 connection(s)
W20260927 03:54:00.098824 1518 negotiation.cc:266] Injecting 500ms delay in negotiation
I20260927 03:54:00.149132 1230 rpc-test-base.h:595] status: Timed out: connection negotiation to unix:/tmp/dist-test-taskIhWyri/test-tmp/rpc-test-46df2d46036948e29e3b403efaa4def9.sock for RPC Sleep timed out after 0.050s (ON_OUTBOUND_QUEUE), seconds elapsed: 0.0507981
[ OK ] Parameters/TestRpc.TestCallTimeoutDoesntAffectNegotiation/SSL_UnixSocket (543 ms)
[ RUN ] Parameters/TestRpc.TestRpcHandlerLatencyMetric/SSL_UnixSocket
I20260927 03:54:00.619439 1547 acceptor_pool.cc:254] collecting diagnostics on the listening RPC socket unix:/tmp/dist-test-taskIhWyri/test-tmp/rpc-test-00c98a1a7a214fd589c32a574c188016.sock every 8 connection(s)
I20260927 03:54:00.619480 1548 acceptor_pool.cc:254] collecting diagnostics on the listening RPC socket unix:/tmp/dist-test-taskIhWyri/test-tmp/rpc-test-00c98a1a7a214fd589c32a574c188016.sock every 8 connection(s)
I20260927 03:54:00.663101 1230 rpc-test.cc:1236] Sleep() min lat: 20371
I20260927 03:54:00.663183 1230 rpc-test.cc:1237] Sleep() mean lat: 20371
I20260927 03:54:00.663210 1230 rpc-test.cc:1238] Sleep() max lat: 20371
I20260927 03:54:00.663223 1230 rpc-test.cc:1239] Sleep() #calls: 1
W20260927 03:54:00.663965 1544 connection.cc:196] Error closing socket: Network error: TlsSocket::Close: Broken pipe
[ OK ] Parameters/TestRpc.TestRpcHandlerLatencyMetric/SSL_UnixSocket (60 ms)
[ RUN ] Parameters/TestRpc.TimedOutOnResponseMetricServiceQueue/SSL_UnixSocket
I20260927 03:54:00.688066 1573 acceptor_pool.cc:254] collecting diagnostics on the listening RPC socket unix:/tmp/dist-test-taskIhWyri/test-tmp/rpc-test-f1d9e516631f4885b8a84fc5e24b92d8.sock every 8 connection(s)
I20260927 03:54:00.688100 1574 acceptor_pool.cc:254] collecting diagnostics on the listening RPC socket unix:/tmp/dist-test-taskIhWyri/test-tmp/rpc-test-f1d9e516631f4885b8a84fc5e24b92d8.sock every 8 connection(s)
W20260927 03:54:00.739023 1575 rpcz_store.cc:267] Call kudu.rpc_test.CalculatorService.Sleep from unix:<unnamed> (request call id 2) took 20 ms (client timeout 20 ms). Trace:
W20260927 03:54:00.739156 1575 rpcz_store.cc:269] 0927 03:54:00.718764 (+ 0us) service_pool.cc:170] Inserting onto call queue
0927 03:54:00.738994 (+ 20230us) service_pool.cc:214] Skipping call since client already timed out
0927 03:54:00.739006 (+ 12us) inbound_call.cc:173] Queueing failure response
Metrics: {}
[ OK ] Parameters/TestRpc.TimedOutOnResponseMetricServiceQueue/SSL_UnixSocket (75 ms)
[ RUN ] Parameters/TestRpc.RpcPendingConnectionsMetric/SSL_UnixSocket
I20260927 03:54:00.742834 1596 acceptor_pool.cc:254] collecting diagnostics on the listening RPC socket 0.0.0.0:38397 every 8 connection(s)
I20260927 03:54:00.742965 1597 acceptor_pool.cc:254] collecting diagnostics on the listening RPC socket 0.0.0.0:38397 every 8 connection(s)
W20260927 03:54:00.752398 1592 negotiation.cc:337] Failed RPC negotiation. Trace:
0927 03:54:00.752118 (+ 0us) reactor.cc:625] Submitting negotiation task for server connection from 127.0.0.1:60710 (local address 127.0.0.1:38397)
0927 03:54:00.752198 (+ 80us) server_negotiation.cc:206] Beginning negotiation
0927 03:54:00.752201 (+ 3us) server_negotiation.cc:399] Waiting for connection header
0927 03:54:00.752298 (+ 97us) negotiation.cc:327] Negotiation complete: Network error: Server connection negotiation failed: server connection from 127.0.0.1:60710: BlockingRecv error: recv got EOF from 127.0.0.1:60710 (error 108)
Metrics: {"server-negotiator.queue_time_us":34}
[ OK ] Parameters/TestRpc.RpcPendingConnectionsMetric/SSL_UnixSocket (22 ms)
[ RUN ] Parameters/TestRpc.TestRpcContextClientDeadline/SSL_UnixSocket
I20260927 03:54:00.773396 1613 acceptor_pool.cc:254] collecting diagnostics on the listening RPC socket unix:/tmp/dist-test-taskIhWyri/test-tmp/rpc-test-561361c0e1a149378c2cc8f145aa8cca.sock every 8 connection(s)
I20260927 03:54:00.773475 1612 acceptor_pool.cc:254] collecting diagnostics on the listening RPC socket unix:/tmp/dist-test-taskIhWyri/test-tmp/rpc-test-561361c0e1a149378c2cc8f145aa8cca.sock every 8 connection(s)
[ OK ] Parameters/TestRpc.TestRpcContextClientDeadline/SSL_UnixSocket (48 ms)
[ RUN ] Parameters/TestRpc.TestApplicationFeatureFlagUnsupportedServer/SSL_UnixSocket
I20260927 03:54:00.836860 1637 acceptor_pool.cc:254] collecting diagnostics on the listening RPC socket unix:/tmp/dist-test-taskIhWyri/test-tmp/rpc-test-c86d344aee78432aae3ed8f213b638fb.sock every 8 connection(s)
I20260927 03:54:00.836899 1638 acceptor_pool.cc:254] collecting diagnostics on the listening RPC socket unix:/tmp/dist-test-taskIhWyri/test-tmp/rpc-test-c86d344aee78432aae3ed8f213b638fb.sock every 8 connection(s)
[ OK ] Parameters/TestRpc.TestApplicationFeatureFlagUnsupportedServer/SSL_UnixSocket (47 ms)
[ RUN ] Parameters/TestRpc.TestCancellationAsync/SSL_UnixSocket
I20260927 03:54:00.879426 1662 acceptor_pool.cc:254] collecting diagnostics on the listening RPC socket unix:/tmp/dist-test-taskIhWyri/test-tmp/rpc-test-e2ab9efec9214521b44b943c775e04df.sock every 8 connection(s)
I20260927 03:54:00.879492 1663 acceptor_pool.cc:254] collecting diagnostics on the listening RPC socket unix:/tmp/dist-test-taskIhWyri/test-tmp/rpc-test-e2ab9efec9214521b44b943c775e04df.sock every 8 connection(s)
I20260927 03:54:00.879657 1230 rpc-test.cc:1716] Connecting to unix:/tmp/dist-test-taskIhWyri/test-tmp/rpc-test-e2ab9efec9214521b44b943c775e04df.sock
I20260927 03:54:00.886258 1230 test_util.cc:268] Using random seed: -430502929
I20260927 03:54:00.902562 1666 rpc-test-base.h:240] got call: sleep_micros: 500 pattern: 4294967295 num_repetitions: 2097152 sidecar_idx: 0
I20260927 03:54:00.914183 1666 rpc-test-base.h:240] got call: sleep_micros: 500 pattern: 4294967295 num_repetitions: 2097152 sidecar_idx: 0
I20260927 03:54:00.925230 1666 rpc-test-base.h:240] got call: sleep_micros: 500 pattern: 4294967295 num_repetitions: 2097152 sidecar_idx: 0
I20260927 03:54:00.936376 1666 rpc-test-base.h:240] got call: sleep_micros: 500 pattern: 4294967295 num_repetitions: 2097152 sidecar_idx: 0
I20260927 03:54:00.947211 1666 rpc-test-base.h:240] got call: sleep_micros: 500 pattern: 4294967295 num_repetitions: 2097152 sidecar_idx: 0
I20260927 03:54:00.957996 1666 rpc-test-base.h:240] got call: sleep_micros: 500 pattern: 4294967295 num_repetitions: 2097152 sidecar_idx: 0
I20260927 03:54:00.968907 1666 rpc-test-base.h:240] got call: sleep_micros: 500 pattern: 4294967295 num_repetitions: 2097152 sidecar_idx: 0
I20260927 03:54:00.979888 1666 rpc-test-base.h:240] got call: sleep_micros: 500 pattern: 4294967295 num_repetitions: 2097152 sidecar_idx: 0
W20260927 03:54:00.981638 1659 connection.cc:196] Error closing socket: Network error: TlsSocket::Close: Broken pipe
W20260927 03:54:00.983009 1659 connection.cc:441] server connection from unix:<unnamed> torn down before Call kudu.rpc.GenericCalculatorService.SleepWithSidecar from unix:<unnamed> (request call id 9) could send its response
[ OK ] Parameters/TestRpc.TestCancellationAsync/SSL_UnixSocket (124 ms)
[ RUN ] Parameters/TestRpc.TestPerformanceBySocketType/SSL_UnixSocket
I20260927 03:54:00.996479 1687 acceptor_pool.cc:254] collecting diagnostics on the listening RPC socket unix:/tmp/dist-test-taskIhWyri/test-tmp/rpc-test-a346e74b3fd54e6e828e34575299ccf6.sock every 8 connection(s)
I20260927 03:54:00.996526 1688 acceptor_pool.cc:254] collecting diagnostics on the listening RPC socket unix:/tmp/dist-test-taskIhWyri/test-tmp/rpc-test-a346e74b3fd54e6e828e34575299ccf6.sock every 8 connection(s)
I20260927 03:54:00.996702 1230 rpc-test.cc:1846] Connecting to unix:/tmp/dist-test-taskIhWyri/test-tmp/rpc-test-a346e74b3fd54e6e828e34575299ccf6.sock
I20260927 03:54:02.557879 1230 rpc-test.cc:1859] Sending 1024MB via ssl-enabled unix socket: real 1.545s user 1.740s sys 0.976s
I20260927 03:54:03.980728 1230 rpc-test.cc:1859] Sending 1024MB via ssl-enabled unix socket: real 1.423s user 1.559s sys 0.948s
I20260927 03:54:05.446254 1230 rpc-test.cc:1859] Sending 1024MB via ssl-enabled unix socket: real 1.465s user 1.553s sys 1.021s
I20260927 03:54:06.870479 1230 rpc-test.cc:1859] Sending 1024MB via ssl-enabled unix socket: real 1.424s user 1.592s sys 0.907s
I20260927 03:54:08.332336 1230 rpc-test.cc:1859] Sending 1024MB via ssl-enabled unix socket: real 1.462s user 1.586s sys 0.977s
W20260927 03:54:08.333254 1684 connection.cc:196] Error closing socket: Network error: TlsSocket::Close: Broken pipe
[ OK ] Parameters/TestRpc.TestPerformanceBySocketType/SSL_UnixSocket (7350 ms)
[----------] 20 tests from Parameters/TestRpc (27402 ms total)
[----------] 1 test from Parameters/TestRpcSocketTxRxQueue
[ RUN ] Parameters/TestRpcSocketTxRxQueue.AcceptorRxQueueSizeMetric/0
I20260927 03:54:08.342061 1712 acceptor_pool.cc:254] collecting diagnostics on the listening RPC socket 0.0.0.0:35611 every 1 connection(s)
I20260927 03:54:08.342106 1713 acceptor_pool.cc:254] collecting diagnostics on the listening RPC socket 0.0.0.0:35611 every 1 connection(s)
W20260927 03:54:08.342707 1708 negotiation.cc:337] Failed RPC negotiation. Trace:
0927 03:54:08.342551 (+ 0us) reactor.cc:625] Submitting negotiation task for server connection from 127.0.0.1:50120 (local address 127.0.0.1:35611)
0927 03:54:08.342600 (+ 49us) server_negotiation.cc:206] Beginning negotiation
0927 03:54:08.342602 (+ 2us) server_negotiation.cc:399] Waiting for connection header
0927 03:54:08.342673 (+ 71us) negotiation.cc:327] Negotiation complete: Network error: Server connection negotiation failed: server connection from 127.0.0.1:50120: BlockingRecv error: recv got EOF from 127.0.0.1:50120 (error 108)
Metrics: {"server-negotiator.queue_time_us":20}
[ OK ] Parameters/TestRpcSocketTxRxQueue.AcceptorRxQueueSizeMetric/0 (10 ms)
[----------] 1 test from Parameters/TestRpcSocketTxRxQueue (10 ms total)
[----------] Global test environment tear-down
[==========] 21 tests from 2 test suites ran. (27413 ms total)
[ PASSED ] 20 tests.
[ FAILED ] 1 test, listed below:
[ FAILED ] Parameters/TestRpc.TestCallWithChainCertAndChainCA/SSL_UnixSocket, where GetParam() = (true, true)
1 FAILED TEST