Parameters/TestRpc.TestCallWithChainCertAndRootCA/SSL_TCP: /data0/somelongdirectorytoavoidrpathissues/src/kudu/src/kudu/rpc/rpc-test.cc:303: Failure
Failed
Bad status: Runtime error: could not verify certificate chain (error with cert: subject=CN = localhost, ST = sadfjas, C = AS, emailAddress = sdflkdsajf, O = lskdfjlsad, OU = sldfkja, issuer=C = AS, ST = ASDfkjdhf, L = lskdjf, O = saldfja, OU = skdjf, CN = localhost, emailAddress = sadjflkadsj): : certificate has expired
Google Test trace:
/data0/somelongdirectorytoavoidrpathissues/src/kudu/src/kudu/rpc/rpc-test.cc:300: Connecting to 0.0.0.0:38193
I20260924 14:26:59.762128 7698 test_util.cc:175] -----------------------------------------------
I20260924 14:26:59.762307 7698 test_util.cc:176] Had fatal failures, leaving test files at /tmp/dist-test-taskrOd8O2/test-tmp/rpc-test.1.Parameters_TestRpc.TestCallWithChainCertAndRootCA_SSL_TCP.1790260018139315-7698-0
Note: This is test shard 2 of 8.
[==========] Running 21 tests from 2 test suites.
[----------] Global test environment set-up.
[----------] 1 test from TestRpc
[ RUN ] TestRpc.TestMethodsByName
[ OK ] TestRpc.TestMethodsByName (6 ms)
[----------] 1 test from TestRpc (6 ms total)
[----------] 20 tests from Parameters/TestRpc
[ RUN ] Parameters/TestRpc.TestAcceptorPoolStartStop/SSL_TCP
WARNING: Logging before InitGoogleLogging() is written to STDERR
I20260924 14:26:58.249750 7713 acceptor_pool.cc:254] collecting diagnostics on the listening RPC socket 0.0.0.0:39589 every 8 connection(s)
I20260924 14:26:58.251354 7714 acceptor_pool.cc:254] collecting diagnostics on the listening RPC socket 0.0.0.0:39589 every 8 connection(s)
W20260924 14:26:59.252058 7698 thread.cc:536] Waited for 1000ms trying to join with acceptor (tid 7714)
I20260924 14:26:59.488116 7725 acceptor_pool.cc:254] collecting diagnostics on the listening RPC socket 0.0.0.0:43049 every 8 connection(s)
I20260924 14:26:59.489696 7726 acceptor_pool.cc:254] collecting diagnostics on the listening RPC socket 0.0.0.0:43049 every 8 connection(s)
I20260924 14:26:59.513420 7736 acceptor_pool.cc:254] collecting diagnostics on the listening RPC socket 0.0.0.0:42341 every 8 connection(s)
I20260924 14:26:59.514940 7737 acceptor_pool.cc:254] collecting diagnostics on the listening RPC socket 0.0.0.0:42341 every 8 connection(s)
I20260924 14:26:59.538760 7747 acceptor_pool.cc:254] collecting diagnostics on the listening RPC socket 0.0.0.0:45949 every 8 connection(s)
I20260924 14:26:59.539469 7748 acceptor_pool.cc:254] collecting diagnostics on the listening RPC socket 0.0.0.0:45949 every 8 connection(s)
I20260924 14:26:59.562789 7758 acceptor_pool.cc:254] collecting diagnostics on the listening RPC socket 0.0.0.0:40813 every 8 connection(s)
I20260924 14:26:59.563513 7759 acceptor_pool.cc:254] collecting diagnostics on the listening RPC socket 0.0.0.0:40813 every 8 connection(s)
[ OK ] Parameters/TestRpc.TestAcceptorPoolStartStop/SSL_TCP (1368 ms)
[ RUN ] Parameters/TestRpc.TestCall/SSL_TCP
I20260924 14:26:59.596616 7771 acceptor_pool.cc:254] collecting diagnostics on the listening RPC socket 0.0.0.0:46177 every 8 connection(s)
I20260924 14:26:59.598856 7772 acceptor_pool.cc:254] collecting diagnostics on the listening RPC socket 0.0.0.0:46177 every 8 connection(s)
I20260924 14:26:59.604562 7698 rpc-test.cc:234] Connecting to 0.0.0.0:46177
[ OK ] Parameters/TestRpc.TestCall/SSL_TCP (141 ms)
[ RUN ] Parameters/TestRpc.TestCallWithChainCertAndRootCA/SSL_TCP
I20260924 14:26:59.741204 7796 acceptor_pool.cc:254] collecting diagnostics on the listening RPC socket 0.0.0.0:38193 every 8 connection(s)
I20260924 14:26:59.741940 7797 acceptor_pool.cc:254] collecting diagnostics on the listening RPC socket 0.0.0.0:38193 every 8 connection(s)
/data0/somelongdirectorytoavoidrpathissues/src/kudu/src/kudu/rpc/rpc-test.cc:303: Failure
Failed
Bad status: Runtime error: could not verify certificate chain (error with cert: subject=CN = localhost, ST = sadfjas, C = AS, emailAddress = sdflkdsajf, O = lskdfjlsad, OU = sldfkja, issuer=C = AS, ST = ASDfkjdhf, L = lskdjf, O = saldfja, OU = skdjf, CN = localhost, emailAddress = sadjflkadsj): : certificate has expired
Google Test trace:
/data0/somelongdirectorytoavoidrpathissues/src/kudu/src/kudu/rpc/rpc-test.cc:300: Connecting to 0.0.0.0:38193
I20260924 14:26:59.762128 7698 test_util.cc:175] -----------------------------------------------
I20260924 14:26:59.762307 7698 test_util.cc:176] Had fatal failures, leaving test files at /tmp/dist-test-taskrOd8O2/test-tmp/rpc-test.1.Parameters_TestRpc.TestCallWithChainCertAndRootCA_SSL_TCP.1790260018139315-7698-0
[ FAILED ] Parameters/TestRpc.TestCallWithChainCertAndRootCA/SSL_TCP, where GetParam() = (true, false) (53 ms)
[ RUN ] Parameters/TestRpc.TestCallWithBadPasswordProtectedKey/SSL_TCP
[ OK ] Parameters/TestRpc.TestCallWithBadPasswordProtectedKey/SSL_TCP (33 ms)
[ RUN ] Parameters/TestRpc.TestInvalidMethodCall/SSL_TCP
I20260924 14:26:59.825313 7833 acceptor_pool.cc:254] collecting diagnostics on the listening RPC socket 0.0.0.0:39299 every 8 connection(s)
I20260924 14:26:59.826109 7834 acceptor_pool.cc:254] collecting diagnostics on the listening RPC socket 0.0.0.0:39299 every 8 connection(s)
I20260924 14:26:59.829784 7698 rpc-test.cc:406] Connecting to 0.0.0.0:39299
[ OK ] Parameters/TestRpc.TestInvalidMethodCall/SSL_TCP (68 ms)
[ RUN ] Parameters/TestRpc.TestHighFDs/SSL_TCP
I20260924 14:27:00.078226 7858 acceptor_pool.cc:254] collecting diagnostics on the listening RPC socket 0.0.0.0:45389 every 8 connection(s)
I20260924 14:27:00.079074 7859 acceptor_pool.cc:254] collecting diagnostics on the listening RPC socket 0.0.0.0:45389 every 8 connection(s)
[ OK ] Parameters/TestRpc.TestHighFDs/SSL_TCP (276 ms)
[ RUN ] Parameters/TestRpc.TestConnectionAlwaysKeepalive/SSL_TCP
I20260924 14:27:00.155369 7881 acceptor_pool.cc:254] collecting diagnostics on the listening RPC socket 0.0.0.0:35547 every 8 connection(s)
I20260924 14:27:00.156095 7882 acceptor_pool.cc:254] collecting diagnostics on the listening RPC socket 0.0.0.0:35547 every 8 connection(s)
I20260924 14:27:00.159204 7698 rpc-test.cc:532] Connecting to 0.0.0.0:35547
[ OK ] Parameters/TestRpc.TestConnectionAlwaysKeepalive/SSL_TCP (3055 ms)
[ RUN ] Parameters/TestRpc.TestReopenOutboundConnections/SSL_TCP
I20260924 14:27:03.226925 7904 acceptor_pool.cc:254] collecting diagnostics on the listening RPC socket 0.0.0.0:38789 every 8 connection(s)
I20260924 14:27:03.227624 7905 acceptor_pool.cc:254] collecting diagnostics on the listening RPC socket 0.0.0.0:38789 every 8 connection(s)
I20260924 14:27:03.230739 7698 rpc-test.cc:658] Connecting to 0.0.0.0:38789
[ OK ] Parameters/TestRpc.TestReopenOutboundConnections/SSL_TCP (360 ms)
[ RUN ] Parameters/TestRpc.TestConnectionNetworkPlane/SSL_TCP
I20260924 14:27:03.576771 7927 acceptor_pool.cc:254] collecting diagnostics on the listening RPC socket 0.0.0.0:41973 every 8 connection(s)
I20260924 14:27:03.577625 7928 acceptor_pool.cc:254] collecting diagnostics on the listening RPC socket 0.0.0.0:41973 every 8 connection(s)
I20260924 14:27:03.581079 7698 rpc-test.cc:772] Connecting to 0.0.0.0:41973
[ OK ] Parameters/TestRpc.TestConnectionNetworkPlane/SSL_TCP (70 ms)
[ RUN ] Parameters/TestRpc.TestTCPKeepalive/SSL_TCP
I20260924 14:27:03.661377 7952 acceptor_pool.cc:254] collecting diagnostics on the listening RPC socket 0.0.0.0:46397 every 8 connection(s)
I20260924 14:27:03.662074 7953 acceptor_pool.cc:254] collecting diagnostics on the listening RPC socket 0.0.0.0:46397 every 8 connection(s)
I20260924 14:27:03.705747 7956 rpc-test-base.h:222] got call: sleep_micros: 8000000 deferred: true
I20260924 14:27:11.710119 7956 rpcz_store.cc:275] Call kudu.rpc.GenericCalculatorService.Sleep from 127.0.0.1:50848 (request call id 0) took 8004 ms. Trace:
I20260924 14:27:11.710548 7956 rpcz_store.cc:276] 0924 14:27:03.705493 (+ 0us) service_pool.cc:170] Inserting onto call queue
0924 14:27:03.705590 (+ 97us) service_pool.cc:227] Handling call
0924 14:27:11.709913 (+8004323us) inbound_call.cc:173] Queueing success response
Metrics: {}
[ OK ] Parameters/TestRpc.TestTCPKeepalive/SSL_TCP (8098 ms)
[ RUN ] Parameters/TestRpc.TestMaxSmallSidecars/SSL_TCP
I20260924 14:27:11.766283 7978 acceptor_pool.cc:254] collecting diagnostics on the listening RPC socket 0.0.0.0:37715 every 8 connection(s)
I20260924 14:27:11.767132 7979 acceptor_pool.cc:254] collecting diagnostics on the listening RPC socket 0.0.0.0:37715 every 8 connection(s)
[ OK ] Parameters/TestRpc.TestMaxSmallSidecars/SSL_TCP (220 ms)
[ RUN ] Parameters/TestRpc.TestCallTimeout/SSL_TCP
I20260924 14:27:11.966735 8003 acceptor_pool.cc:254] collecting diagnostics on the listening RPC socket 0.0.0.0:36233 every 8 connection(s)
I20260924 14:27:11.967444 8004 acceptor_pool.cc:254] collecting diagnostics on the listening RPC socket 0.0.0.0:36233 every 8 connection(s)
I20260924 14:27:11.990239 7698 rpc-test-base.h:595] status: Timed out: connection negotiation to 0.0.0.0:36233 for RPC Sleep timed out after 0.000s (ON_OUTBOUND_QUEUE), seconds elapsed: 0.00263711
I20260924 14:27:11.997627 8007 rpc-test-base.h:222] got call: sleep_micros: 700000
I20260924 14:27:12.191310 7698 rpc-test-base.h:595] status: Timed out: Sleep RPC to 0.0.0.0:36233 timed out after 0.200s (SENT), seconds elapsed: 0.20061
I20260924 14:27:12.192888 8006 rpc-test-base.h:222] got call: sleep_micros: 2000000
W20260924 14:27:12.698236 8007 rpcz_store.cc:267] Call kudu.rpc.GenericCalculatorService.Sleep from 127.0.0.1:41636 (request call id 1) took 700 ms (client timeout 200 ms). Trace:
W20260924 14:27:12.698619 8007 rpcz_store.cc:269] 0924 14:27:11.997461 (+ 0us) service_pool.cc:170] Inserting onto call queue
0924 14:27:11.997567 (+ 106us) service_pool.cc:227] Handling call
0924 14:27:12.698169 (+700602us) inbound_call.cc:173] Queueing success response
Metrics: {}
I20260924 14:27:13.692378 7698 rpc-test-base.h:595] status: Timed out: Sleep RPC to 0.0.0.0:36233 timed out after 1.500s (SENT), seconds elapsed: 1.50069
W20260924 14:27:14.193459 8006 rpcz_store.cc:267] Call kudu.rpc.GenericCalculatorService.Sleep from 127.0.0.1:41636 (request call id 2) took 2000 ms (client timeout 1500 ms). Trace:
W20260924 14:27:14.193823 8006 rpcz_store.cc:269] 0924 14:27:12.192610 (+ 0us) service_pool.cc:170] Inserting onto call queue
0924 14:27:12.192734 (+ 124us) service_pool.cc:227] Handling call
0924 14:27:14.193400 (+2000666us) inbound_call.cc:173] Queueing success response
Metrics: {}
W20260924 14:27:14.194464 8002 connection.cc:441] server connection from 127.0.0.1:41636 torn down before Call kudu.rpc.GenericCalculatorService.Sleep from 127.0.0.1:41636 (request call id 2) could send its response
[ OK ] Parameters/TestRpc.TestCallTimeout/SSL_TCP (2254 ms)
[ RUN ] Parameters/TestRpc.TestServerShutsDown/SSL_TCP
I20260924 14:27:14.201785 7698 rpc-test.cc:1125] Connecting to 0.0.0.0:44583
W20260924 14:27:14.212201 8020 negotiation.cc:337] Failed RPC negotiation. Trace:
0924 14:27:14.210598 (+ 0us) reactor.cc:625] Submitting negotiation task for client connection to 0.0.0.0:44583 (local address 127.0.0.1:43636)
0924 14:27:14.211082 (+ 484us) negotiation.cc:107] Waiting for socket to connect
0924 14:27:14.211116 (+ 34us) client_negotiation.cc:174] Beginning negotiation
0924 14:27:14.211347 (+ 231us) client_negotiation.cc:252] Sending NEGOTIATE NegotiatePB request
0924 14:27:14.211573 (+ 226us) negotiation.cc:327] Negotiation complete: Network error: Client connection negotiation failed: client connection to 0.0.0.0:44583: BlockingWrite error: write error: Broken pipe (error 32)
Metrics: {"client-negotiator.queue_time_us":131}
[ OK ] Parameters/TestRpc.TestServerShutsDown/SSL_TCP (14 ms)
[ RUN ] Parameters/TestRpc.TimedOutOnResponseMetric/SSL_TCP
I20260924 14:27:14.249159 8037 acceptor_pool.cc:254] collecting diagnostics on the listening RPC socket 0.0.0.0:39389 every 8 connection(s)
I20260924 14:27:14.249943 8038 acceptor_pool.cc:254] collecting diagnostics on the listening RPC socket 0.0.0.0:39389 every 8 connection(s)
W20260924 14:27:14.496120 8041 rpcz_store.cc:267] Call kudu.rpc_test.CalculatorService.Sleep from 127.0.0.1:40228 (request call id 3) took 50 ms (client timeout 25 ms). Trace:
W20260924 14:27:14.496515 8041 rpcz_store.cc:269] 0924 14:27:14.445523 (+ 0us) service_pool.cc:170] Inserting onto call queue
0924 14:27:14.445645 (+ 122us) service_pool.cc:227] Handling call
0924 14:27:14.496031 (+ 50386us) inbound_call.cc:173] Queueing success response
Related trace 'test_child':
Metrics: {"test_sleep_us":50000,"child_traces":[["test_child",{"related_trace_metric":1}]]}
W20260924 14:27:14.555526 8041 rpcz_store.cc:267] Call kudu.rpc_test.CalculatorService.Sleep from 127.0.0.1:40228 (request call id 4) took 50 ms (client timeout 50 ms). Trace:
W20260924 14:27:14.555828 8041 rpcz_store.cc:269] 0924 14:27:14.504969 (+ 0us) service_pool.cc:170] Inserting onto call queue
0924 14:27:14.505095 (+ 126us) service_pool.cc:227] Handling call
0924 14:27:14.555466 (+ 50371us) inbound_call.cc:173] Queueing success response
Related trace 'test_child':
Metrics: {"test_sleep_us":50000,"child_traces":[["test_child",{"related_trace_metric":1}]]}
[ OK ] Parameters/TestRpc.TimedOutOnResponseMetric/SSL_TCP (349 ms)
[ RUN ] Parameters/TestRpc.AcceptorDispatchingTimesMetric/SSL_TCP
I20260924 14:27:14.575845 8062 acceptor_pool.cc:254] collecting diagnostics on the listening RPC socket 0.0.0.0:35039 every 8 connection(s)
I20260924 14:27:14.576526 8063 acceptor_pool.cc:254] collecting diagnostics on the listening RPC socket 0.0.0.0:35039 every 8 connection(s)
W20260924 14:27:14.582239 8058 negotiation.cc:337] Failed RPC negotiation. Trace:
0924 14:27:14.580302 (+ 0us) reactor.cc:625] Submitting negotiation task for server connection from 127.0.0.1:39572 (local address 127.0.0.1:35039)
0924 14:27:14.580995 (+ 693us) server_negotiation.cc:206] Beginning negotiation
0924 14:27:14.581034 (+ 39us) server_negotiation.cc:399] Waiting for connection header
0924 14:27:14.581435 (+ 401us) negotiation.cc:327] Negotiation complete: Network error: Server connection negotiation failed: server connection from 127.0.0.1:39572: BlockingRecv error: recv got EOF from 127.0.0.1:39572 (error 108)
Metrics: {"server-negotiator.queue_time_us":146}
[ OK ] Parameters/TestRpc.AcceptorDispatchingTimesMetric/SSL_TCP (21 ms)
[ RUN ] Parameters/TestRpc.TestRpcCallbackDestroysMessenger/SSL_TCP
[ OK ] Parameters/TestRpc.TestRpcCallbackDestroysMessenger/SSL_TCP (21 ms)
[ RUN ] Parameters/TestRpc.TestApplicationFeatureFlag/SSL_TCP
I20260924 14:27:14.624125 8087 acceptor_pool.cc:254] collecting diagnostics on the listening RPC socket 0.0.0.0:45841 every 8 connection(s)
I20260924 14:27:14.624923 8088 acceptor_pool.cc:254] collecting diagnostics on the listening RPC socket 0.0.0.0:45841 every 8 connection(s)
W20260924 14:27:14.657648 8084 messenger.cc:357] Unable to handle RPC call: Not implemented: call requires unsupported application feature flags: 99
[ OK ] Parameters/TestRpc.TestApplicationFeatureFlag/SSL_TCP (58 ms)
[ RUN ] Parameters/TestRpc.TestCancellation/SSL_TCP
I20260924 14:27:14.689985 8112 acceptor_pool.cc:254] collecting diagnostics on the listening RPC socket 0.0.0.0:42843 every 8 connection(s)
I20260924 14:27:14.690631 8113 acceptor_pool.cc:254] collecting diagnostics on the listening RPC socket 0.0.0.0:42843 every 8 connection(s)
I20260924 14:27:14.693697 7698 rpc-test.cc:1648] Connecting to 0.0.0.0:42843
I20260924 14:27:14.806008 7698 rpc-test-base.h:595] status: Aborted: Sleep RPC to 0.0.0.0:42843 is cancelled in state READY, seconds elapsed: 0.000428755
I20260924 14:27:14.968372 7698 rpc-test-base.h:595] status: Aborted: Sleep RPC to 0.0.0.0:42843 is cancelled in state SENT, seconds elapsed: 0.0010234
I20260924 14:27:15.006827 8115 rpc-test-base.h:222] got call: sleep_micros: 510000
I20260924 14:27:15.147926 7698 rpc-test-base.h:595] status: Aborted: Sleep RPC to 0.0.0.0:42843 is cancelled in state SENT, seconds elapsed: 0.000999078
I20260924 14:27:15.192332 8114 rpc-test-base.h:222] got call: sleep_micros: 510000
I20260924 14:27:15.331295 7698 rpc-test-base.h:595] status: Aborted: Sleep RPC to 0.0.0.0:42843 is cancelled in state SENT, seconds elapsed: 0.00106769
W20260924 14:27:15.368040 8116 rpcz_store.cc:267] Call kudu.rpc.GenericCalculatorService.Sleep from 127.0.0.1:48830 (request call id 11) took 15 ms (client timeout 10 ms). Trace:
W20260924 14:27:15.368429 8116 rpcz_store.cc:269] 0924 14:27:15.352902 (+ 0us) service_pool.cc:170] Inserting onto call queue
0924 14:27:15.367737 (+ 14835us) service_pool.cc:214] Skipping call since client already timed out
0924 14:27:15.367821 (+ 84us) inbound_call.cc:173] Queueing failure response
Metrics: {}
I20260924 14:27:15.369037 8116 rpc-test-base.h:222] got call: sleep_micros: 1500000
W20260924 14:27:15.517544 8115 rpcz_store.cc:267] Call kudu.rpc.GenericCalculatorService.Sleep from 127.0.0.1:48830 (request call id 3) took 511 ms (client timeout 10 ms). Trace:
W20260924 14:27:15.517939 8115 rpcz_store.cc:269] 0924 14:27:15.006601 (+ 0us) service_pool.cc:170] Inserting onto call queue
0924 14:27:15.006751 (+ 150us) service_pool.cc:227] Handling call
0924 14:27:15.517485 (+510734us) inbound_call.cc:173] Queueing success response
Metrics: {}
W20260924 14:27:15.703027 8114 rpcz_store.cc:267] Call kudu.rpc.GenericCalculatorService.Sleep from 127.0.0.1:48830 (request call id 7) took 511 ms (client timeout 10 ms). Trace:
W20260924 14:27:15.703332 8114 rpcz_store.cc:269] 0924 14:27:15.192074 (+ 0us) service_pool.cc:170] Inserting onto call queue
0924 14:27:15.192257 (+ 183us) service_pool.cc:227] Handling call
0924 14:27:15.702973 (+510716us) inbound_call.cc:173] Queueing success response
Metrics: {}
I20260924 14:27:16.333289 7698 rpc-test-base.h:595] status: Timed out: Sleep RPC to 0.0.0.0:42843 timed out after 1.000s (SENT), seconds elapsed: 1.00152
I20260924 14:27:16.334832 8114 rpc-test-base.h:222] got call: sleep_micros: 1500000
W20260924 14:27:16.869541 8116 rpcz_store.cc:267] Call kudu.rpc.GenericCalculatorService.Sleep from 127.0.0.1:48830 (request call id 12) took 1516 ms (client timeout 1000 ms). Trace:
W20260924 14:27:16.869846 8116 rpcz_store.cc:269] 0924 14:27:15.353154 (+ 0us) service_pool.cc:170] Inserting onto call queue
0924 14:27:15.369009 (+ 15855us) service_pool.cc:227] Handling call
0924 14:27:16.869490 (+1500481us) inbound_call.cc:173] Queueing success response
Metrics: {}
I20260924 14:27:17.335182 7698 rpc-test-base.h:595] status: Timed out: Sleep RPC to 0.0.0.0:42843 timed out after 1.000s (SENT), seconds elapsed: 1.00136
W20260924 14:27:17.336787 8111 messenger.cc:357] Unable to handle RPC call: Not implemented: call requires unsupported application feature flags: 99, 1
W20260924 14:27:17.338267 8111 messenger.cc:357] Unable to handle RPC call: Not implemented: call requires unsupported application feature flags: 99, 1
W20260924 14:27:17.835350 8114 rpcz_store.cc:267] Call kudu.rpc.GenericCalculatorService.Sleep from 127.0.0.1:48830 (request call id 13) took 1500 ms (client timeout 1000 ms). Trace:
W20260924 14:27:17.835655 8114 rpcz_store.cc:269] 0924 14:27:16.334658 (+ 0us) service_pool.cc:170] Inserting onto call queue
0924 14:27:16.334786 (+ 128us) service_pool.cc:227] Handling call
0924 14:27:17.835291 (+1500505us) inbound_call.cc:173] Queueing success response
Metrics: {}
W20260924 14:27:17.836269 8111 connection.cc:441] server connection from 127.0.0.1:48830 torn down before Call kudu.rpc.GenericCalculatorService.Sleep from 127.0.0.1:48830 (request call id 13) could send its response
[ OK ] Parameters/TestRpc.TestCancellation/SSL_TCP (3177 ms)
[ RUN ] Parameters/TestRpc.TestCancellationMultiThreads/SSL_TCP
I20260924 14:27:17.891438 8137 acceptor_pool.cc:254] collecting diagnostics on the listening RPC socket 0.0.0.0:46435 every 8 connection(s)
I20260924 14:27:17.892261 8138 acceptor_pool.cc:254] collecting diagnostics on the listening RPC socket 0.0.0.0:46435 every 8 connection(s)
I20260924 14:27:17.895406 7698 rpc-test.cc:1808] Connecting to 0.0.0.0:46435
I20260924 14:27:18.039724 8151 test_util.cc:268] Using random seed: 1704949902
I20260924 14:27:18.040932 8152 test_util.cc:268] Using random seed: 1704951090
I20260924 14:27:18.042701 8153 test_util.cc:268] Using random seed: 1704952879
I20260924 14:27:18.044148 8154 test_util.cc:268] Using random seed: 1704954312
I20260924 14:27:18.045728 8155 test_util.cc:268] Using random seed: 1704955805
I20260924 14:27:18.047072 8156 test_util.cc:268] Using random seed: 1704957159
I20260924 14:27:18.048569 8157 test_util.cc:268] Using random seed: 1704958608
I20260924 14:27:18.049968 8158 test_util.cc:268] Using random seed: 1704960050
I20260924 14:27:18.051247 8159 test_util.cc:268] Using random seed: 1704961326
I20260924 14:27:18.052695 8160 test_util.cc:268] Using random seed: 1704962741
I20260924 14:27:18.054482 8161 test_util.cc:268] Using random seed: 1704964512
I20260924 14:27:18.055897 8162 test_util.cc:268] Using random seed: 1704965930
I20260924 14:27:18.062762 8163 test_util.cc:268] Using random seed: 1704967525
I20260924 14:27:18.065363 8164 test_util.cc:268] Using random seed: 1704975365
I20260924 14:27:18.067457 8165 test_util.cc:268] Using random seed: 1704977477
I20260924 14:27:18.070304 8166 test_util.cc:268] Using random seed: 1704980343
I20260924 14:27:18.071777 8167 test_util.cc:268] Using random seed: 1704981821
I20260924 14:27:18.073496 8168 test_util.cc:268] Using random seed: 1704983526
I20260924 14:27:18.076879 8169 test_util.cc:268] Using random seed: 1704986914
I20260924 14:27:18.081112 8170 test_util.cc:268] Using random seed: 1704991084
I20260924 14:27:18.084686 8171 test_util.cc:268] Using random seed: 1704994632
I20260924 14:27:18.086432 8172 test_util.cc:268] Using random seed: 1704996370
I20260924 14:27:18.088213 8173 test_util.cc:268] Using random seed: 1704998205
I20260924 14:27:18.089967 8174 test_util.cc:268] Using random seed: 1704999962
I20260924 14:27:18.091745 8175 test_util.cc:268] Using random seed: 1705001742
I20260924 14:27:18.093585 8176 test_util.cc:268] Using random seed: 1705003612
I20260924 14:27:18.096372 8177 test_util.cc:268] Using random seed: 1705006324
I20260924 14:27:18.098186 8178 test_util.cc:268] Using random seed: 1705008205
I20260924 14:27:18.101238 8179 test_util.cc:268] Using random seed: 1705011224
I20260924 14:27:18.104979 8180 test_util.cc:268] Using random seed: 1705015002
[ OK ] Parameters/TestRpc.TestCancellationMultiThreads/SSL_TCP (17912 ms)
[ RUN ] Parameters/TestRpc.TestCallId/SSL_TCP
I20260924 14:27:35.780915 8194 acceptor_pool.cc:254] collecting diagnostics on the listening RPC socket 0.0.0.0:35475 every 8 connection(s)
I20260924 14:27:35.781734 8195 acceptor_pool.cc:254] collecting diagnostics on the listening RPC socket 0.0.0.0:35475 every 8 connection(s)
[ OK ] Parameters/TestRpc.TestCallId/SSL_TCP (90 ms)
[----------] 20 tests from Parameters/TestRpc (37647 ms total)
[----------] Global test environment tear-down
[==========] 21 tests from 2 test suites ran. (37655 ms total)
[ PASSED ] 20 tests.
[ FAILED ] 1 test, listed below:
[ FAILED ] Parameters/TestRpc.TestCallWithChainCertAndRootCA/SSL_TCP, where GetParam() = (true, false)
1 FAILED TEST