Diagnosed failure

Parameters/TestRpc.TestCallWithChainCertAndChainCA/SSL_TCP: /data0/somelongdirectorytoavoidrpathissues/src/kudu/src/kudu/rpc/rpc-test.cc:270: Failure
Failed
Bad status: Runtime error: could not verify certificate chain (error with cert: subject=CN = localhost, ST = sadfjas, C = AS, emailAddress = sdflkdsajf, O = lskdfjlsad, OU = sldfkja, issuer=C = AS, ST = ASDfkjdhf, L = lskdjf, O = saldfja, OU = skdjf, CN = localhost, emailAddress = sadjflkadsj): : certificate has expired
Google Test trace:
/data0/somelongdirectorytoavoidrpathissues/src/kudu/src/kudu/rpc/rpc-test.cc:267: Connecting to 0.0.0.0:45949
I20260927 18:34:06.420351  2186 test_util.cc:175] -----------------------------------------------
I20260927 18:34:06.420414  2186 test_util.cc:176] Had fatal failures, leaving test files at /tmp/dist-test-taskWFesse/test-tmp/rpc-test.5.Parameters_TestRpc.TestCallWithChainCertAndChainCA_SSL_TCP.1790534046350302-2186-0

Full log

Note: This is test shard 6 of 8.
[==========] Running 21 tests from 2 test suites.
[----------] Global test environment set-up.
[----------] 20 tests from Parameters/TestRpc
[ RUN      ] Parameters/TestRpc.TestMessengerCreateDestroy/SSL_TCP
WARNING: Logging before InitGoogleLogging() is written to STDERR
I20260927 18:34:06.370468  2186 rpc-test.cc:169] started messenger TestCreateDestroy
[       OK ] Parameters/TestRpc.TestMessengerCreateDestroy/SSL_TCP (18 ms)
[ RUN      ] Parameters/TestRpc.TestNegotiationDeadlock/SSL_TCP
I20260927 18:34:06.389258  2206 acceptor_pool.cc:254] collecting diagnostics on the listening RPC socket 0.0.0.0:41891 every 8 connection(s)
I20260927 18:34:06.389266  2207 acceptor_pool.cc:254] collecting diagnostics on the listening RPC socket 0.0.0.0:41891 every 8 connection(s)
[       OK ] Parameters/TestRpc.TestNegotiationDeadlock/SSL_TCP (25 ms)
[ RUN      ] Parameters/TestRpc.TestCallWithChainCertAndChainCA/SSL_TCP
I20260927 18:34:06.416389  2222 acceptor_pool.cc:254] collecting diagnostics on the listening RPC socket 0.0.0.0:45949 every 8 connection(s)
I20260927 18:34:06.416420  2223 acceptor_pool.cc:254] collecting diagnostics on the listening RPC socket 0.0.0.0:45949 every 8 connection(s)
/data0/somelongdirectorytoavoidrpathissues/src/kudu/src/kudu/rpc/rpc-test.cc:270: Failure
Failed
Bad status: Runtime error: could not verify certificate chain (error with cert: subject=CN = localhost, ST = sadfjas, C = AS, emailAddress = sdflkdsajf, O = lskdfjlsad, OU = sldfkja, issuer=C = AS, ST = ASDfkjdhf, L = lskdjf, O = saldfja, OU = skdjf, CN = localhost, emailAddress = sadjflkadsj): : certificate has expired
Google Test trace:
/data0/somelongdirectorytoavoidrpathissues/src/kudu/src/kudu/rpc/rpc-test.cc:267: Connecting to 0.0.0.0:45949
I20260927 18:34:06.420351  2186 test_util.cc:175] -----------------------------------------------
I20260927 18:34:06.420414  2186 test_util.cc:176] Had fatal failures, leaving test files at /tmp/dist-test-taskWFesse/test-tmp/rpc-test.5.Parameters_TestRpc.TestCallWithChainCertAndChainCA_SSL_TCP.1790534046350302-2186-0
[  FAILED  ] Parameters/TestRpc.TestCallWithChainCertAndChainCA/SSL_TCP, where GetParam() = (true, false) (23 ms)
[ RUN      ] Parameters/TestRpc.TestCallWithPasswordProtectedKey/SSL_TCP
I20260927 18:34:06.460446  2247 acceptor_pool.cc:254] collecting diagnostics on the listening RPC socket 0.0.0.0:43685 every 8 connection(s)
I20260927 18:34:06.460460  2248 acceptor_pool.cc:254] collecting diagnostics on the listening RPC socket 0.0.0.0:43685 every 8 connection(s)
[       OK ] Parameters/TestRpc.TestCallWithPasswordProtectedKey/SSL_TCP (52 ms)
[ RUN      ] Parameters/TestRpc.TestCallToBadServer/SSL_TCP
I20260927 18:34:06.479812  2186 rpc-test.cc:394] Status: Network error: Client connection negotiation failed: client connection to 0.0.0.0:0: connect: Connection refused (error 111)
I20260927 18:34:06.480087  2186 rpc-test.cc:394] Status: Network error: Client connection negotiation failed: client connection to 0.0.0.0:0: connect: Connection refused (error 111)
I20260927 18:34:06.480257  2186 rpc-test.cc:394] Status: Network error: Client connection negotiation failed: client connection to 0.0.0.0:0: connect: Connection refused (error 111)
I20260927 18:34:06.480592  2186 rpc-test.cc:394] Status: Network error: Client connection negotiation failed: client connection to 0.0.0.0:0: connect: Connection refused (error 111)
I20260927 18:34:06.480826  2186 rpc-test.cc:394] Status: Network error: Client connection negotiation failed: client connection to 0.0.0.0:0: connect: Connection refused (error 111)
[       OK ] Parameters/TestRpc.TestCallToBadServer/SSL_TCP (8 ms)
[ RUN      ] Parameters/TestRpc.TestWrongService/SSL_TCP
I20260927 18:34:06.487260  2282 acceptor_pool.cc:254] collecting diagnostics on the listening RPC socket 0.0.0.0:39651 every 8 connection(s)
I20260927 18:34:06.487295  2283 acceptor_pool.cc:254] collecting diagnostics on the listening RPC socket 0.0.0.0:39651 every 8 connection(s)
I20260927 18:34:06.503762  2280 messenger.cc:345] service WrongServiceName not registered on TestServer
[       OK ] Parameters/TestRpc.TestWrongService/SSL_TCP (24 ms)
[ RUN      ] Parameters/TestRpc.TestConnectionKeepalive/SSL_TCP
I20260927 18:34:06.512959  2305 acceptor_pool.cc:254] collecting diagnostics on the listening RPC socket 0.0.0.0:39911 every 8 connection(s)
I20260927 18:34:06.512992  2306 acceptor_pool.cc:254] collecting diagnostics on the listening RPC socket 0.0.0.0:39911 every 8 connection(s)
I20260927 18:34:06.513121  2186 rpc-test.cc:488] Connecting to 0.0.0.0:39911
[       OK ] Parameters/TestRpc.TestConnectionKeepalive/SSL_TCP (1038 ms)
[ RUN      ] Parameters/TestRpc.TestClientConnectionMetrics/SSL_TCP
I20260927 18:34:07.572928  2331 acceptor_pool.cc:254] collecting diagnostics on the listening RPC socket 0.0.0.0:44233 every 8 connection(s)
I20260927 18:34:07.572923  2330 acceptor_pool.cc:254] collecting diagnostics on the listening RPC socket 0.0.0.0:44233 every 8 connection(s)
I20260927 18:34:07.573053  2186 rpc-test.cc:569] Connecting to 0.0.0.0:44233
[       OK ] Parameters/TestRpc.TestClientConnectionMetrics/SSL_TCP (9138 ms)
[ RUN      ] Parameters/TestRpc.TestCredentialsPolicy/SSL_TCP
I20260927 18:34:16.698840  2353 acceptor_pool.cc:254] collecting diagnostics on the listening RPC socket 0.0.0.0:44423 every 8 connection(s)
I20260927 18:34:16.698889  2354 acceptor_pool.cc:254] collecting diagnostics on the listening RPC socket 0.0.0.0:44423 every 8 connection(s)
I20260927 18:34:16.699002  2186 rpc-test.cc:700] Connecting to 0.0.0.0:44423
[       OK ] Parameters/TestRpc.TestCredentialsPolicy/SSL_TCP (35 ms)
[ RUN      ] Parameters/TestRpc.TestCallLongerThanKeepalive/SSL_TCP
I20260927 18:34:16.740193  2378 acceptor_pool.cc:254] collecting diagnostics on the listening RPC socket 0.0.0.0:46369 every 8 connection(s)
I20260927 18:34:16.740223  2379 acceptor_pool.cc:254] collecting diagnostics on the listening RPC socket 0.0.0.0:46369 every 8 connection(s)
I20260927 18:34:16.762382  2381 rpc-test-base.h:222] got call: sleep_micros: 3000000 deferred: true
I20260927 18:34:19.763087  2381 rpcz_store.cc:275] Call kudu.rpc.GenericCalculatorService.Sleep from 127.0.0.1:52890 (request call id 0) took 3000 ms. Trace:
I20260927 18:34:19.763199  2381 rpcz_store.cc:276] 0927 18:34:16.762319 (+     0us) service_pool.cc:170] Inserting onto call queue
0927 18:34:16.762351 (+    32us) service_pool.cc:227] Handling call
0927 18:34:19.763071 (+3000720us) inbound_call.cc:173] Queueing success response
Metrics: {}
[       OK ] Parameters/TestRpc.TestCallLongerThanKeepalive/SSL_TCP (3047 ms)
[ RUN      ] Parameters/TestRpc.TestRpcSidecar/SSL_TCP
I20260927 18:34:19.786515  2403 acceptor_pool.cc:254] collecting diagnostics on the listening RPC socket 0.0.0.0:46025 every 8 connection(s)
I20260927 18:34:19.786531  2404 acceptor_pool.cc:254] collecting diagnostics on the listening RPC socket 0.0.0.0:46025 every 8 connection(s)
[       OK ] Parameters/TestRpc.TestRpcSidecar/SSL_TCP (65 ms)
[ RUN      ] Parameters/TestRpc.TestRpcSidecarLimits/SSL_TCP
I20260927 18:34:21.394436  2428 acceptor_pool.cc:254] collecting diagnostics on the listening RPC socket 0.0.0.0:44533 every 8 connection(s)
I20260927 18:34:21.394454  2429 acceptor_pool.cc:254] collecting diagnostics on the listening RPC socket 0.0.0.0:44533 every 8 connection(s)
W20260927 18:34:21.404379  2186 serialization.cc:72] Serialized kudu.rpc_test.PushStringsRequestPB (2147483654 bytes) is larger than the maximum configured RPC message size (52428800 bytes). Sending anyway, but peer may reject the data.
W20260927 18:34:21.407845  2425 connection.cc:535] server connection from 127.0.0.1:39108 recv error: Network error: RPC frame had a length of 2147483714, but we only support messages up to 52428800 bytes long.
W20260927 18:34:21.407915  2425 connection.cc:158] shutting down server connection from 127.0.0.1:39108 with pending inbound data: 4/2147483714 bytes received; last active 0 ns ago: status Network error: RPC frame had a length of 2147483714, but we only support messages up to 52428800 bytes long.
W20260927 18:34:21.408111  2441 connection.cc:196] Error closing socket: Network error: TlsSocket::Close: Connection reset by peer
I20260927 18:34:21.416973  2453 acceptor_pool.cc:254] collecting diagnostics on the listening RPC socket 0.0.0.0:41865 every 8 connection(s)
I20260927 18:34:21.417026  2454 acceptor_pool.cc:254] collecting diagnostics on the listening RPC socket 0.0.0.0:41865 every 8 connection(s)
W20260927 18:34:24.897274  2450 connection.cc:577] server connection from 127.0.0.1:55936: received bad data: 'Corruption: Invalid packet: message had a length of 2147483710, but we only support messages up to 2147483647 bytes
'
[       OK ] Parameters/TestRpc.TestRpcSidecarLimits/SSL_TCP (5068 ms)
[ RUN      ] Parameters/TestRpc.TestCallTimeoutDoesntAffectNegotiation/SSL_TCP
I20260927 18:34:24.923516  2478 acceptor_pool.cc:254] collecting diagnostics on the listening RPC socket 0.0.0.0:43119 every 8 connection(s)
I20260927 18:34:24.923565  2479 acceptor_pool.cc:254] collecting diagnostics on the listening RPC socket 0.0.0.0:43119 every 8 connection(s)
W20260927 18:34:24.935565  2474 negotiation.cc:266] Injecting 500ms delay in negotiation
I20260927 18:34:24.985930  2186 rpc-test-base.h:595] status: Timed out: connection negotiation to 0.0.0.0:43119 for RPC Sleep timed out after 0.050s (ON_OUTBOUND_QUEUE), seconds elapsed: 0.0507415
[       OK ] Parameters/TestRpc.TestCallTimeoutDoesntAffectNegotiation/SSL_TCP (540 ms)
[ RUN      ] Parameters/TestRpc.TestRpcHandlerLatencyMetric/SSL_TCP
I20260927 18:34:25.454257  2503 acceptor_pool.cc:254] collecting diagnostics on the listening RPC socket 0.0.0.0:43067 every 8 connection(s)
I20260927 18:34:25.454257  2504 acceptor_pool.cc:254] collecting diagnostics on the listening RPC socket 0.0.0.0:43067 every 8 connection(s)
I20260927 18:34:25.488525  2186 rpc-test.cc:1236] Sleep() min lat: 20374
I20260927 18:34:25.488600  2186 rpc-test.cc:1237] Sleep() mean lat: 20374
I20260927 18:34:25.488623  2186 rpc-test.cc:1238] Sleep() max lat: 20374
I20260927 18:34:25.488634  2186 rpc-test.cc:1239] Sleep() #calls: 1
[       OK ] Parameters/TestRpc.TestRpcHandlerLatencyMetric/SSL_TCP (49 ms)
[ RUN      ] Parameters/TestRpc.TimedOutOnResponseMetricServiceQueue/SSL_TCP
I20260927 18:34:25.517922  2529 acceptor_pool.cc:254] collecting diagnostics on the listening RPC socket 0.0.0.0:34083 every 8 connection(s)
I20260927 18:34:25.517959  2530 acceptor_pool.cc:254] collecting diagnostics on the listening RPC socket 0.0.0.0:34083 every 8 connection(s)
W20260927 18:34:25.567354  2531 rpcz_store.cc:267] Call kudu.rpc_test.CalculatorService.Sleep from 127.0.0.1:59446 (request call id 2) took 20 ms (client timeout 20 ms). Trace:
W20260927 18:34:25.567454  2531 rpcz_store.cc:269] 0927 18:34:25.547088 (+     0us) service_pool.cc:170] Inserting onto call queue
0927 18:34:25.567328 (+ 20240us) service_pool.cc:214] Skipping call since client already timed out
0927 18:34:25.567340 (+    12us) inbound_call.cc:173] Queueing failure response
Metrics: {}
[       OK ] Parameters/TestRpc.TimedOutOnResponseMetricServiceQueue/SSL_TCP (78 ms)
[ RUN      ] Parameters/TestRpc.RpcPendingConnectionsMetric/SSL_TCP
I20260927 18:34:25.570595  2553 acceptor_pool.cc:254] collecting diagnostics on the listening RPC socket 0.0.0.0:38507 every 8 connection(s)
I20260927 18:34:25.570586  2552 acceptor_pool.cc:254] collecting diagnostics on the listening RPC socket 0.0.0.0:38507 every 8 connection(s)
W20260927 18:34:25.571133  2548 negotiation.cc:337] Failed RPC negotiation. Trace:
0927 18:34:25.570960 (+     0us) reactor.cc:625] Submitting negotiation task for server connection from 127.0.0.1:49978 (local address 127.0.0.1:38507)
0927 18:34:25.571001 (+    41us) server_negotiation.cc:206] Beginning negotiation
0927 18:34:25.571003 (+     2us) server_negotiation.cc:399] Waiting for connection header
0927 18:34:25.571081 (+    78us) negotiation.cc:327] Negotiation complete: Network error: Server connection negotiation failed: server connection from 127.0.0.1:49978: BlockingRecv error: recv got EOF from 127.0.0.1:49978 (error 108)
Metrics: {"server-negotiator.queue_time_us":14}
[       OK ] Parameters/TestRpc.RpcPendingConnectionsMetric/SSL_TCP (13 ms)
[ RUN      ] Parameters/TestRpc.TestRpcContextClientDeadline/SSL_TCP
I20260927 18:34:25.593530  2569 acceptor_pool.cc:254] collecting diagnostics on the listening RPC socket 0.0.0.0:39553 every 8 connection(s)
I20260927 18:34:25.593501  2568 acceptor_pool.cc:254] collecting diagnostics on the listening RPC socket 0.0.0.0:39553 every 8 connection(s)
[       OK ] Parameters/TestRpc.TestRpcContextClientDeadline/SSL_TCP (46 ms)
[ RUN      ] Parameters/TestRpc.TestApplicationFeatureFlagUnsupportedServer/SSL_TCP
I20260927 18:34:25.640342  2593 acceptor_pool.cc:254] collecting diagnostics on the listening RPC socket 0.0.0.0:36589 every 8 connection(s)
I20260927 18:34:25.640378  2594 acceptor_pool.cc:254] collecting diagnostics on the listening RPC socket 0.0.0.0:36589 every 8 connection(s)
[       OK ] Parameters/TestRpc.TestApplicationFeatureFlagUnsupportedServer/SSL_TCP (32 ms)
[ RUN      ] Parameters/TestRpc.TestCancellationAsync/SSL_TCP
I20260927 18:34:25.669580  2618 acceptor_pool.cc:254] collecting diagnostics on the listening RPC socket 0.0.0.0:37327 every 8 connection(s)
I20260927 18:34:25.669587  2619 acceptor_pool.cc:254] collecting diagnostics on the listening RPC socket 0.0.0.0:37327 every 8 connection(s)
I20260927 18:34:25.669725  2186 rpc-test.cc:1716] Connecting to 0.0.0.0:37327
I20260927 18:34:25.684325  2186 test_util.cc:268] Using random seed: 854687586
I20260927 18:34:25.701591  2621 rpc-test-base.h:240] got call: sleep_micros: 500 pattern: 4294967295 num_repetitions: 2097152 sidecar_idx: 0
I20260927 18:34:25.714047  2621 rpc-test-base.h:240] got call: sleep_micros: 500 pattern: 4294967295 num_repetitions: 2097152 sidecar_idx: 0
I20260927 18:34:25.727244  2621 rpc-test-base.h:240] got call: sleep_micros: 500 pattern: 4294967295 num_repetitions: 2097152 sidecar_idx: 0
I20260927 18:34:25.740012  2621 rpc-test-base.h:240] got call: sleep_micros: 500 pattern: 4294967295 num_repetitions: 2097152 sidecar_idx: 0
I20260927 18:34:25.753088  2621 rpc-test-base.h:240] got call: sleep_micros: 500 pattern: 4294967295 num_repetitions: 2097152 sidecar_idx: 0
I20260927 18:34:25.766016  2621 rpc-test-base.h:240] got call: sleep_micros: 500 pattern: 4294967295 num_repetitions: 2097152 sidecar_idx: 0
I20260927 18:34:25.778939  2621 rpc-test-base.h:240] got call: sleep_micros: 500 pattern: 4294967295 num_repetitions: 2097152 sidecar_idx: 0
I20260927 18:34:25.792155  2621 rpc-test-base.h:240] got call: sleep_micros: 500 pattern: 4294967295 num_repetitions: 2097152 sidecar_idx: 0
W20260927 18:34:25.795198  2616 connection.cc:441] server connection from 127.0.0.1:38978 torn down before Call kudu.rpc.GenericCalculatorService.SleepWithSidecar from 127.0.0.1:38978 (request call id 9) could send its response
[       OK ] Parameters/TestRpc.TestCancellationAsync/SSL_TCP (135 ms)
[ RUN      ] Parameters/TestRpc.TestPerformanceBySocketType/SSL_TCP
I20260927 18:34:25.809028  2643 acceptor_pool.cc:254] collecting diagnostics on the listening RPC socket 0.0.0.0:32809 every 8 connection(s)
I20260927 18:34:25.809062  2644 acceptor_pool.cc:254] collecting diagnostics on the listening RPC socket 0.0.0.0:32809 every 8 connection(s)
I20260927 18:34:25.809171  2186 rpc-test.cc:1846] Connecting to 0.0.0.0:32809
I20260927 18:34:27.491547  2186 rpc-test.cc:1859] Sending 1024MB via ssl-enabled tcp socket: real 1.667s	user 1.578s	sys 1.362s
I20260927 18:34:29.188512  2186 rpc-test.cc:1859] Sending 1024MB via ssl-enabled tcp socket: real 1.697s	user 1.691s	sys 1.293s
I20260927 18:34:30.854341  2186 rpc-test.cc:1859] Sending 1024MB via ssl-enabled tcp socket: real 1.666s	user 1.602s	sys 1.327s
I20260927 18:34:32.543289  2186 rpc-test.cc:1859] Sending 1024MB via ssl-enabled tcp socket: real 1.689s	user 1.616s	sys 1.344s
I20260927 18:34:34.204741  2186 rpc-test.cc:1859] Sending 1024MB via ssl-enabled tcp socket: real 1.661s	user 1.629s	sys 1.282s
[       OK ] Parameters/TestRpc.TestPerformanceBySocketType/SSL_TCP (8409 ms)
[----------] 20 tests from Parameters/TestRpc (27853 ms total)

[----------] 1 test from Parameters/TestRpcSocketTxRxQueue
[ RUN      ] Parameters/TestRpcSocketTxRxQueue.OverCapacity/0
W20260927 18:34:34.479413  2660 negotiation.cc:337] Failed RPC negotiation. Trace:
0927 18:34:34.215622 (+     0us) reactor.cc:625] Submitting negotiation task for client connection to 0.0.0.0:36707 (local address 127.0.0.1:35354)
0927 18:34:34.215683 (+    61us) negotiation.cc:107] Waiting for socket to connect
0927 18:34:34.215693 (+    10us) client_negotiation.cc:174] Beginning negotiation
0927 18:34:34.215778 (+    85us) client_negotiation.cc:252] Sending NEGOTIATE NegotiatePB request
0927 18:34:34.479300 (+263522us) negotiation.cc:327] Negotiation complete: Network error: Client connection negotiation failed: client connection to 0.0.0.0:36707: BlockingRecv error: recv error from unknown peer: Transport endpoint is not connected (error 107)
Metrics: {"client-negotiator.queue_time_us":32}
W20260927 18:34:34.479509  2705 negotiation.cc:337] Failed RPC negotiation. Trace:
0927 18:34:34.219756 (+     0us) reactor.cc:625] Submitting negotiation task for client connection to 0.0.0.0:36707 (local address 127.0.0.1:35390)
0927 18:34:34.219795 (+    39us) negotiation.cc:107] Waiting for socket to connect
0927 18:34:34.219803 (+     8us) client_negotiation.cc:174] Beginning negotiation
0927 18:34:34.219845 (+    42us) client_negotiation.cc:252] Sending NEGOTIATE NegotiatePB request
0927 18:34:34.479478 (+259633us) negotiation.cc:327] Negotiation complete: Network error: Client connection negotiation failed: client connection to 0.0.0.0:36707: BlockingRecv error: recv error from unknown peer: Transport endpoint is not connected (error 107)
Metrics: {"client-negotiator.queue_time_us":17}
W20260927 18:34:34.479566  2678 negotiation.cc:337] Failed RPC negotiation. Trace:
0927 18:34:34.217403 (+     0us) reactor.cc:625] Submitting negotiation task for client connection to 0.0.0.0:36707 (local address 127.0.0.1:35360)
0927 18:34:34.217454 (+    51us) negotiation.cc:107] Waiting for socket to connect
0927 18:34:34.217462 (+     8us) client_negotiation.cc:174] Beginning negotiation
0927 18:34:34.217538 (+    76us) client_negotiation.cc:252] Sending NEGOTIATE NegotiatePB request
0927 18:34:34.479246 (+261708us) negotiation.cc:327] Negotiation complete: Network error: Client connection negotiation failed: client connection to 0.0.0.0:36707: BlockingRecv error: recv error from unknown peer: Transport endpoint is not connected (error 107)
Metrics: {"client-negotiator.queue_time_us":30}
W20260927 18:34:34.479883  2669 negotiation.cc:337] Failed RPC negotiation. Trace:
0927 18:34:34.216597 (+     0us) reactor.cc:625] Submitting negotiation task for client connection to 0.0.0.0:36707 (local address 127.0.0.1:35356)
0927 18:34:34.216639 (+    42us) negotiation.cc:107] Waiting for socket to connect
0927 18:34:34.216647 (+     8us) client_negotiation.cc:174] Beginning negotiation
0927 18:34:34.216687 (+    40us) client_negotiation.cc:252] Sending NEGOTIATE NegotiatePB request
0927 18:34:34.479258 (+262571us) negotiation.cc:327] Negotiation complete: Network error: Client connection negotiation failed: client connection to 0.0.0.0:36707: BlockingRecv error: recv error from unknown peer: Transport endpoint is not connected (error 107)
Metrics: {"client-negotiator.queue_time_us":18}
W20260927 18:34:34.480050  2696 negotiation.cc:337] Failed RPC negotiation. Trace:
0927 18:34:34.218970 (+     0us) reactor.cc:625] Submitting negotiation task for client connection to 0.0.0.0:36707 (local address 127.0.0.1:35386)
0927 18:34:34.219003 (+    33us) negotiation.cc:107] Waiting for socket to connect
0927 18:34:34.219010 (+     7us) client_negotiation.cc:174] Beginning negotiation
0927 18:34:34.219045 (+    35us) client_negotiation.cc:252] Sending NEGOTIATE NegotiatePB request
0927 18:34:34.479441 (+260396us) negotiation.cc:327] Negotiation complete: Network error: Client connection negotiation failed: client connection to 0.0.0.0:36707: BlockingRecv error: recv error from unknown peer: Transport endpoint is not connected (error 107)
Metrics: {"client-negotiator.queue_time_us":16}
W20260927 18:34:34.479424  2687 negotiation.cc:337] Failed RPC negotiation. Trace:
0927 18:34:34.218196 (+     0us) reactor.cc:625] Submitting negotiation task for client connection to 0.0.0.0:36707 (local address 127.0.0.1:35372)
0927 18:34:34.218232 (+    36us) negotiation.cc:107] Waiting for socket to connect
0927 18:34:34.218240 (+     8us) client_negotiation.cc:174] Beginning negotiation
0927 18:34:34.218274 (+    34us) client_negotiation.cc:252] Sending NEGOTIATE NegotiatePB request
0927 18:34:34.479361 (+261087us) negotiation.cc:327] Negotiation complete: Network error: Client connection negotiation failed: client connection to 0.0.0.0:36707: BlockingRecv error: recv error from unknown peer: Transport endpoint is not connected (error 107)
Metrics: {"client-negotiator.queue_time_us":17}
[       OK ] Parameters/TestRpcSocketTxRxQueue.OverCapacity/0 (1042 ms)
[----------] 1 test from Parameters/TestRpcSocketTxRxQueue (1042 ms total)

[----------] Global test environment tear-down
[==========] 21 tests from 2 test suites ran. (28896 ms total)
[  PASSED  ] 20 tests.
[  FAILED  ] 1 test, listed below:
[  FAILED  ] Parameters/TestRpc.TestCallWithChainCertAndChainCA/SSL_TCP, where GetParam() = (true, false)

 1 FAILED TEST