Diagnosed failure

Parameters/TestRpc.TestCallWithChainCertAndChainCA/SSL_TCP: /data0/somelongdirectorytoavoidrpathissues/src/kudu/src/kudu/rpc/rpc-test.cc:270: Failure
Failed
Bad status: Runtime error: could not verify certificate chain (error with cert: subject=CN = localhost, ST = sadfjas, C = AS, emailAddress = sdflkdsajf, O = lskdfjlsad, OU = sldfkja, issuer=C = AS, ST = ASDfkjdhf, L = lskdjf, O = saldfja, OU = skdjf, CN = localhost, emailAddress = sadjflkadsj): : certificate has expired
Google Test trace:
/data0/somelongdirectorytoavoidrpathissues/src/kudu/src/kudu/rpc/rpc-test.cc:267: Connecting to 0.0.0.0:41283
I20260926 13:41:41.455672  8128 test_util.cc:175] -----------------------------------------------
I20260926 13:41:41.455739  8128 test_util.cc:176] Had fatal failures, leaving test files at /tmp/dist-test-taskX_0QLk/test-tmp/rpc-test.5.Parameters_TestRpc.TestCallWithChainCertAndChainCA_SSL_TCP.1790430101381977-8128-0

Full log

Note: This is test shard 6 of 8.
[==========] Running 21 tests from 2 test suites.
[----------] Global test environment set-up.
[----------] 20 tests from Parameters/TestRpc
[ RUN      ] Parameters/TestRpc.TestMessengerCreateDestroy/SSL_TCP
WARNING: Logging before InitGoogleLogging() is written to STDERR
I20260926 13:41:41.403826  8128 rpc-test.cc:169] started messenger TestCreateDestroy
[       OK ] Parameters/TestRpc.TestMessengerCreateDestroy/SSL_TCP (16 ms)
[ RUN      ] Parameters/TestRpc.TestNegotiationDeadlock/SSL_TCP
I20260926 13:41:41.417742  8148 acceptor_pool.cc:254] collecting diagnostics on the listening RPC socket 0.0.0.0:45255 every 8 connection(s)
I20260926 13:41:41.417800  8149 acceptor_pool.cc:254] collecting diagnostics on the listening RPC socket 0.0.0.0:45255 every 8 connection(s)
[       OK ] Parameters/TestRpc.TestNegotiationDeadlock/SSL_TCP (22 ms)
[ RUN      ] Parameters/TestRpc.TestCallWithChainCertAndChainCA/SSL_TCP
I20260926 13:41:41.451305  8164 acceptor_pool.cc:254] collecting diagnostics on the listening RPC socket 0.0.0.0:41283 every 8 connection(s)
I20260926 13:41:41.451364  8165 acceptor_pool.cc:254] collecting diagnostics on the listening RPC socket 0.0.0.0:41283 every 8 connection(s)
/data0/somelongdirectorytoavoidrpathissues/src/kudu/src/kudu/rpc/rpc-test.cc:270: Failure
Failed
Bad status: Runtime error: could not verify certificate chain (error with cert: subject=CN = localhost, ST = sadfjas, C = AS, emailAddress = sdflkdsajf, O = lskdfjlsad, OU = sldfkja, issuer=C = AS, ST = ASDfkjdhf, L = lskdjf, O = saldfja, OU = skdjf, CN = localhost, emailAddress = sadjflkadsj): : certificate has expired
Google Test trace:
/data0/somelongdirectorytoavoidrpathissues/src/kudu/src/kudu/rpc/rpc-test.cc:267: Connecting to 0.0.0.0:41283
I20260926 13:41:41.455672  8128 test_util.cc:175] -----------------------------------------------
I20260926 13:41:41.455739  8128 test_util.cc:176] Had fatal failures, leaving test files at /tmp/dist-test-taskX_0QLk/test-tmp/rpc-test.5.Parameters_TestRpc.TestCallWithChainCertAndChainCA_SSL_TCP.1790430101381977-8128-0
[  FAILED  ] Parameters/TestRpc.TestCallWithChainCertAndChainCA/SSL_TCP, where GetParam() = (true, false) (27 ms)
[ RUN      ] Parameters/TestRpc.TestCallWithPasswordProtectedKey/SSL_TCP
I20260926 13:41:41.464613  8189 acceptor_pool.cc:254] collecting diagnostics on the listening RPC socket 0.0.0.0:46619 every 8 connection(s)
I20260926 13:41:41.464658  8190 acceptor_pool.cc:254] collecting diagnostics on the listening RPC socket 0.0.0.0:46619 every 8 connection(s)
[       OK ] Parameters/TestRpc.TestCallWithPasswordProtectedKey/SSL_TCP (22 ms)
[ RUN      ] Parameters/TestRpc.TestCallToBadServer/SSL_TCP
I20260926 13:41:41.497282  8128 rpc-test.cc:394] Status: Network error: Client connection negotiation failed: client connection to 0.0.0.0:0: connect: Connection refused (error 111)
I20260926 13:41:41.497722  8128 rpc-test.cc:394] Status: Network error: Client connection negotiation failed: client connection to 0.0.0.0:0: connect: Connection refused (error 111)
I20260926 13:41:41.498092  8128 rpc-test.cc:394] Status: Network error: Client connection negotiation failed: client connection to 0.0.0.0:0: connect: Connection refused (error 111)
I20260926 13:41:41.498473  8128 rpc-test.cc:394] Status: Network error: Client connection negotiation failed: client connection to 0.0.0.0:0: connect: Connection refused (error 111)
I20260926 13:41:41.498838  8128 rpc-test.cc:394] Status: Network error: Client connection negotiation failed: client connection to 0.0.0.0:0: connect: Connection refused (error 111)
[       OK ] Parameters/TestRpc.TestCallToBadServer/SSL_TCP (21 ms)
[ RUN      ] Parameters/TestRpc.TestWrongService/SSL_TCP
I20260926 13:41:41.549110  8224 acceptor_pool.cc:254] collecting diagnostics on the listening RPC socket 0.0.0.0:36493 every 8 connection(s)
I20260926 13:41:41.549172  8225 acceptor_pool.cc:254] collecting diagnostics on the listening RPC socket 0.0.0.0:36493 every 8 connection(s)
I20260926 13:41:41.576545  8221 messenger.cc:345] service WrongServiceName not registered on TestServer
[       OK ] Parameters/TestRpc.TestWrongService/SSL_TCP (79 ms)
[ RUN      ] Parameters/TestRpc.TestConnectionKeepalive/SSL_TCP
I20260926 13:41:41.586069  8247 acceptor_pool.cc:254] collecting diagnostics on the listening RPC socket 0.0.0.0:35059 every 8 connection(s)
I20260926 13:41:41.586133  8248 acceptor_pool.cc:254] collecting diagnostics on the listening RPC socket 0.0.0.0:35059 every 8 connection(s)
I20260926 13:41:41.586423  8128 rpc-test.cc:488] Connecting to 0.0.0.0:35059
[       OK ] Parameters/TestRpc.TestConnectionKeepalive/SSL_TCP (1031 ms)
[ RUN      ] Parameters/TestRpc.TestClientConnectionMetrics/SSL_TCP
I20260926 13:41:42.621420  8272 acceptor_pool.cc:254] collecting diagnostics on the listening RPC socket 0.0.0.0:40189 every 8 connection(s)
I20260926 13:41:42.621536  8273 acceptor_pool.cc:254] collecting diagnostics on the listening RPC socket 0.0.0.0:40189 every 8 connection(s)
I20260926 13:41:42.621779  8128 rpc-test.cc:569] Connecting to 0.0.0.0:40189
[       OK ] Parameters/TestRpc.TestClientConnectionMetrics/SSL_TCP (13024 ms)
[ RUN      ] Parameters/TestRpc.TestCredentialsPolicy/SSL_TCP
I20260926 13:41:55.646458  8295 acceptor_pool.cc:254] collecting diagnostics on the listening RPC socket 0.0.0.0:42653 every 8 connection(s)
I20260926 13:41:55.646539  8296 acceptor_pool.cc:254] collecting diagnostics on the listening RPC socket 0.0.0.0:42653 every 8 connection(s)
I20260926 13:41:55.646824  8128 rpc-test.cc:700] Connecting to 0.0.0.0:42653
[       OK ] Parameters/TestRpc.TestCredentialsPolicy/SSL_TCP (38 ms)
[ RUN      ] Parameters/TestRpc.TestCallLongerThanKeepalive/SSL_TCP
I20260926 13:41:55.678584  8320 acceptor_pool.cc:254] collecting diagnostics on the listening RPC socket 0.0.0.0:45695 every 8 connection(s)
I20260926 13:41:55.678649  8321 acceptor_pool.cc:254] collecting diagnostics on the listening RPC socket 0.0.0.0:45695 every 8 connection(s)
I20260926 13:41:55.699786  8324 rpc-test-base.h:222] got call: sleep_micros: 3000000 deferred: true
I20260926 13:41:58.700657  8324 rpcz_store.cc:275] Call kudu.rpc.GenericCalculatorService.Sleep from 127.0.0.1:53842 (request call id 0) took 3000 ms. Trace:
I20260926 13:41:58.700778  8324 rpcz_store.cc:276] 0926 13:41:55.699728 (+     0us) service_pool.cc:170] Inserting onto call queue
0926 13:41:55.699767 (+    39us) service_pool.cc:227] Handling call
0926 13:41:58.700637 (+3000870us) inbound_call.cc:173] Queueing success response
Metrics: {}
[       OK ] Parameters/TestRpc.TestCallLongerThanKeepalive/SSL_TCP (3030 ms)
[ RUN      ] Parameters/TestRpc.TestRpcSidecar/SSL_TCP
I20260926 13:41:58.726650  8345 acceptor_pool.cc:254] collecting diagnostics on the listening RPC socket 0.0.0.0:44185 every 8 connection(s)
I20260926 13:41:58.726689  8346 acceptor_pool.cc:254] collecting diagnostics on the listening RPC socket 0.0.0.0:44185 every 8 connection(s)
[       OK ] Parameters/TestRpc.TestRpcSidecar/SSL_TCP (74 ms)
[ RUN      ] Parameters/TestRpc.TestRpcSidecarLimits/SSL_TCP
I20260926 13:42:00.406440  8370 acceptor_pool.cc:254] collecting diagnostics on the listening RPC socket 0.0.0.0:33109 every 8 connection(s)
I20260926 13:42:00.406498  8371 acceptor_pool.cc:254] collecting diagnostics on the listening RPC socket 0.0.0.0:33109 every 8 connection(s)
W20260926 13:42:00.429613  8128 serialization.cc:72] Serialized kudu.rpc_test.PushStringsRequestPB (2147483654 bytes) is larger than the maximum configured RPC message size (52428800 bytes). Sending anyway, but peer may reject the data.
W20260926 13:42:00.433182  8367 connection.cc:535] server connection from 127.0.0.1:34156 recv error: Network error: RPC frame had a length of 2147483714, but we only support messages up to 52428800 bytes long.
W20260926 13:42:00.433231  8367 connection.cc:158] shutting down server connection from 127.0.0.1:34156 with pending inbound data: 4/2147483714 bytes received; last active 0 ns ago: status Network error: RPC frame had a length of 2147483714, but we only support messages up to 52428800 bytes long.
W20260926 13:42:00.433468  8383 connection.cc:196] Error closing socket: Network error: TlsSocket::Close: Connection reset by peer
I20260926 13:42:00.455538  8395 acceptor_pool.cc:254] collecting diagnostics on the listening RPC socket 0.0.0.0:33823 every 8 connection(s)
I20260926 13:42:00.455549  8396 acceptor_pool.cc:254] collecting diagnostics on the listening RPC socket 0.0.0.0:33823 every 8 connection(s)
W20260926 13:42:04.366791  8393 connection.cc:577] server connection from 127.0.0.1:49042: received bad data: 'Corruption: Invalid packet: message had a length of 2147483710, but we only support messages up to 2147483647 bytes
'
[       OK ] Parameters/TestRpc.TestRpcSidecarLimits/SSL_TCP (5591 ms)
[ RUN      ] Parameters/TestRpc.TestCallTimeoutDoesntAffectNegotiation/SSL_TCP
I20260926 13:42:04.387892  8420 acceptor_pool.cc:254] collecting diagnostics on the listening RPC socket 0.0.0.0:36811 every 8 connection(s)
I20260926 13:42:04.388028  8421 acceptor_pool.cc:254] collecting diagnostics on the listening RPC socket 0.0.0.0:36811 every 8 connection(s)
W20260926 13:42:04.397410  8414 negotiation.cc:266] Injecting 500ms delay in negotiation
I20260926 13:42:04.447682  8128 rpc-test-base.h:595] status: Timed out: connection negotiation to 0.0.0.0:36811 for RPC Sleep timed out after 0.050s (ON_OUTBOUND_QUEUE), seconds elapsed: 0.0506935
[       OK ] Parameters/TestRpc.TestCallTimeoutDoesntAffectNegotiation/SSL_TCP (533 ms)
[ RUN      ] Parameters/TestRpc.TestRpcHandlerLatencyMetric/SSL_TCP
I20260926 13:42:04.910235  8445 acceptor_pool.cc:254] collecting diagnostics on the listening RPC socket 0.0.0.0:41597 every 8 connection(s)
I20260926 13:42:04.910326  8446 acceptor_pool.cc:254] collecting diagnostics on the listening RPC socket 0.0.0.0:41597 every 8 connection(s)
I20260926 13:42:04.939935  8128 rpc-test.cc:1236] Sleep() min lat: 20418
I20260926 13:42:04.939988  8128 rpc-test.cc:1237] Sleep() mean lat: 20418
I20260926 13:42:04.940012  8128 rpc-test.cc:1238] Sleep() max lat: 20418
I20260926 13:42:04.940024  8128 rpc-test.cc:1239] Sleep() #calls: 1
[       OK ] Parameters/TestRpc.TestRpcHandlerLatencyMetric/SSL_TCP (38 ms)
[ RUN      ] Parameters/TestRpc.TimedOutOnResponseMetricServiceQueue/SSL_TCP
I20260926 13:42:04.957635  8471 acceptor_pool.cc:254] collecting diagnostics on the listening RPC socket 0.0.0.0:41477 every 8 connection(s)
I20260926 13:42:04.957686  8472 acceptor_pool.cc:254] collecting diagnostics on the listening RPC socket 0.0.0.0:41477 every 8 connection(s)
W20260926 13:42:05.011713  8473 rpcz_store.cc:267] Call kudu.rpc_test.CalculatorService.Sleep from 127.0.0.1:54384 (request call id 2) took 20 ms (client timeout 20 ms). Trace:
W20260926 13:42:05.011794  8473 rpcz_store.cc:269] 0926 13:42:04.991409 (+     0us) service_pool.cc:170] Inserting onto call queue
0926 13:42:05.011668 (+ 20259us) service_pool.cc:214] Skipping call since client already timed out
0926 13:42:05.011693 (+    25us) inbound_call.cc:173] Queueing failure response
Metrics: {}
[       OK ] Parameters/TestRpc.TimedOutOnResponseMetricServiceQueue/SSL_TCP (71 ms)
[ RUN      ] Parameters/TestRpc.RpcPendingConnectionsMetric/SSL_TCP
I20260926 13:42:05.015441  8494 acceptor_pool.cc:254] collecting diagnostics on the listening RPC socket 0.0.0.0:35669 every 8 connection(s)
I20260926 13:42:05.015511  8495 acceptor_pool.cc:254] collecting diagnostics on the listening RPC socket 0.0.0.0:35669 every 8 connection(s)
W20260926 13:42:05.016525  8490 negotiation.cc:337] Failed RPC negotiation. Trace:
0926 13:42:05.016119 (+     0us) reactor.cc:625] Submitting negotiation task for server connection from 127.0.0.1:35946 (local address 127.0.0.1:35669)
0926 13:42:05.016214 (+    95us) server_negotiation.cc:206] Beginning negotiation
0926 13:42:05.016217 (+     3us) server_negotiation.cc:399] Waiting for connection header
0926 13:42:05.016342 (+   125us) negotiation.cc:327] Negotiation complete: Network error: Server connection negotiation failed: server connection from 127.0.0.1:35946: BlockingRecv error: recv got EOF from 127.0.0.1:35946 (error 108)
Metrics: {"server-negotiator.queue_time_us":33}
[       OK ] Parameters/TestRpc.RpcPendingConnectionsMetric/SSL_TCP (13 ms)
[ RUN      ] Parameters/TestRpc.TestRpcContextClientDeadline/SSL_TCP
I20260926 13:42:05.035526  8510 acceptor_pool.cc:254] collecting diagnostics on the listening RPC socket 0.0.0.0:37185 every 8 connection(s)
I20260926 13:42:05.035564  8511 acceptor_pool.cc:254] collecting diagnostics on the listening RPC socket 0.0.0.0:37185 every 8 connection(s)
[       OK ] Parameters/TestRpc.TestRpcContextClientDeadline/SSL_TCP (42 ms)
[ RUN      ] Parameters/TestRpc.TestApplicationFeatureFlagUnsupportedServer/SSL_TCP
I20260926 13:42:05.081727  8535 acceptor_pool.cc:254] collecting diagnostics on the listening RPC socket 0.0.0.0:37181 every 8 connection(s)
I20260926 13:42:05.081777  8536 acceptor_pool.cc:254] collecting diagnostics on the listening RPC socket 0.0.0.0:37181 every 8 connection(s)
[       OK ] Parameters/TestRpc.TestApplicationFeatureFlagUnsupportedServer/SSL_TCP (25 ms)
[ RUN      ] Parameters/TestRpc.TestCancellationAsync/SSL_TCP
I20260926 13:42:05.108422  8560 acceptor_pool.cc:254] collecting diagnostics on the listening RPC socket 0.0.0.0:33015 every 8 connection(s)
I20260926 13:42:05.108464  8561 acceptor_pool.cc:254] collecting diagnostics on the listening RPC socket 0.0.0.0:33015 every 8 connection(s)
I20260926 13:42:05.108747  8128 rpc-test.cc:1716] Connecting to 0.0.0.0:33015
I20260926 13:42:05.131266  8128 test_util.cc:268] Using random seed: -6650368
I20260926 13:42:05.148398  8564 rpc-test-base.h:240] got call: sleep_micros: 500 pattern: 4294967295 num_repetitions: 2097152 sidecar_idx: 0
I20260926 13:42:05.162447  8563 rpc-test-base.h:240] got call: sleep_micros: 500 pattern: 4294967295 num_repetitions: 2097152 sidecar_idx: 0
I20260926 13:42:05.176960  8564 rpc-test-base.h:240] got call: sleep_micros: 500 pattern: 4294967295 num_repetitions: 2097152 sidecar_idx: 0
I20260926 13:42:05.193432  8563 rpc-test-base.h:240] got call: sleep_micros: 500 pattern: 4294967295 num_repetitions: 2097152 sidecar_idx: 0
I20260926 13:42:05.211275  8564 rpc-test-base.h:240] got call: sleep_micros: 500 pattern: 4294967295 num_repetitions: 2097152 sidecar_idx: 0
I20260926 13:42:05.227067  8563 rpc-test-base.h:240] got call: sleep_micros: 500 pattern: 4294967295 num_repetitions: 2097152 sidecar_idx: 0
I20260926 13:42:05.244249  8564 rpc-test-base.h:240] got call: sleep_micros: 500 pattern: 4294967295 num_repetitions: 2097152 sidecar_idx: 0
I20260926 13:42:05.260116  8563 rpc-test-base.h:240] got call: sleep_micros: 500 pattern: 4294967295 num_repetitions: 2097152 sidecar_idx: 0
W20260926 13:42:05.266163  8558 connection.cc:441] server connection from 127.0.0.1:33366 torn down before Call kudu.rpc.GenericCalculatorService.SleepWithSidecar from 127.0.0.1:33366 (request call id 8) could send its response
W20260926 13:42:05.275755  8558 connection.cc:441] server connection from 127.0.0.1:33366 torn down before Call kudu.rpc.GenericCalculatorService.SleepWithSidecar from 127.0.0.1:33366 (request call id 9) could send its response
[       OK ] Parameters/TestRpc.TestCancellationAsync/SSL_TCP (182 ms)
[ RUN      ] Parameters/TestRpc.TestPerformanceBySocketType/SSL_TCP
I20260926 13:42:05.303967  8586 acceptor_pool.cc:254] collecting diagnostics on the listening RPC socket 0.0.0.0:34485 every 8 connection(s)
I20260926 13:42:05.303995  8585 acceptor_pool.cc:254] collecting diagnostics on the listening RPC socket 0.0.0.0:34485 every 8 connection(s)
I20260926 13:42:05.304277  8128 rpc-test.cc:1846] Connecting to 0.0.0.0:34485
I20260926 13:42:07.336856  8128 rpc-test.cc:1859] Sending 1024MB via ssl-enabled tcp socket: real 2.016s	user 2.075s	sys 1.512s
I20260926 13:42:09.241937  8128 rpc-test.cc:1859] Sending 1024MB via ssl-enabled tcp socket: real 1.905s	user 1.925s	sys 1.478s
I20260926 13:42:11.223306  8128 rpc-test.cc:1859] Sending 1024MB via ssl-enabled tcp socket: real 1.981s	user 2.068s	sys 1.483s
I20260926 13:42:13.143893  8128 rpc-test.cc:1859] Sending 1024MB via ssl-enabled tcp socket: real 1.920s	user 1.915s	sys 1.498s
I20260926 13:42:15.117775  8128 rpc-test.cc:1859] Sending 1024MB via ssl-enabled tcp socket: real 1.974s	user 2.025s	sys 1.501s
[       OK ] Parameters/TestRpc.TestPerformanceBySocketType/SSL_TCP (9843 ms)
[----------] 20 tests from Parameters/TestRpc (33732 ms total)

[----------] 1 test from Parameters/TestRpcSocketTxRxQueue
[ RUN      ] Parameters/TestRpcSocketTxRxQueue.OverCapacity/0
W20260926 13:42:15.395272  8602 negotiation.cc:337] Failed RPC negotiation. Trace:
0926 13:42:15.127817 (+     0us) reactor.cc:625] Submitting negotiation task for client connection to 0.0.0.0:35435 (local address 127.0.0.1:42928)
0926 13:42:15.127930 (+   113us) negotiation.cc:107] Waiting for socket to connect
0926 13:42:15.127954 (+    24us) client_negotiation.cc:174] Beginning negotiation
0926 13:42:15.128023 (+    69us) client_negotiation.cc:252] Sending NEGOTIATE NegotiatePB request
0926 13:42:15.395105 (+267082us) negotiation.cc:327] Negotiation complete: Network error: Client connection negotiation failed: client connection to 0.0.0.0:35435: BlockingRecv error: recv error from unknown peer: Transport endpoint is not connected (error 107)
Metrics: {"client-negotiator.queue_time_us":48}
W20260926 13:42:15.395327  8638 negotiation.cc:337] Failed RPC negotiation. Trace:
0926 13:42:15.132057 (+     0us) reactor.cc:625] Submitting negotiation task for client connection to 0.0.0.0:35435 (local address 127.0.0.1:42974)
0926 13:42:15.132182 (+   125us) negotiation.cc:107] Waiting for socket to connect
0926 13:42:15.132193 (+    11us) client_negotiation.cc:174] Beginning negotiation
0926 13:42:15.132287 (+    94us) client_negotiation.cc:252] Sending NEGOTIATE NegotiatePB request
0926 13:42:15.395231 (+262944us) negotiation.cc:327] Negotiation complete: Network error: Client connection negotiation failed: client connection to 0.0.0.0:35435: BlockingRecv error: recv error from unknown peer: Transport endpoint is not connected (error 107)
Metrics: {"client-negotiator.queue_time_us":42}
W20260926 13:42:15.395439  8647 negotiation.cc:337] Failed RPC negotiation. Trace:
0926 13:42:15.133194 (+     0us) reactor.cc:625] Submitting negotiation task for client connection to 0.0.0.0:35435 (local address 127.0.0.1:42978)
0926 13:42:15.133294 (+   100us) negotiation.cc:107] Waiting for socket to connect
0926 13:42:15.133309 (+    15us) client_negotiation.cc:174] Beginning negotiation
0926 13:42:15.133382 (+    73us) client_negotiation.cc:252] Sending NEGOTIATE NegotiatePB request
0926 13:42:15.395387 (+262005us) negotiation.cc:327] Negotiation complete: Network error: Client connection negotiation failed: client connection to 0.0.0.0:35435: BlockingRecv error: recv error from unknown peer: Transport endpoint is not connected (error 107)
Metrics: {"client-negotiator.queue_time_us":25}
W20260926 13:42:15.395637  8611 negotiation.cc:337] Failed RPC negotiation. Trace:
0926 13:42:15.128860 (+     0us) reactor.cc:625] Submitting negotiation task for client connection to 0.0.0.0:35435 (local address 127.0.0.1:42938)
0926 13:42:15.128957 (+    97us) negotiation.cc:107] Waiting for socket to connect
0926 13:42:15.128971 (+    14us) client_negotiation.cc:174] Beginning negotiation
0926 13:42:15.129047 (+    76us) client_negotiation.cc:252] Sending NEGOTIATE NegotiatePB request
0926 13:42:15.395104 (+266057us) negotiation.cc:327] Negotiation complete: Network error: Client connection negotiation failed: client connection to 0.0.0.0:35435: BlockingRecv error: recv error from unknown peer: Transport endpoint is not connected (error 107)
Metrics: {"client-negotiator.queue_time_us":24}
W20260926 13:42:15.395268  8620 negotiation.cc:337] Failed RPC negotiation. Trace:
0926 13:42:15.129867 (+     0us) reactor.cc:625] Submitting negotiation task for client connection to 0.0.0.0:35435 (local address 127.0.0.1:42954)
0926 13:42:15.129962 (+    95us) negotiation.cc:107] Waiting for socket to connect
0926 13:42:15.129976 (+    14us) client_negotiation.cc:174] Beginning negotiation
0926 13:42:15.130065 (+    89us) client_negotiation.cc:252] Sending NEGOTIATE NegotiatePB request
0926 13:42:15.395105 (+265040us) negotiation.cc:327] Negotiation complete: Network error: Client connection negotiation failed: client connection to 0.0.0.0:35435: BlockingRecv error: recv error from unknown peer: Transport endpoint is not connected (error 107)
Metrics: {"client-negotiator.queue_time_us":23}
W20260926 13:42:15.395740  8629 negotiation.cc:337] Failed RPC negotiation. Trace:
0926 13:42:15.131018 (+     0us) reactor.cc:625] Submitting negotiation task for client connection to 0.0.0.0:35435 (local address 127.0.0.1:42958)
0926 13:42:15.131158 (+   140us) negotiation.cc:107] Waiting for socket to connect
0926 13:42:15.131170 (+    12us) client_negotiation.cc:174] Beginning negotiation
0926 13:42:15.131255 (+    85us) client_negotiation.cc:252] Sending NEGOTIATE NegotiatePB request
0926 13:42:15.395110 (+263855us) negotiation.cc:327] Negotiation complete: Network error: Client connection negotiation failed: client connection to 0.0.0.0:35435: BlockingRecv error: recv error from unknown peer: Transport endpoint is not connected (error 107)
Metrics: {"client-negotiator.queue_time_us":43}
[       OK ] Parameters/TestRpcSocketTxRxQueue.OverCapacity/0 (1045 ms)
[----------] 1 test from Parameters/TestRpcSocketTxRxQueue (1045 ms total)

[----------] Global test environment tear-down
[==========] 21 tests from 2 test suites ran. (34777 ms total)
[  PASSED  ] 20 tests.
[  FAILED  ] 1 test, listed below:
[  FAILED  ] Parameters/TestRpc.TestCallWithChainCertAndChainCA/SSL_TCP, where GetParam() = (true, false)

 1 FAILED TEST