Diagnosed failure

Parameters/TestRpc.TestCallWithChainCertAndRootCA/SSL_TCP: /data0/somelongdirectorytoavoidrpathissues/src/kudu/src/kudu/rpc/rpc-test.cc:303: Failure
Failed
Bad status: Runtime error: could not verify certificate chain (error with cert: subject=CN = localhost, ST = sadfjas, C = AS, emailAddress = sdflkdsajf, O = lskdfjlsad, OU = sldfkja, issuer=C = AS, ST = ASDfkjdhf, L = lskdjf, O = saldfja, OU = skdjf, CN = localhost, emailAddress = sadjflkadsj): : certificate has expired
Google Test trace:
/data0/somelongdirectorytoavoidrpathissues/src/kudu/src/kudu/rpc/rpc-test.cc:300: Connecting to 0.0.0.0:40339
I20260928 11:44:45.730742   390 test_util.cc:175] -----------------------------------------------
I20260928 11:44:45.730921   390 test_util.cc:176] Had fatal failures, leaving test files at /tmp/dist-test-taskFlEQ0J/test-tmp/rpc-test.1.Parameters_TestRpc.TestCallWithChainCertAndRootCA_SSL_TCP.1790595884275411-390-0

Full log

Note: This is test shard 2 of 8.
[==========] Running 21 tests from 2 test suites.
[----------] Global test environment set-up.
[----------] 1 test from TestRpc
[ RUN      ] TestRpc.TestMethodsByName
[       OK ] TestRpc.TestMethodsByName (6 ms)
[----------] 1 test from TestRpc (6 ms total)

[----------] 20 tests from Parameters/TestRpc
[ RUN      ] Parameters/TestRpc.TestAcceptorPoolStartStop/SSL_TCP
WARNING: Logging before InitGoogleLogging() is written to STDERR
I20260928 11:44:44.384974   405 acceptor_pool.cc:254] collecting diagnostics on the listening RPC socket 0.0.0.0:36905 every 8 connection(s)
I20260928 11:44:44.386325   406 acceptor_pool.cc:254] collecting diagnostics on the listening RPC socket 0.0.0.0:36905 every 8 connection(s)
W20260928 11:44:45.386819   390 thread.cc:536] Waited for 1000ms trying to join with acceptor (tid 406)
I20260928 11:44:45.451376   417 acceptor_pool.cc:254] collecting diagnostics on the listening RPC socket 0.0.0.0:32991 every 8 connection(s)
I20260928 11:44:45.452636   418 acceptor_pool.cc:254] collecting diagnostics on the listening RPC socket 0.0.0.0:32991 every 8 connection(s)
I20260928 11:44:45.502803   428 acceptor_pool.cc:254] collecting diagnostics on the listening RPC socket 0.0.0.0:45359 every 8 connection(s)
I20260928 11:44:45.504555   429 acceptor_pool.cc:254] collecting diagnostics on the listening RPC socket 0.0.0.0:45359 every 8 connection(s)
I20260928 11:44:45.521903   439 acceptor_pool.cc:254] collecting diagnostics on the listening RPC socket 0.0.0.0:38649 every 8 connection(s)
I20260928 11:44:45.522545   440 acceptor_pool.cc:254] collecting diagnostics on the listening RPC socket 0.0.0.0:38649 every 8 connection(s)
I20260928 11:44:45.541720   450 acceptor_pool.cc:254] collecting diagnostics on the listening RPC socket 0.0.0.0:46229 every 8 connection(s)
I20260928 11:44:45.542382   451 acceptor_pool.cc:254] collecting diagnostics on the listening RPC socket 0.0.0.0:46229 every 8 connection(s)
[       OK ] Parameters/TestRpc.TestAcceptorPoolStartStop/SSL_TCP (1210 ms)
[ RUN      ] Parameters/TestRpc.TestCall/SSL_TCP
I20260928 11:44:45.580961   463 acceptor_pool.cc:254] collecting diagnostics on the listening RPC socket 0.0.0.0:33813 every 8 connection(s)
I20260928 11:44:45.582651   464 acceptor_pool.cc:254] collecting diagnostics on the listening RPC socket 0.0.0.0:33813 every 8 connection(s)
I20260928 11:44:45.587570   390 rpc-test.cc:234] Connecting to 0.0.0.0:33813
[       OK ] Parameters/TestRpc.TestCall/SSL_TCP (133 ms)
[ RUN      ] Parameters/TestRpc.TestCallWithChainCertAndRootCA/SSL_TCP
I20260928 11:44:45.711215   488 acceptor_pool.cc:254] collecting diagnostics on the listening RPC socket 0.0.0.0:40339 every 8 connection(s)
I20260928 11:44:45.711918   489 acceptor_pool.cc:254] collecting diagnostics on the listening RPC socket 0.0.0.0:40339 every 8 connection(s)
/data0/somelongdirectorytoavoidrpathissues/src/kudu/src/kudu/rpc/rpc-test.cc:303: Failure
Failed
Bad status: Runtime error: could not verify certificate chain (error with cert: subject=CN = localhost, ST = sadfjas, C = AS, emailAddress = sdflkdsajf, O = lskdfjlsad, OU = sldfkja, issuer=C = AS, ST = ASDfkjdhf, L = lskdjf, O = saldfja, OU = skdjf, CN = localhost, emailAddress = sadjflkadsj): : certificate has expired
Google Test trace:
/data0/somelongdirectorytoavoidrpathissues/src/kudu/src/kudu/rpc/rpc-test.cc:300: Connecting to 0.0.0.0:40339
I20260928 11:44:45.730742   390 test_util.cc:175] -----------------------------------------------
I20260928 11:44:45.730921   390 test_util.cc:176] Had fatal failures, leaving test files at /tmp/dist-test-taskFlEQ0J/test-tmp/rpc-test.1.Parameters_TestRpc.TestCallWithChainCertAndRootCA_SSL_TCP.1790595884275411-390-0
[  FAILED  ] Parameters/TestRpc.TestCallWithChainCertAndRootCA/SSL_TCP, where GetParam() = (true, false) (51 ms)
[ RUN      ] Parameters/TestRpc.TestCallWithBadPasswordProtectedKey/SSL_TCP
[       OK ] Parameters/TestRpc.TestCallWithBadPasswordProtectedKey/SSL_TCP (29 ms)
[ RUN      ] Parameters/TestRpc.TestInvalidMethodCall/SSL_TCP
I20260928 11:44:45.785387   525 acceptor_pool.cc:254] collecting diagnostics on the listening RPC socket 0.0.0.0:36519 every 8 connection(s)
I20260928 11:44:45.786137   526 acceptor_pool.cc:254] collecting diagnostics on the listening RPC socket 0.0.0.0:36519 every 8 connection(s)
I20260928 11:44:45.789304   390 rpc-test.cc:406] Connecting to 0.0.0.0:36519
[       OK ] Parameters/TestRpc.TestInvalidMethodCall/SSL_TCP (73 ms)
[ RUN      ] Parameters/TestRpc.TestHighFDs/SSL_TCP
I20260928 11:44:46.046245   550 acceptor_pool.cc:254] collecting diagnostics on the listening RPC socket 0.0.0.0:38951 every 8 connection(s)
I20260928 11:44:46.046903   551 acceptor_pool.cc:254] collecting diagnostics on the listening RPC socket 0.0.0.0:38951 every 8 connection(s)
[       OK ] Parameters/TestRpc.TestHighFDs/SSL_TCP (264 ms)
[ RUN      ] Parameters/TestRpc.TestConnectionAlwaysKeepalive/SSL_TCP
I20260928 11:44:46.149793   573 acceptor_pool.cc:254] collecting diagnostics on the listening RPC socket 0.0.0.0:37945 every 8 connection(s)
I20260928 11:44:46.150370   574 acceptor_pool.cc:254] collecting diagnostics on the listening RPC socket 0.0.0.0:37945 every 8 connection(s)
I20260928 11:44:46.153415   390 rpc-test.cc:532] Connecting to 0.0.0.0:37945
[       OK ] Parameters/TestRpc.TestConnectionAlwaysKeepalive/SSL_TCP (3095 ms)
[ RUN      ] Parameters/TestRpc.TestReopenOutboundConnections/SSL_TCP
I20260928 11:44:49.218349   596 acceptor_pool.cc:254] collecting diagnostics on the listening RPC socket 0.0.0.0:43609 every 8 connection(s)
I20260928 11:44:49.219049   597 acceptor_pool.cc:254] collecting diagnostics on the listening RPC socket 0.0.0.0:43609 every 8 connection(s)
I20260928 11:44:49.221822   390 rpc-test.cc:658] Connecting to 0.0.0.0:43609
[       OK ] Parameters/TestRpc.TestReopenOutboundConnections/SSL_TCP (327 ms)
[ RUN      ] Parameters/TestRpc.TestConnectionNetworkPlane/SSL_TCP
I20260928 11:44:49.542666   619 acceptor_pool.cc:254] collecting diagnostics on the listening RPC socket 0.0.0.0:33887 every 8 connection(s)
I20260928 11:44:49.543316   620 acceptor_pool.cc:254] collecting diagnostics on the listening RPC socket 0.0.0.0:33887 every 8 connection(s)
I20260928 11:44:49.546137   390 rpc-test.cc:772] Connecting to 0.0.0.0:33887
[       OK ] Parameters/TestRpc.TestConnectionNetworkPlane/SSL_TCP (71 ms)
[ RUN      ] Parameters/TestRpc.TestTCPKeepalive/SSL_TCP
I20260928 11:44:49.612695   644 acceptor_pool.cc:254] collecting diagnostics on the listening RPC socket 0.0.0.0:33009 every 8 connection(s)
I20260928 11:44:49.613355   645 acceptor_pool.cc:254] collecting diagnostics on the listening RPC socket 0.0.0.0:33009 every 8 connection(s)
I20260928 11:44:49.647188   648 rpc-test-base.h:222] got call: sleep_micros: 8000000 deferred: true
I20260928 11:44:57.650976   648 rpcz_store.cc:275] Call kudu.rpc.GenericCalculatorService.Sleep from 127.0.0.1:41204 (request call id 0) took 8003 ms. Trace:
I20260928 11:44:57.651367   648 rpcz_store.cc:276] 0928 11:44:49.646973 (+     0us) service_pool.cc:170] Inserting onto call queue
0928 11:44:49.647051 (+    78us) service_pool.cc:227] Handling call
0928 11:44:57.650809 (+8003758us) inbound_call.cc:173] Queueing success response
Metrics: {}
[       OK ] Parameters/TestRpc.TestTCPKeepalive/SSL_TCP (8069 ms)
[ RUN      ] Parameters/TestRpc.TestMaxSmallSidecars/SSL_TCP
I20260928 11:44:57.685194   670 acceptor_pool.cc:254] collecting diagnostics on the listening RPC socket 0.0.0.0:33723 every 8 connection(s)
I20260928 11:44:57.685897   671 acceptor_pool.cc:254] collecting diagnostics on the listening RPC socket 0.0.0.0:33723 every 8 connection(s)
[       OK ] Parameters/TestRpc.TestMaxSmallSidecars/SSL_TCP (202 ms)
[ RUN      ] Parameters/TestRpc.TestCallTimeout/SSL_TCP
I20260928 11:44:57.888561   695 acceptor_pool.cc:254] collecting diagnostics on the listening RPC socket 0.0.0.0:37227 every 8 connection(s)
I20260928 11:44:57.889217   696 acceptor_pool.cc:254] collecting diagnostics on the listening RPC socket 0.0.0.0:37227 every 8 connection(s)
I20260928 11:44:57.913164   390 rpc-test-base.h:595] status: Timed out: connection negotiation to 0.0.0.0:37227 for RPC Sleep timed out after 0.000s (ON_OUTBOUND_QUEUE), seconds elapsed: 0.0022543
I20260928 11:44:57.919914   699 rpc-test-base.h:222] got call: sleep_micros: 700000
I20260928 11:44:58.114552   390 rpc-test-base.h:595] status: Timed out: Sleep RPC to 0.0.0.0:37227 timed out after 0.200s (SENT), seconds elapsed: 0.201081
I20260928 11:44:58.115902   698 rpc-test-base.h:222] got call: sleep_micros: 2000000
W20260928 11:44:58.620508   699 rpcz_store.cc:267] Call kudu.rpc.GenericCalculatorService.Sleep from 127.0.0.1:55988 (request call id 1) took 700 ms (client timeout 200 ms). Trace:
W20260928 11:44:58.620817   699 rpcz_store.cc:269] 0928 11:44:57.919730 (+     0us) service_pool.cc:170] Inserting onto call queue
0928 11:44:57.919829 (+    99us) service_pool.cc:227] Handling call
0928 11:44:58.620453 (+700624us) inbound_call.cc:173] Queueing success response
Metrics: {}
I20260928 11:44:59.617090   390 rpc-test-base.h:595] status: Timed out: Sleep RPC to 0.0.0.0:37227 timed out after 1.500s (SENT), seconds elapsed: 1.50222
W20260928 11:45:00.116411   698 rpcz_store.cc:267] Call kudu.rpc.GenericCalculatorService.Sleep from 127.0.0.1:55988 (request call id 2) took 2000 ms (client timeout 1500 ms). Trace:
W20260928 11:45:00.116725   698 rpcz_store.cc:269] 0928 11:44:58.115640 (+     0us) service_pool.cc:170] Inserting onto call queue
0928 11:44:58.115757 (+   117us) service_pool.cc:227] Handling call
0928 11:45:00.116363 (+2000606us) inbound_call.cc:173] Queueing success response
Metrics: {}
W20260928 11:45:00.117237   694 connection.cc:441] server connection from 127.0.0.1:55988 torn down before Call kudu.rpc.GenericCalculatorService.Sleep from 127.0.0.1:55988 (request call id 2) could send its response
[       OK ] Parameters/TestRpc.TestCallTimeout/SSL_TCP (2255 ms)
[ RUN      ] Parameters/TestRpc.TestServerShutsDown/SSL_TCP
I20260928 11:45:00.123363   390 rpc-test.cc:1125] Connecting to 0.0.0.0:41147
W20260928 11:45:00.135752   712 negotiation.cc:337] Failed RPC negotiation. Trace:
0928 11:45:00.134333 (+     0us) reactor.cc:625] Submitting negotiation task for client connection to 0.0.0.0:41147 (local address 127.0.0.1:45956)
0928 11:45:00.134764 (+   431us) negotiation.cc:107] Waiting for socket to connect
0928 11:45:00.134793 (+    29us) client_negotiation.cc:174] Beginning negotiation
0928 11:45:00.134992 (+   199us) client_negotiation.cc:252] Sending NEGOTIATE NegotiatePB request
0928 11:45:00.135197 (+   205us) negotiation.cc:327] Negotiation complete: Network error: Client connection negotiation failed: client connection to 0.0.0.0:41147: BlockingWrite error: write error: Broken pipe (error 32)
Metrics: {"client-negotiator.queue_time_us":102}
[       OK ] Parameters/TestRpc.TestServerShutsDown/SSL_TCP (16 ms)
[ RUN      ] Parameters/TestRpc.TimedOutOnResponseMetric/SSL_TCP
I20260928 11:45:00.159677   729 acceptor_pool.cc:254] collecting diagnostics on the listening RPC socket 0.0.0.0:33731 every 8 connection(s)
I20260928 11:45:00.160369   730 acceptor_pool.cc:254] collecting diagnostics on the listening RPC socket 0.0.0.0:33731 every 8 connection(s)
W20260928 11:45:00.392832   733 rpcz_store.cc:267] Call kudu.rpc_test.CalculatorService.Sleep from 127.0.0.1:49962 (request call id 3) took 50 ms (client timeout 25 ms). Trace:
W20260928 11:45:00.393118   733 rpcz_store.cc:269] 0928 11:45:00.342315 (+     0us) service_pool.cc:170] Inserting onto call queue
0928 11:45:00.342428 (+   113us) service_pool.cc:227] Handling call
0928 11:45:00.392767 (+ 50339us) inbound_call.cc:173] Queueing success response
Related trace 'test_child':
Metrics: {"test_sleep_us":50000,"child_traces":[["test_child",{"related_trace_metric":1}]]}
W20260928 11:45:00.451833   733 rpcz_store.cc:267] Call kudu.rpc_test.CalculatorService.Sleep from 127.0.0.1:49962 (request call id 4) took 50 ms (client timeout 50 ms). Trace:
W20260928 11:45:00.452122   733 rpcz_store.cc:269] 0928 11:45:00.401296 (+     0us) service_pool.cc:170] Inserting onto call queue
0928 11:45:00.401435 (+   139us) service_pool.cc:227] Handling call
0928 11:45:00.451778 (+ 50343us) inbound_call.cc:173] Queueing success response
Related trace 'test_child':
Metrics: {"test_sleep_us":50000,"child_traces":[["test_child",{"related_trace_metric":1}]]}
[       OK ] Parameters/TestRpc.TimedOutOnResponseMetric/SSL_TCP (321 ms)
[ RUN      ] Parameters/TestRpc.AcceptorDispatchingTimesMetric/SSL_TCP
I20260928 11:45:00.470580   754 acceptor_pool.cc:254] collecting diagnostics on the listening RPC socket 0.0.0.0:43537 every 8 connection(s)
I20260928 11:45:00.471156   755 acceptor_pool.cc:254] collecting diagnostics on the listening RPC socket 0.0.0.0:43537 every 8 connection(s)
W20260928 11:45:00.475348   750 negotiation.cc:337] Failed RPC negotiation. Trace:
0928 11:45:00.474365 (+     0us) reactor.cc:625] Submitting negotiation task for server connection from 127.0.0.1:46256 (local address 127.0.0.1:43537)
0928 11:45:00.474725 (+   360us) server_negotiation.cc:206] Beginning negotiation
0928 11:45:00.474742 (+    17us) server_negotiation.cc:399] Waiting for connection header
0928 11:45:00.474948 (+   206us) negotiation.cc:327] Negotiation complete: Network error: Server connection negotiation failed: server connection from 127.0.0.1:46256: BlockingRecv error: recv got EOF from 127.0.0.1:46256 (error 108)
Metrics: {"server-negotiator.queue_time_us":88}
[       OK ] Parameters/TestRpc.AcceptorDispatchingTimesMetric/SSL_TCP (19 ms)
[ RUN      ] Parameters/TestRpc.TestRpcCallbackDestroysMessenger/SSL_TCP
[       OK ] Parameters/TestRpc.TestRpcCallbackDestroysMessenger/SSL_TCP (16 ms)
[ RUN      ] Parameters/TestRpc.TestApplicationFeatureFlag/SSL_TCP
I20260928 11:45:00.534612   779 acceptor_pool.cc:254] collecting diagnostics on the listening RPC socket 0.0.0.0:33371 every 8 connection(s)
I20260928 11:45:00.535267   780 acceptor_pool.cc:254] collecting diagnostics on the listening RPC socket 0.0.0.0:33371 every 8 connection(s)
W20260928 11:45:00.573910   778 messenger.cc:357] Unable to handle RPC call: Not implemented: call requires unsupported application feature flags: 99
[       OK ] Parameters/TestRpc.TestApplicationFeatureFlag/SSL_TCP (84 ms)
[ RUN      ] Parameters/TestRpc.TestCancellation/SSL_TCP
I20260928 11:45:00.611790   804 acceptor_pool.cc:254] collecting diagnostics on the listening RPC socket 0.0.0.0:33853 every 8 connection(s)
I20260928 11:45:00.612458   805 acceptor_pool.cc:254] collecting diagnostics on the listening RPC socket 0.0.0.0:33853 every 8 connection(s)
I20260928 11:45:00.615417   390 rpc-test.cc:1648] Connecting to 0.0.0.0:33853
I20260928 11:45:00.720956   390 rpc-test-base.h:595] status: Aborted: Sleep RPC to 0.0.0.0:33853 is cancelled in state READY, seconds elapsed: 0.000311926
I20260928 11:45:00.852902   390 rpc-test-base.h:595] status: Aborted: Sleep RPC to 0.0.0.0:33853 is cancelled in state SENT, seconds elapsed: 0.000895412
I20260928 11:45:00.889334   807 rpc-test-base.h:222] got call: sleep_micros: 510000
I20260928 11:45:01.016733   390 rpc-test-base.h:595] status: Aborted: Sleep RPC to 0.0.0.0:33853 is cancelled in state SENT, seconds elapsed: 0.000805517
I20260928 11:45:01.053697   806 rpc-test-base.h:222] got call: sleep_micros: 510000
I20260928 11:45:01.173945   390 rpc-test-base.h:595] status: Aborted: Sleep RPC to 0.0.0.0:33853 is cancelled in state SENT, seconds elapsed: 0.000837851
W20260928 11:45:01.211119   808 rpcz_store.cc:267] Call kudu.rpc.GenericCalculatorService.Sleep from 127.0.0.1:40838 (request call id 11) took 14 ms (client timeout 10 ms). Trace:
W20260928 11:45:01.211447   808 rpcz_store.cc:269] 0928 11:45:01.197003 (+     0us) service_pool.cc:170] Inserting onto call queue
0928 11:45:01.210886 (+ 13883us) service_pool.cc:214] Skipping call since client already timed out
0928 11:45:01.210965 (+    79us) inbound_call.cc:173] Queueing failure response
Metrics: {}
I20260928 11:45:01.211931   808 rpc-test-base.h:222] got call: sleep_micros: 1500000
W20260928 11:45:01.399919   807 rpcz_store.cc:267] Call kudu.rpc.GenericCalculatorService.Sleep from 127.0.0.1:40838 (request call id 3) took 510 ms (client timeout 10 ms). Trace:
W20260928 11:45:01.400249   807 rpcz_store.cc:269] 0928 11:45:00.888993 (+     0us) service_pool.cc:170] Inserting onto call queue
0928 11:45:00.889263 (+   270us) service_pool.cc:227] Handling call
0928 11:45:01.399870 (+510607us) inbound_call.cc:173] Queueing success response
Metrics: {}
W20260928 11:45:01.564370   806 rpcz_store.cc:267] Call kudu.rpc.GenericCalculatorService.Sleep from 127.0.0.1:40838 (request call id 7) took 510 ms (client timeout 10 ms). Trace:
W20260928 11:45:01.564661   806 rpcz_store.cc:269] 0928 11:45:01.053496 (+     0us) service_pool.cc:170] Inserting onto call queue
0928 11:45:01.053619 (+   123us) service_pool.cc:227] Handling call
0928 11:45:01.564318 (+510699us) inbound_call.cc:173] Queueing success response
Metrics: {}
I20260928 11:45:02.175920   390 rpc-test-base.h:595] status: Timed out: Sleep RPC to 0.0.0.0:33853 timed out after 1.000s (SENT), seconds elapsed: 1.00157
I20260928 11:45:02.177284   806 rpc-test-base.h:222] got call: sleep_micros: 1500000
W20260928 11:45:02.712399   808 rpcz_store.cc:267] Call kudu.rpc.GenericCalculatorService.Sleep from 127.0.0.1:40838 (request call id 12) took 1515 ms (client timeout 1000 ms). Trace:
W20260928 11:45:02.712699   808 rpcz_store.cc:269] 0928 11:45:01.197214 (+     0us) service_pool.cc:170] Inserting onto call queue
0928 11:45:01.211900 (+ 14686us) service_pool.cc:227] Handling call
0928 11:45:02.712353 (+1500453us) inbound_call.cc:173] Queueing success response
Metrics: {}
I20260928 11:45:03.177784   390 rpc-test-base.h:595] status: Timed out: Sleep RPC to 0.0.0.0:33853 timed out after 1.000s (SENT), seconds elapsed: 1.00139
W20260928 11:45:03.179114   802 messenger.cc:357] Unable to handle RPC call: Not implemented: call requires unsupported application feature flags: 99, 1
W20260928 11:45:03.180433   802 messenger.cc:357] Unable to handle RPC call: Not implemented: call requires unsupported application feature flags: 99, 1
W20260928 11:45:03.677739   806 rpcz_store.cc:267] Call kudu.rpc.GenericCalculatorService.Sleep from 127.0.0.1:40838 (request call id 13) took 1500 ms (client timeout 1000 ms). Trace:
W20260928 11:45:03.678040   806 rpcz_store.cc:269] 0928 11:45:02.177138 (+     0us) service_pool.cc:170] Inserting onto call queue
0928 11:45:02.177242 (+   104us) service_pool.cc:227] Handling call
0928 11:45:03.677692 (+1500450us) inbound_call.cc:173] Queueing success response
Metrics: {}
W20260928 11:45:03.678581   802 connection.cc:441] server connection from 127.0.0.1:40838 torn down before Call kudu.rpc.GenericCalculatorService.Sleep from 127.0.0.1:40838 (request call id 13) could send its response
[       OK ] Parameters/TestRpc.TestCancellation/SSL_TCP (3102 ms)
[ RUN      ] Parameters/TestRpc.TestCancellationMultiThreads/SSL_TCP
I20260928 11:45:03.702308   829 acceptor_pool.cc:254] collecting diagnostics on the listening RPC socket 0.0.0.0:41031 every 8 connection(s)
I20260928 11:45:03.702983   830 acceptor_pool.cc:254] collecting diagnostics on the listening RPC socket 0.0.0.0:41031 every 8 connection(s)
I20260928 11:45:03.705778   390 rpc-test.cc:1808] Connecting to 0.0.0.0:41031
I20260928 11:45:03.837489   843 test_util.cc:268] Using random seed: -1731668721
I20260928 11:45:03.838513   844 test_util.cc:268] Using random seed: -1731667684
I20260928 11:45:03.839839   845 test_util.cc:268] Using random seed: -1731666364
I20260928 11:45:03.841163   846 test_util.cc:268] Using random seed: -1731665053
I20260928 11:45:03.842664   847 test_util.cc:268] Using random seed: -1731663680
I20260928 11:45:03.843907   848 test_util.cc:268] Using random seed: -1731662408
I20260928 11:45:03.845269   849 test_util.cc:268] Using random seed: -1731661061
I20260928 11:45:03.846817   850 test_util.cc:268] Using random seed: -1731659640
I20260928 11:45:03.848726   851 test_util.cc:268] Using random seed: -1731657585
I20260928 11:45:03.850226   852 test_util.cc:268] Using random seed: -1731656512
I20260928 11:45:03.851452   853 test_util.cc:268] Using random seed: -1731654860
I20260928 11:45:03.853332   854 test_util.cc:268] Using random seed: -1731652986
I20260928 11:45:03.855125   855 test_util.cc:268] Using random seed: -1731651247
I20260928 11:45:03.857057   856 test_util.cc:268] Using random seed: -1731649322
I20260928 11:45:03.859112   857 test_util.cc:268] Using random seed: -1731647224
I20260928 11:45:03.865025   858 test_util.cc:268] Using random seed: -1731641312
I20260928 11:45:03.872989   859 test_util.cc:268] Using random seed: -1731633362
I20260928 11:45:03.874898   860 test_util.cc:268] Using random seed: -1731631450
I20260928 11:45:03.876749   861 test_util.cc:268] Using random seed: -1731630024
I20260928 11:45:03.880282   862 test_util.cc:268] Using random seed: -1731626062
I20260928 11:45:03.882565   863 test_util.cc:268] Using random seed: -1731623803
I20260928 11:45:03.884459   864 test_util.cc:268] Using random seed: -1731622300
I20260928 11:45:03.885797   865 test_util.cc:268] Using random seed: -1731620527
I20260928 11:45:03.887643   866 test_util.cc:268] Using random seed: -1731618670
I20260928 11:45:03.889379   867 test_util.cc:268] Using random seed: -1731616898
I20260928 11:45:03.891036   868 test_util.cc:268] Using random seed: -1731615268
I20260928 11:45:03.892726   869 test_util.cc:268] Using random seed: -1731614133
I20260928 11:45:03.893743   870 test_util.cc:268] Using random seed: -1731612564
I20260928 11:45:03.895588   871 test_util.cc:268] Using random seed: -1731610749
I20260928 11:45:03.897414   872 test_util.cc:268] Using random seed: -1731608920
[       OK ] Parameters/TestRpc.TestCancellationMultiThreads/SSL_TCP (16512 ms)
[ RUN      ] Parameters/TestRpc.TestCallId/SSL_TCP
I20260928 11:45:20.222169   886 acceptor_pool.cc:254] collecting diagnostics on the listening RPC socket 0.0.0.0:38555 every 8 connection(s)
I20260928 11:45:20.222954   887 acceptor_pool.cc:254] collecting diagnostics on the listening RPC socket 0.0.0.0:38555 every 8 connection(s)
[       OK ] Parameters/TestRpc.TestCallId/SSL_TCP (77 ms)
[----------] 20 tests from Parameters/TestRpc (35939 ms total)

[----------] Global test environment tear-down
[==========] 21 tests from 2 test suites ran. (35946 ms total)
[  PASSED  ] 20 tests.
[  FAILED  ] 1 test, listed below:
[  FAILED  ] Parameters/TestRpc.TestCallWithChainCertAndRootCA/SSL_TCP, where GetParam() = (true, false)

 1 FAILED TEST