Diagnosed failure

Parameters/TestRpc.TestCallWithChainCertAndChainCA/SSL_UnixSocket: /data0/somelongdirectorytoavoidrpathissues/src/kudu/src/kudu/rpc/rpc-test.cc:270: Failure
Failed
Bad status: Runtime error: could not verify certificate chain (error with cert: subject=CN = localhost, ST = sadfjas, C = AS, emailAddress = sdflkdsajf, O = lskdfjlsad, OU = sldfkja, issuer=C = AS, ST = ASDfkjdhf, L = lskdjf, O = saldfja, OU = skdjf, CN = localhost, emailAddress = sadjflkadsj): : certificate has expired
Google Test trace:
/data0/somelongdirectorytoavoidrpathissues/src/kudu/src/kudu/rpc/rpc-test.cc:267: Connecting to unix:/tmp/dist-test-taskNy2F9y/test-tmp/rpc-test-8948c74e3e914a49986831ff1ef4d2cf.sock
I20260927 19:41:41.655272 12517 test_util.cc:175] -----------------------------------------------
I20260927 19:41:41.655474 12517 test_util.cc:176] Had fatal failures, leaving test files at /tmp/dist-test-taskNy2F9y/test-tmp/rpc-test.6.Parameters_TestRpc.TestCallWithChainCertAndChainCA_SSL_UnixSocket.1790538100279941-12517-0

Full log

Note: This is test shard 7 of 8.
[==========] Running 21 tests from 2 test suites.
[----------] Global test environment set-up.
[----------] 20 tests from Parameters/TestRpc
[ RUN      ] Parameters/TestRpc.TestMessengerCreateDestroy/SSL_UnixSocket
WARNING: Logging before InitGoogleLogging() is written to STDERR
I20260927 19:41:40.378510 12517 rpc-test.cc:169] started messenger TestCreateDestroy
[       OK ] Parameters/TestRpc.TestMessengerCreateDestroy/SSL_UnixSocket (1198 ms)
[ RUN      ] Parameters/TestRpc.TestNegotiationDeadlock/SSL_UnixSocket
I20260927 19:41:41.551205 12539 acceptor_pool.cc:254] collecting diagnostics on the listening RPC socket unix:/tmp/dist-test-taskNy2F9y/test-tmp/rpc-test-747a7fe187b340e1afcf85395a47387c.sock every 8 connection(s)
I20260927 19:41:41.552766 12540 acceptor_pool.cc:254] collecting diagnostics on the listening RPC socket unix:/tmp/dist-test-taskNy2F9y/test-tmp/rpc-test-747a7fe187b340e1afcf85395a47387c.sock every 8 connection(s)
[       OK ] Parameters/TestRpc.TestNegotiationDeadlock/SSL_UnixSocket (72 ms)
[ RUN      ] Parameters/TestRpc.TestCallWithChainCertAndChainCA/SSL_UnixSocket
I20260927 19:41:41.626101 12555 acceptor_pool.cc:254] collecting diagnostics on the listening RPC socket unix:/tmp/dist-test-taskNy2F9y/test-tmp/rpc-test-8948c74e3e914a49986831ff1ef4d2cf.sock every 8 connection(s)
I20260927 19:41:41.628324 12556 acceptor_pool.cc:254] collecting diagnostics on the listening RPC socket unix:/tmp/dist-test-taskNy2F9y/test-tmp/rpc-test-8948c74e3e914a49986831ff1ef4d2cf.sock every 8 connection(s)
/data0/somelongdirectorytoavoidrpathissues/src/kudu/src/kudu/rpc/rpc-test.cc:270: Failure
Failed
Bad status: Runtime error: could not verify certificate chain (error with cert: subject=CN = localhost, ST = sadfjas, C = AS, emailAddress = sdflkdsajf, O = lskdfjlsad, OU = sldfkja, issuer=C = AS, ST = ASDfkjdhf, L = lskdjf, O = saldfja, OU = skdjf, CN = localhost, emailAddress = sadjflkadsj): : certificate has expired
Google Test trace:
/data0/somelongdirectorytoavoidrpathissues/src/kudu/src/kudu/rpc/rpc-test.cc:267: Connecting to unix:/tmp/dist-test-taskNy2F9y/test-tmp/rpc-test-8948c74e3e914a49986831ff1ef4d2cf.sock
I20260927 19:41:41.655272 12517 test_util.cc:175] -----------------------------------------------
I20260927 19:41:41.655474 12517 test_util.cc:176] Had fatal failures, leaving test files at /tmp/dist-test-taskNy2F9y/test-tmp/rpc-test.6.Parameters_TestRpc.TestCallWithChainCertAndChainCA_SSL_UnixSocket.1790538100279941-12517-0
[  FAILED  ] Parameters/TestRpc.TestCallWithChainCertAndChainCA/SSL_UnixSocket, where GetParam() = (true, true) (52 ms)
[ RUN      ] Parameters/TestRpc.TestCallWithPasswordProtectedKey/SSL_UnixSocket
I20260927 19:41:41.683892 12580 acceptor_pool.cc:254] collecting diagnostics on the listening RPC socket unix:/tmp/dist-test-taskNy2F9y/test-tmp/rpc-test-8fd2cb49807b42eda85d33eb988b365f.sock every 8 connection(s)
I20260927 19:41:41.684656 12581 acceptor_pool.cc:254] collecting diagnostics on the listening RPC socket unix:/tmp/dist-test-taskNy2F9y/test-tmp/rpc-test-8fd2cb49807b42eda85d33eb988b365f.sock every 8 connection(s)
W20260927 19:41:41.732003 12577 connection.cc:196] Error closing socket: Network error: TlsSocket::Close: Broken pipe
[       OK ] Parameters/TestRpc.TestCallWithPasswordProtectedKey/SSL_UnixSocket (82 ms)
[ RUN      ] Parameters/TestRpc.TestCallToBadServer/SSL_UnixSocket
I20260927 19:41:41.753688 12517 rpc-test.cc:394] Status: Network error: Client connection negotiation failed: client connection to 0.0.0.0:0: connect: Connection refused (error 111)
I20260927 19:41:41.755000 12517 rpc-test.cc:394] Status: Network error: Client connection negotiation failed: client connection to 0.0.0.0:0: connect: Connection refused (error 111)
I20260927 19:41:41.756232 12517 rpc-test.cc:394] Status: Network error: Client connection negotiation failed: client connection to 0.0.0.0:0: connect: Connection refused (error 111)
I20260927 19:41:41.757500 12517 rpc-test.cc:394] Status: Network error: Client connection negotiation failed: client connection to 0.0.0.0:0: connect: Connection refused (error 111)
I20260927 19:41:41.758687 12517 rpc-test.cc:394] Status: Network error: Client connection negotiation failed: client connection to 0.0.0.0:0: connect: Connection refused (error 111)
[       OK ] Parameters/TestRpc.TestCallToBadServer/SSL_UnixSocket (23 ms)
[ RUN      ] Parameters/TestRpc.TestWrongService/SSL_UnixSocket
I20260927 19:41:41.795907 12615 acceptor_pool.cc:254] collecting diagnostics on the listening RPC socket unix:/tmp/dist-test-taskNy2F9y/test-tmp/rpc-test-44a015c6680346289a43c33e8790f1a0.sock every 8 connection(s)
I20260927 19:41:41.796857 12616 acceptor_pool.cc:254] collecting diagnostics on the listening RPC socket unix:/tmp/dist-test-taskNy2F9y/test-tmp/rpc-test-44a015c6680346289a43c33e8790f1a0.sock every 8 connection(s)
I20260927 19:41:41.825600 12612 messenger.cc:345] service WrongServiceName not registered on TestServer
W20260927 19:41:41.828749 12612 connection.cc:196] Error closing socket: Network error: TlsSocket::Close: Broken pipe
[       OK ] Parameters/TestRpc.TestWrongService/SSL_UnixSocket (71 ms)
[ RUN      ] Parameters/TestRpc.TestConnectionKeepalive/SSL_UnixSocket
I20260927 19:41:41.848556 12638 acceptor_pool.cc:254] collecting diagnostics on the listening RPC socket unix:/tmp/dist-test-taskNy2F9y/test-tmp/rpc-test-900b12a282644c24aa8b6d48be02fe16.sock every 8 connection(s)
I20260927 19:41:41.849300 12639 acceptor_pool.cc:254] collecting diagnostics on the listening RPC socket unix:/tmp/dist-test-taskNy2F9y/test-tmp/rpc-test-900b12a282644c24aa8b6d48be02fe16.sock every 8 connection(s)
I20260927 19:41:41.852420 12517 rpc-test.cc:488] Connecting to unix:/tmp/dist-test-taskNy2F9y/test-tmp/rpc-test-900b12a282644c24aa8b6d48be02fe16.sock
W20260927 19:41:42.336938 12651 connection.cc:196] Error closing socket: Network error: TlsSocket::Close: Broken pipe
[       OK ] Parameters/TestRpc.TestConnectionKeepalive/SSL_UnixSocket (1092 ms)
[ RUN      ] Parameters/TestRpc.TestClientConnectionMetrics/SSL_UnixSocket
I20260927 19:41:42.965884 12663 acceptor_pool.cc:254] collecting diagnostics on the listening RPC socket unix:/tmp/dist-test-taskNy2F9y/test-tmp/rpc-test-57a228204a4d4700b6714e76ae497cd3.sock every 8 connection(s)
I20260927 19:41:42.966655 12664 acceptor_pool.cc:254] collecting diagnostics on the listening RPC socket unix:/tmp/dist-test-taskNy2F9y/test-tmp/rpc-test-57a228204a4d4700b6714e76ae497cd3.sock every 8 connection(s)
I20260927 19:41:42.969930 12517 rpc-test.cc:569] Connecting to unix:/tmp/dist-test-taskNy2F9y/test-tmp/rpc-test-57a228204a4d4700b6714e76ae497cd3.sock
W20260927 19:43:57.500262 12660 connection.cc:196] Error closing socket: Network error: TlsSocket::Close: Broken pipe
[       OK ] Parameters/TestRpc.TestClientConnectionMetrics/SSL_UnixSocket (134581 ms)
[ RUN      ] Parameters/TestRpc.TestCredentialsPolicy/SSL_UnixSocket
I20260927 19:43:57.542514 12699 acceptor_pool.cc:254] collecting diagnostics on the listening RPC socket unix:/tmp/dist-test-taskNy2F9y/test-tmp/rpc-test-4805cc556bd14294a39d1f7086f12b42.sock every 8 connection(s)
I20260927 19:43:57.543368 12700 acceptor_pool.cc:254] collecting diagnostics on the listening RPC socket unix:/tmp/dist-test-taskNy2F9y/test-tmp/rpc-test-4805cc556bd14294a39d1f7086f12b42.sock every 8 connection(s)
I20260927 19:43:57.546541 12517 rpc-test.cc:700] Connecting to unix:/tmp/dist-test-taskNy2F9y/test-tmp/rpc-test-4805cc556bd14294a39d1f7086f12b42.sock
W20260927 19:43:57.596352 12698 connection.cc:196] Error closing socket: Network error: TlsSocket::Close: Broken pipe
[       OK ] Parameters/TestRpc.TestCredentialsPolicy/SSL_UnixSocket (117 ms)
[ RUN      ] Parameters/TestRpc.TestCallLongerThanKeepalive/SSL_UnixSocket
I20260927 19:43:57.642922 12724 acceptor_pool.cc:254] collecting diagnostics on the listening RPC socket unix:/tmp/dist-test-taskNy2F9y/test-tmp/rpc-test-3be4519ace794c93b2dd4fa00e8f06e0.sock every 8 connection(s)
I20260927 19:43:57.643633 12725 acceptor_pool.cc:254] collecting diagnostics on the listening RPC socket unix:/tmp/dist-test-taskNy2F9y/test-tmp/rpc-test-3be4519ace794c93b2dd4fa00e8f06e0.sock every 8 connection(s)
I20260927 19:43:57.673646 12728 rpc-test-base.h:222] got call: sleep_micros: 3000000 deferred: true
I20260927 19:44:00.678340 12728 rpcz_store.cc:275] Call kudu.rpc.GenericCalculatorService.Sleep from unix:<unnamed> (request call id 0) took 3004 ms. Trace:
I20260927 19:44:00.678797 12728 rpcz_store.cc:276] 0927 19:43:57.673488 (+     0us) service_pool.cc:170] Inserting onto call queue
0927 19:43:57.673597 (+   109us) service_pool.cc:227] Handling call
0927 19:44:00.678185 (+3004588us) inbound_call.cc:173] Queueing success response
Metrics: {}
W20260927 19:44:00.683678 12721 connection.cc:196] Error closing socket: Network error: TlsSocket::Close: Broken pipe
[       OK ] Parameters/TestRpc.TestCallLongerThanKeepalive/SSL_UnixSocket (3065 ms)
[ RUN      ] Parameters/TestRpc.TestRpcSidecar/SSL_UnixSocket
I20260927 19:44:00.709916 12750 acceptor_pool.cc:254] collecting diagnostics on the listening RPC socket unix:/tmp/dist-test-taskNy2F9y/test-tmp/rpc-test-ff1627b324ee4fa383678e033c7a7463.sock every 8 connection(s)
I20260927 19:44:00.710740 12751 acceptor_pool.cc:254] collecting diagnostics on the listening RPC socket unix:/tmp/dist-test-taskNy2F9y/test-tmp/rpc-test-ff1627b324ee4fa383678e033c7a7463.sock every 8 connection(s)
W20260927 19:44:01.189937 12747 connection.cc:196] Error closing socket: Network error: TlsSocket::Close: Broken pipe
[       OK ] Parameters/TestRpc.TestRpcSidecar/SSL_UnixSocket (502 ms)
[ RUN      ] Parameters/TestRpc.TestRpcSidecarLimits/SSL_UnixSocket
I20260927 19:44:17.793702 12776 acceptor_pool.cc:254] collecting diagnostics on the listening RPC socket unix:/tmp/dist-test-taskNy2F9y/test-tmp/rpc-test-571a7d62fc1d4dc4af6787514cdbc17b.sock every 8 connection(s)
I20260927 19:44:17.794489 12777 acceptor_pool.cc:254] collecting diagnostics on the listening RPC socket unix:/tmp/dist-test-taskNy2F9y/test-tmp/rpc-test-571a7d62fc1d4dc4af6787514cdbc17b.sock every 8 connection(s)
W20260927 19:44:17.815600 12517 serialization.cc:72] Serialized kudu.rpc_test.PushStringsRequestPB (2147483654 bytes) is larger than the maximum configured RPC message size (52428800 bytes). Sending anyway, but peer may reject the data.
W20260927 19:44:17.827014 12773 connection.cc:535] server connection from unix:<unnamed> recv error: Network error: RPC frame had a length of 2147483714, but we only support messages up to 52428800 bytes long.
W20260927 19:44:17.827858 12773 connection.cc:158] shutting down server connection from unix:<unnamed> with pending inbound data: 4/2147483714 bytes received; last active 0 ns ago: status Network error: RPC frame had a length of 2147483714, but we only support messages up to 52428800 bytes long.
W20260927 19:44:17.828792 12789 connection.cc:698] client connection to unix:/tmp/dist-test-taskNy2F9y/test-tmp/rpc-test-571a7d62fc1d4dc4af6787514cdbc17b.sock send error: Network error: failed to write to TLS socket: Broken pipe
W20260927 19:44:17.829387 12789 connection.cc:196] Error closing socket: Network error: TlsSocket::Close: Success
[       OK ] Parameters/TestRpc.TestRpcSidecarLimits/SSL_UnixSocket (17393 ms)
[ RUN      ] Parameters/TestRpc.TestCallTimeoutDoesntAffectNegotiation/SSL_UnixSocket
I20260927 19:44:18.622839 12801 acceptor_pool.cc:254] collecting diagnostics on the listening RPC socket unix:/tmp/dist-test-taskNy2F9y/test-tmp/rpc-test-725a7f3696e847dc80a940df01597d3c.sock every 8 connection(s)
I20260927 19:44:18.623699 12802 acceptor_pool.cc:254] collecting diagnostics on the listening RPC socket unix:/tmp/dist-test-taskNy2F9y/test-tmp/rpc-test-725a7f3696e847dc80a940df01597d3c.sock every 8 connection(s)
W20260927 19:44:18.644131 12797 negotiation.cc:266] Injecting 500ms delay in negotiation
I20260927 19:44:18.694675 12517 rpc-test-base.h:595] status: Timed out: connection negotiation to unix:/tmp/dist-test-taskNy2F9y/test-tmp/rpc-test-725a7f3696e847dc80a940df01597d3c.sock for RPC Sleep timed out after 0.050s (ON_OUTBOUND_QUEUE), seconds elapsed: 0.0514801
W20260927 19:44:19.157359 12798 connection.cc:196] Error closing socket: Network error: TlsSocket::Close: Broken pipe
[       OK ] Parameters/TestRpc.TestCallTimeoutDoesntAffectNegotiation/SSL_UnixSocket (573 ms)
[ RUN      ] Parameters/TestRpc.TestRpcHandlerLatencyMetric/SSL_UnixSocket
I20260927 19:44:19.186048 12826 acceptor_pool.cc:254] collecting diagnostics on the listening RPC socket unix:/tmp/dist-test-taskNy2F9y/test-tmp/rpc-test-f51b01de13464206804da68c9d6dcb7c.sock every 8 connection(s)
I20260927 19:44:19.186722 12827 acceptor_pool.cc:254] collecting diagnostics on the listening RPC socket unix:/tmp/dist-test-taskNy2F9y/test-tmp/rpc-test-f51b01de13464206804da68c9d6dcb7c.sock every 8 connection(s)
I20260927 19:44:19.233637 12517 rpc-test.cc:1236] Sleep() min lat: 21585
I20260927 19:44:19.233831 12517 rpc-test.cc:1237] Sleep() mean lat: 21585
I20260927 19:44:19.233956 12517 rpc-test.cc:1238] Sleep() max lat: 21585
I20260927 19:44:19.234061 12517 rpc-test.cc:1239] Sleep() #calls: 1
[       OK ] Parameters/TestRpc.TestRpcHandlerLatencyMetric/SSL_UnixSocket (79 ms)
[ RUN      ] Parameters/TestRpc.TimedOutOnResponseMetricServiceQueue/SSL_UnixSocket
I20260927 19:44:19.267863 12852 acceptor_pool.cc:254] collecting diagnostics on the listening RPC socket unix:/tmp/dist-test-taskNy2F9y/test-tmp/rpc-test-1cf89278952242d88e3729d9718710e0.sock every 8 connection(s)
I20260927 19:44:19.268652 12853 acceptor_pool.cc:254] collecting diagnostics on the listening RPC socket unix:/tmp/dist-test-taskNy2F9y/test-tmp/rpc-test-1cf89278952242d88e3729d9718710e0.sock every 8 connection(s)
W20260927 19:44:19.349150 12854 rpcz_store.cc:267] Call kudu.rpc_test.CalculatorService.Sleep from unix:<unnamed> (request call id 2) took 20 ms (client timeout 20 ms). Trace:
W20260927 19:44:19.349521 12854 rpcz_store.cc:269] 0927 19:44:19.328675 (+     0us) service_pool.cc:170] Inserting onto call queue
0927 19:44:19.348994 (+ 20319us) service_pool.cc:214] Skipping call since client already timed out
0927 19:44:19.349095 (+   101us) inbound_call.cc:173] Queueing failure response
Metrics: {}
W20260927 19:44:19.352052 12849 connection.cc:196] Error closing socket: Network error: TlsSocket::Close: Broken pipe
[       OK ] Parameters/TestRpc.TimedOutOnResponseMetricServiceQueue/SSL_UnixSocket (114 ms)
[ RUN      ] Parameters/TestRpc.RpcPendingConnectionsMetric/SSL_UnixSocket
I20260927 19:44:19.365940 12875 acceptor_pool.cc:254] collecting diagnostics on the listening RPC socket 0.0.0.0:45829 every 8 connection(s)
I20260927 19:44:19.366652 12876 acceptor_pool.cc:254] collecting diagnostics on the listening RPC socket 0.0.0.0:45829 every 8 connection(s)
W20260927 19:44:19.371526 12871 negotiation.cc:337] Failed RPC negotiation. Trace:
0927 19:44:19.370396 (+     0us) reactor.cc:625] Submitting negotiation task for server connection from 127.0.0.1:39286 (local address 127.0.0.1:45829)
0927 19:44:19.370773 (+   377us) server_negotiation.cc:206] Beginning negotiation
0927 19:44:19.370790 (+    17us) server_negotiation.cc:399] Waiting for connection header
0927 19:44:19.371014 (+   224us) negotiation.cc:327] Negotiation complete: Network error: Server connection negotiation failed: server connection from 127.0.0.1:39286: BlockingRecv error: recv got EOF from 127.0.0.1:39286 (error 108)
Metrics: {"server-negotiator.queue_time_us":85}
[       OK ] Parameters/TestRpc.RpcPendingConnectionsMetric/SSL_UnixSocket (28 ms)
[ RUN      ] Parameters/TestRpc.TestRpcContextClientDeadline/SSL_UnixSocket
I20260927 19:44:19.403288 12891 acceptor_pool.cc:254] collecting diagnostics on the listening RPC socket unix:/tmp/dist-test-taskNy2F9y/test-tmp/rpc-test-8bdceb9c8b1d40af9bda76e7b2b3bd6d.sock every 8 connection(s)
I20260927 19:44:19.404052 12892 acceptor_pool.cc:254] collecting diagnostics on the listening RPC socket unix:/tmp/dist-test-taskNy2F9y/test-tmp/rpc-test-8bdceb9c8b1d40af9bda76e7b2b3bd6d.sock every 8 connection(s)
W20260927 19:44:19.460284 12888 connection.cc:196] Error closing socket: Network error: TlsSocket::Close: Broken pipe
[       OK ] Parameters/TestRpc.TestRpcContextClientDeadline/SSL_UnixSocket (79 ms)
[ RUN      ] Parameters/TestRpc.TestApplicationFeatureFlagUnsupportedServer/SSL_UnixSocket
I20260927 19:44:19.482362 12916 acceptor_pool.cc:254] collecting diagnostics on the listening RPC socket unix:/tmp/dist-test-taskNy2F9y/test-tmp/rpc-test-55ad21b717f04433a0ef79b0a6a506f2.sock every 8 connection(s)
I20260927 19:44:19.483103 12917 acceptor_pool.cc:254] collecting diagnostics on the listening RPC socket unix:/tmp/dist-test-taskNy2F9y/test-tmp/rpc-test-55ad21b717f04433a0ef79b0a6a506f2.sock every 8 connection(s)
[       OK ] Parameters/TestRpc.TestApplicationFeatureFlagUnsupportedServer/SSL_UnixSocket (82 ms)
[ RUN      ] Parameters/TestRpc.TestCancellationAsync/SSL_UnixSocket
I20260927 19:44:19.582952 12941 acceptor_pool.cc:254] collecting diagnostics on the listening RPC socket unix:/tmp/dist-test-taskNy2F9y/test-tmp/rpc-test-accd026b8872440c97c6d2160cfaa957.sock every 8 connection(s)
I20260927 19:44:19.583700 12942 acceptor_pool.cc:254] collecting diagnostics on the listening RPC socket unix:/tmp/dist-test-taskNy2F9y/test-tmp/rpc-test-accd026b8872440c97c6d2160cfaa957.sock every 8 connection(s)
I20260927 19:44:19.586689 12517 rpc-test.cc:1716] Connecting to unix:/tmp/dist-test-taskNy2F9y/test-tmp/rpc-test-accd026b8872440c97c6d2160cfaa957.sock
I20260927 19:44:19.598781 12517 test_util.cc:268] Using random seed: 753634731
I20260927 19:44:19.817974 12945 rpc-test-base.h:240] got call: sleep_micros: 500 pattern: 4294967295 num_repetitions: 2097152 sidecar_idx: 0
I20260927 19:44:20.008875 12944 rpc-test-base.h:240] got call: sleep_micros: 500 pattern: 4294967295 num_repetitions: 2097152 sidecar_idx: 0
I20260927 19:44:20.237740 12944 rpc-test-base.h:240] got call: sleep_micros: 500 pattern: 4294967295 num_repetitions: 2097152 sidecar_idx: 0
I20260927 19:44:20.439420 12945 rpc-test-base.h:240] got call: sleep_micros: 500 pattern: 4294967295 num_repetitions: 2097152 sidecar_idx: 0
I20260927 19:44:20.646313 12945 rpc-test-base.h:240] got call: sleep_micros: 500 pattern: 4294967295 num_repetitions: 2097152 sidecar_idx: 0
I20260927 19:44:20.880771 12945 rpc-test-base.h:240] got call: sleep_micros: 500 pattern: 4294967295 num_repetitions: 2097152 sidecar_idx: 0
W20260927 19:44:20.972509 12954 outbound_call.cc:322] RPC callback for RPC call kudu.rpc.GenericCalculatorService.SleepWithSidecar -> {remote=unix:/tmp/dist-test-taskNy2F9y/test-tmp/rpc-test-accd026b8872440c97c6d2160cfaa957.sock, user_credentials={real_user=slave}} blocked reactor thread for 103644us
I20260927 19:44:21.193439 12945 rpc-test-base.h:240] got call: sleep_micros: 500 pattern: 4294967295 num_repetitions: 2097152 sidecar_idx: 0
I20260927 19:44:21.395826 12944 rpc-test-base.h:240] got call: sleep_micros: 500 pattern: 4294967295 num_repetitions: 2097152 sidecar_idx: 0
I20260927 19:44:21.599155 12945 rpc-test-base.h:240] got call: sleep_micros: 500 pattern: 4294967295 num_repetitions: 2097152 sidecar_idx: 0
W20260927 19:44:21.624092 12938 connection.cc:196] Error closing socket: Network error: TlsSocket::Close: Broken pipe
W20260927 19:44:21.635888 12938 connection.cc:441] server connection from unix:<unnamed> torn down before Call kudu.rpc.GenericCalculatorService.SleepWithSidecar from unix:<unnamed> (request call id 8) could send its response
W20260927 19:44:21.736618 12938 connection.cc:441] server connection from unix:<unnamed> torn down before Call kudu.rpc.GenericCalculatorService.SleepWithSidecar from unix:<unnamed> (request call id 9) could send its response
[       OK ] Parameters/TestRpc.TestCancellationAsync/SSL_UnixSocket (2200 ms)
[ RUN      ] Parameters/TestRpc.TestPerformanceBySocketType/SSL_UnixSocket
I20260927 19:44:21.852336 12967 acceptor_pool.cc:254] collecting diagnostics on the listening RPC socket unix:/tmp/dist-test-taskNy2F9y/test-tmp/rpc-test-2d05ad7012804d57a870c512bbe90859.sock every 8 connection(s)
I20260927 19:44:21.853212 12968 acceptor_pool.cc:254] collecting diagnostics on the listening RPC socket unix:/tmp/dist-test-taskNy2F9y/test-tmp/rpc-test-2d05ad7012804d57a870c512bbe90859.sock every 8 connection(s)
I20260927 19:44:21.856303 12517 rpc-test.cc:1846] Connecting to unix:/tmp/dist-test-taskNy2F9y/test-tmp/rpc-test-2d05ad7012804d57a870c512bbe90859.sock
I20260927 19:44:43.190831 12517 rpc-test.cc:1859] Sending 1024MB via ssl-enabled unix socket: real 21.315s	user 18.934s	sys 12.923s
I20260927 19:45:04.073490 12517 rpc-test.cc:1859] Sending 1024MB via ssl-enabled unix socket: real 20.882s	user 18.239s	sys 12.700s
I20260927 19:45:25.205338 12517 rpc-test.cc:1859] Sending 1024MB via ssl-enabled unix socket: real 21.131s	user 18.462s	sys 12.974s
I20260927 19:45:46.057233 12517 rpc-test.cc:1859] Sending 1024MB via ssl-enabled unix socket: real 20.851s	user 18.148s	sys 12.708s
I20260927 19:46:07.109957 12517 rpc-test.cc:1859] Sending 1024MB via ssl-enabled unix socket: real 21.052s	user 18.554s	sys 12.800s
W20260927 19:46:07.114154 12964 connection.cc:196] Error closing socket: Network error: TlsSocket::Close: Broken pipe
[       OK ] Parameters/TestRpc.TestPerformanceBySocketType/SSL_UnixSocket (105379 ms)
[----------] 20 tests from Parameters/TestRpc (266796 ms total)

[----------] 1 test from Parameters/TestRpcSocketTxRxQueue
[ RUN      ] Parameters/TestRpcSocketTxRxQueue.AcceptorRxQueueSizeMetric/0
I20260927 19:46:07.138499 13002 acceptor_pool.cc:254] collecting diagnostics on the listening RPC socket 0.0.0.0:39189 every 1 connection(s)
I20260927 19:46:07.139430 13003 acceptor_pool.cc:254] collecting diagnostics on the listening RPC socket 0.0.0.0:39189 every 1 connection(s)
W20260927 19:46:07.145044 12998 negotiation.cc:337] Failed RPC negotiation. Trace:
0927 19:46:07.143461 (+     0us) reactor.cc:625] Submitting negotiation task for server connection from 127.0.0.1:32830 (local address 127.0.0.1:39189)
0927 19:46:07.143947 (+   486us) server_negotiation.cc:206] Beginning negotiation
0927 19:46:07.143971 (+    24us) server_negotiation.cc:399] Waiting for connection header
0927 19:46:07.144209 (+   238us) negotiation.cc:327] Negotiation complete: Network error: Server connection negotiation failed: server connection from 127.0.0.1:32830: BlockingRecv error: recv got EOF from 127.0.0.1:32830 (error 108)
Metrics: {"server-negotiator.queue_time_us":135}
[       OK ] Parameters/TestRpcSocketTxRxQueue.AcceptorRxQueueSizeMetric/0 (25 ms)
[----------] 1 test from Parameters/TestRpcSocketTxRxQueue (25 ms total)

[----------] Global test environment tear-down
[==========] 21 tests from 2 test suites ran. (266822 ms total)
[  PASSED  ] 20 tests.
[  FAILED  ] 1 test, listed below:
[  FAILED  ] Parameters/TestRpc.TestCallWithChainCertAndChainCA/SSL_UnixSocket, where GetParam() = (true, true)

 1 FAILED TEST