Diagnosed failure

Parameters/TestRpc.TestCallWithChainCertAndChainCA/SSL_UnixSocket: /data0/somelongdirectorytoavoidrpathissues/src/kudu/src/kudu/rpc/rpc-test.cc:270: Failure
Failed
Bad status: Runtime error: could not verify certificate chain (error with cert: subject=CN = localhost, ST = sadfjas, C = AS, emailAddress = sdflkdsajf, O = lskdfjlsad, OU = sldfkja, issuer=C = AS, ST = ASDfkjdhf, L = lskdjf, O = saldfja, OU = skdjf, CN = localhost, emailAddress = sadjflkadsj): : certificate has expired
Google Test trace:
/data0/somelongdirectorytoavoidrpathissues/src/kudu/src/kudu/rpc/rpc-test.cc:267: Connecting to unix:/tmp/dist-test-tasklSkU3G/test-tmp/rpc-test-42e9b4e99aa34e4cbfff6bb57da4e73d.sock
I20260927 18:34:06.117903 17301 test_util.cc:175] -----------------------------------------------
I20260927 18:34:06.117955 17301 test_util.cc:176] Had fatal failures, leaving test files at /tmp/dist-test-tasklSkU3G/test-tmp/rpc-test.6.Parameters_TestRpc.TestCallWithChainCertAndChainCA_SSL_UnixSocket.1790534046033476-17301-0

Full log

Note: This is test shard 7 of 8.
[==========] Running 21 tests from 2 test suites.
[----------] Global test environment set-up.
[----------] 20 tests from Parameters/TestRpc
[ RUN      ] Parameters/TestRpc.TestMessengerCreateDestroy/SSL_UnixSocket
WARNING: Logging before InitGoogleLogging() is written to STDERR
I20260927 18:34:06.064239 17301 rpc-test.cc:169] started messenger TestCreateDestroy
[       OK ] Parameters/TestRpc.TestMessengerCreateDestroy/SSL_UnixSocket (29 ms)
[ RUN      ] Parameters/TestRpc.TestNegotiationDeadlock/SSL_UnixSocket
I20260927 18:34:06.077579 17321 acceptor_pool.cc:254] collecting diagnostics on the listening RPC socket unix:/tmp/dist-test-tasklSkU3G/test-tmp/rpc-test-4837c03c36f348ddaf4c10915b4480c6.sock every 8 connection(s)
I20260927 18:34:06.080411 17322 acceptor_pool.cc:254] collecting diagnostics on the listening RPC socket unix:/tmp/dist-test-tasklSkU3G/test-tmp/rpc-test-4837c03c36f348ddaf4c10915b4480c6.sock every 8 connection(s)
[       OK ] Parameters/TestRpc.TestNegotiationDeadlock/SSL_UnixSocket (19 ms)
[ RUN      ] Parameters/TestRpc.TestCallWithChainCertAndChainCA/SSL_UnixSocket
I20260927 18:34:06.113327 17337 acceptor_pool.cc:254] collecting diagnostics on the listening RPC socket unix:/tmp/dist-test-tasklSkU3G/test-tmp/rpc-test-42e9b4e99aa34e4cbfff6bb57da4e73d.sock every 8 connection(s)
I20260927 18:34:06.113327 17338 acceptor_pool.cc:254] collecting diagnostics on the listening RPC socket unix:/tmp/dist-test-tasklSkU3G/test-tmp/rpc-test-42e9b4e99aa34e4cbfff6bb57da4e73d.sock every 8 connection(s)
/data0/somelongdirectorytoavoidrpathissues/src/kudu/src/kudu/rpc/rpc-test.cc:270: Failure
Failed
Bad status: Runtime error: could not verify certificate chain (error with cert: subject=CN = localhost, ST = sadfjas, C = AS, emailAddress = sdflkdsajf, O = lskdfjlsad, OU = sldfkja, issuer=C = AS, ST = ASDfkjdhf, L = lskdjf, O = saldfja, OU = skdjf, CN = localhost, emailAddress = sadjflkadsj): : certificate has expired
Google Test trace:
/data0/somelongdirectorytoavoidrpathissues/src/kudu/src/kudu/rpc/rpc-test.cc:267: Connecting to unix:/tmp/dist-test-tasklSkU3G/test-tmp/rpc-test-42e9b4e99aa34e4cbfff6bb57da4e73d.sock
I20260927 18:34:06.117903 17301 test_util.cc:175] -----------------------------------------------
I20260927 18:34:06.117955 17301 test_util.cc:176] Had fatal failures, leaving test files at /tmp/dist-test-tasklSkU3G/test-tmp/rpc-test.6.Parameters_TestRpc.TestCallWithChainCertAndChainCA_SSL_UnixSocket.1790534046033476-17301-0
[  FAILED  ] Parameters/TestRpc.TestCallWithChainCertAndChainCA/SSL_UnixSocket, where GetParam() = (true, true) (33 ms)
[ RUN      ] Parameters/TestRpc.TestCallWithPasswordProtectedKey/SSL_UnixSocket
I20260927 18:34:06.128630 17362 acceptor_pool.cc:254] collecting diagnostics on the listening RPC socket unix:/tmp/dist-test-tasklSkU3G/test-tmp/rpc-test-8192c487d4d1408b8c02dd02a3e3b626.sock every 8 connection(s)
I20260927 18:34:06.128677 17363 acceptor_pool.cc:254] collecting diagnostics on the listening RPC socket unix:/tmp/dist-test-tasklSkU3G/test-tmp/rpc-test-8192c487d4d1408b8c02dd02a3e3b626.sock every 8 connection(s)
W20260927 18:34:06.139060 17359 connection.cc:196] Error closing socket: Network error: TlsSocket::Close: Broken pipe
[       OK ] Parameters/TestRpc.TestCallWithPasswordProtectedKey/SSL_UnixSocket (22 ms)
[ RUN      ] Parameters/TestRpc.TestCallToBadServer/SSL_UnixSocket
I20260927 18:34:06.147032 17301 rpc-test.cc:394] Status: Network error: Client connection negotiation failed: client connection to 0.0.0.0:0: connect: Connection refused (error 111)
I20260927 18:34:06.147374 17301 rpc-test.cc:394] Status: Network error: Client connection negotiation failed: client connection to 0.0.0.0:0: connect: Connection refused (error 111)
I20260927 18:34:06.147580 17301 rpc-test.cc:394] Status: Network error: Client connection negotiation failed: client connection to 0.0.0.0:0: connect: Connection refused (error 111)
I20260927 18:34:06.147759 17301 rpc-test.cc:394] Status: Network error: Client connection negotiation failed: client connection to 0.0.0.0:0: connect: Connection refused (error 111)
I20260927 18:34:06.147923 17301 rpc-test.cc:394] Status: Network error: Client connection negotiation failed: client connection to 0.0.0.0:0: connect: Connection refused (error 111)
[       OK ] Parameters/TestRpc.TestCallToBadServer/SSL_UnixSocket (8 ms)
[ RUN      ] Parameters/TestRpc.TestWrongService/SSL_UnixSocket
I20260927 18:34:06.173666 17397 acceptor_pool.cc:254] collecting diagnostics on the listening RPC socket unix:/tmp/dist-test-tasklSkU3G/test-tmp/rpc-test-569b1a15ee1345e8a73f735f799265f9.sock every 8 connection(s)
I20260927 18:34:06.173696 17398 acceptor_pool.cc:254] collecting diagnostics on the listening RPC socket unix:/tmp/dist-test-tasklSkU3G/test-tmp/rpc-test-569b1a15ee1345e8a73f735f799265f9.sock every 8 connection(s)
I20260927 18:34:06.189847 17394 messenger.cc:345] service WrongServiceName not registered on TestServer
[       OK ] Parameters/TestRpc.TestWrongService/SSL_UnixSocket (42 ms)
[ RUN      ] Parameters/TestRpc.TestConnectionKeepalive/SSL_UnixSocket
I20260927 18:34:06.217521 17420 acceptor_pool.cc:254] collecting diagnostics on the listening RPC socket unix:/tmp/dist-test-tasklSkU3G/test-tmp/rpc-test-97c555f99e274de68e18f3c7841bbc4f.sock every 8 connection(s)
I20260927 18:34:06.217540 17421 acceptor_pool.cc:254] collecting diagnostics on the listening RPC socket unix:/tmp/dist-test-tasklSkU3G/test-tmp/rpc-test-97c555f99e274de68e18f3c7841bbc4f.sock every 8 connection(s)
I20260927 18:34:06.217679 17301 rpc-test.cc:488] Connecting to unix:/tmp/dist-test-tasklSkU3G/test-tmp/rpc-test-97c555f99e274de68e18f3c7841bbc4f.sock
W20260927 18:34:06.692782 17433 connection.cc:196] Error closing socket: Network error: TlsSocket::Close: Broken pipe
[       OK ] Parameters/TestRpc.TestConnectionKeepalive/SSL_UnixSocket (1050 ms)
[ RUN      ] Parameters/TestRpc.TestClientConnectionMetrics/SSL_UnixSocket
I20260927 18:34:07.264111 17445 acceptor_pool.cc:254] collecting diagnostics on the listening RPC socket unix:/tmp/dist-test-tasklSkU3G/test-tmp/rpc-test-9eaf5380faea49c8908d7b77fe5acf79.sock every 8 connection(s)
I20260927 18:34:07.264173 17446 acceptor_pool.cc:254] collecting diagnostics on the listening RPC socket unix:/tmp/dist-test-tasklSkU3G/test-tmp/rpc-test-9eaf5380faea49c8908d7b77fe5acf79.sock every 8 connection(s)
I20260927 18:34:07.264271 17301 rpc-test.cc:569] Connecting to unix:/tmp/dist-test-tasklSkU3G/test-tmp/rpc-test-9eaf5380faea49c8908d7b77fe5acf79.sock
W20260927 18:34:15.501528 17442 connection.cc:196] Error closing socket: Network error: TlsSocket::Close: Broken pipe
[       OK ] Parameters/TestRpc.TestClientConnectionMetrics/SSL_UnixSocket (8260 ms)
[ RUN      ] Parameters/TestRpc.TestCredentialsPolicy/SSL_UnixSocket
I20260927 18:34:15.519320 17468 acceptor_pool.cc:254] collecting diagnostics on the listening RPC socket unix:/tmp/dist-test-tasklSkU3G/test-tmp/rpc-test-2309e1bc16204431a1c4400ac35d6909.sock every 8 connection(s)
I20260927 18:34:15.519368 17469 acceptor_pool.cc:254] collecting diagnostics on the listening RPC socket unix:/tmp/dist-test-tasklSkU3G/test-tmp/rpc-test-2309e1bc16204431a1c4400ac35d6909.sock every 8 connection(s)
I20260927 18:34:15.519510 17301 rpc-test.cc:700] Connecting to unix:/tmp/dist-test-tasklSkU3G/test-tmp/rpc-test-2309e1bc16204431a1c4400ac35d6909.sock
W20260927 18:34:15.536841 17467 connection.cc:196] Error closing socket: Network error: TlsSocket::Close: Broken pipe
W20260927 18:34:15.540138 17467 connection.cc:196] Error closing socket: Network error: TlsSocket::Close: Broken pipe
[       OK ] Parameters/TestRpc.TestCredentialsPolicy/SSL_UnixSocket (38 ms)
[ RUN      ] Parameters/TestRpc.TestCallLongerThanKeepalive/SSL_UnixSocket
I20260927 18:34:15.552961 17493 acceptor_pool.cc:254] collecting diagnostics on the listening RPC socket unix:/tmp/dist-test-tasklSkU3G/test-tmp/rpc-test-dc167fe066b3478d88beb509f38b64a7.sock every 8 connection(s)
I20260927 18:34:15.552999 17494 acceptor_pool.cc:254] collecting diagnostics on the listening RPC socket unix:/tmp/dist-test-tasklSkU3G/test-tmp/rpc-test-dc167fe066b3478d88beb509f38b64a7.sock every 8 connection(s)
I20260927 18:34:15.568900 17495 rpc-test-base.h:222] got call: sleep_micros: 3000000 deferred: true
I20260927 18:34:18.569609 17495 rpcz_store.cc:275] Call kudu.rpc.GenericCalculatorService.Sleep from unix:<unnamed> (request call id 0) took 3000 ms. Trace:
I20260927 18:34:18.569727 17495 rpcz_store.cc:276] 0927 18:34:15.568853 (+     0us) service_pool.cc:170] Inserting onto call queue
0927 18:34:15.568884 (+    31us) service_pool.cc:227] Handling call
0927 18:34:18.569590 (+3000706us) inbound_call.cc:173] Queueing success response
Metrics: {}
[       OK ] Parameters/TestRpc.TestCallLongerThanKeepalive/SSL_UnixSocket (3030 ms)
[ RUN      ] Parameters/TestRpc.TestRpcSidecar/SSL_UnixSocket
I20260927 18:34:18.592567 17518 acceptor_pool.cc:254] collecting diagnostics on the listening RPC socket unix:/tmp/dist-test-tasklSkU3G/test-tmp/rpc-test-1344b3e47cbf47ccb1fa4e85820e4780.sock every 8 connection(s)
I20260927 18:34:18.592589 17519 acceptor_pool.cc:254] collecting diagnostics on the listening RPC socket unix:/tmp/dist-test-tasklSkU3G/test-tmp/rpc-test-1344b3e47cbf47ccb1fa4e85820e4780.sock every 8 connection(s)
W20260927 18:34:18.648679 17515 connection.cc:196] Error closing socket: Network error: TlsSocket::Close: Broken pipe
[       OK ] Parameters/TestRpc.TestRpcSidecar/SSL_UnixSocket (77 ms)
[ RUN      ] Parameters/TestRpc.TestRpcSidecarLimits/SSL_UnixSocket
I20260927 18:34:20.167652 17543 acceptor_pool.cc:254] collecting diagnostics on the listening RPC socket unix:/tmp/dist-test-tasklSkU3G/test-tmp/rpc-test-d366ae91bef9432f975fee142e4f3235.sock every 8 connection(s)
I20260927 18:34:20.167675 17544 acceptor_pool.cc:254] collecting diagnostics on the listening RPC socket unix:/tmp/dist-test-tasklSkU3G/test-tmp/rpc-test-d366ae91bef9432f975fee142e4f3235.sock every 8 connection(s)
W20260927 18:34:20.178818 17301 serialization.cc:72] Serialized kudu.rpc_test.PushStringsRequestPB (2147483654 bytes) is larger than the maximum configured RPC message size (52428800 bytes). Sending anyway, but peer may reject the data.
W20260927 18:34:20.181833 17540 connection.cc:535] server connection from unix:<unnamed> recv error: Network error: RPC frame had a length of 2147483714, but we only support messages up to 52428800 bytes long.
W20260927 18:34:20.181886 17540 connection.cc:158] shutting down server connection from unix:<unnamed> with pending inbound data: 4/2147483714 bytes received; last active 0 ns ago: status Network error: RPC frame had a length of 2147483714, but we only support messages up to 52428800 bytes long.
W20260927 18:34:20.181998 17556 connection.cc:698] client connection to unix:/tmp/dist-test-tasklSkU3G/test-tmp/rpc-test-d366ae91bef9432f975fee142e4f3235.sock send error: Network error: failed to write to TLS socket: Broken pipe
W20260927 18:34:20.182103 17556 connection.cc:196] Error closing socket: Network error: TlsSocket::Close: Success
I20260927 18:34:20.197734 17568 acceptor_pool.cc:254] collecting diagnostics on the listening RPC socket unix:/tmp/dist-test-tasklSkU3G/test-tmp/rpc-test-d366ae91bef9432f975fee142e4f3235.sock every 8 connection(s)
I20260927 18:34:20.197829 17569 acceptor_pool.cc:254] collecting diagnostics on the listening RPC socket unix:/tmp/dist-test-tasklSkU3G/test-tmp/rpc-test-d366ae91bef9432f975fee142e4f3235.sock every 8 connection(s)
W20260927 18:34:24.242902 17565 connection.cc:577] server connection from unix:<unnamed>: received bad data: 'Corruption: Invalid packet: message had a length of 2147483710, but we only support messages up to 2147483647 bytes
'
W20260927 18:34:24.243180 17581 connection.cc:196] Error closing socket: Network error: TlsSocket::Close: Broken pipe
[       OK ] Parameters/TestRpc.TestRpcSidecarLimits/SSL_UnixSocket (5595 ms)
[ RUN      ] Parameters/TestRpc.TestCallTimeoutDoesntAffectNegotiation/SSL_UnixSocket
I20260927 18:34:24.267241 17593 acceptor_pool.cc:254] collecting diagnostics on the listening RPC socket unix:/tmp/dist-test-tasklSkU3G/test-tmp/rpc-test-7c94bff1d68b480190a97554e16a71dc.sock every 8 connection(s)
I20260927 18:34:24.267261 17594 acceptor_pool.cc:254] collecting diagnostics on the listening RPC socket unix:/tmp/dist-test-tasklSkU3G/test-tmp/rpc-test-7c94bff1d68b480190a97554e16a71dc.sock every 8 connection(s)
W20260927 18:34:24.275991 17589 negotiation.cc:266] Injecting 500ms delay in negotiation
I20260927 18:34:24.326321 17301 rpc-test-base.h:595] status: Timed out: connection negotiation to unix:/tmp/dist-test-tasklSkU3G/test-tmp/rpc-test-7c94bff1d68b480190a97554e16a71dc.sock for RPC Sleep timed out after 0.050s (ON_OUTBOUND_QUEUE), seconds elapsed: 0.0506094
[       OK ] Parameters/TestRpc.TestCallTimeoutDoesntAffectNegotiation/SSL_UnixSocket (535 ms)
[ RUN      ] Parameters/TestRpc.TestRpcHandlerLatencyMetric/SSL_UnixSocket
I20260927 18:34:24.790254 17618 acceptor_pool.cc:254] collecting diagnostics on the listening RPC socket unix:/tmp/dist-test-tasklSkU3G/test-tmp/rpc-test-1915c9012ab143daa4599bf5adf7764a.sock every 8 connection(s)
I20260927 18:34:24.790302 17619 acceptor_pool.cc:254] collecting diagnostics on the listening RPC socket unix:/tmp/dist-test-tasklSkU3G/test-tmp/rpc-test-1915c9012ab143daa4599bf5adf7764a.sock every 8 connection(s)
I20260927 18:34:24.839462 17301 rpc-test.cc:1236] Sleep() min lat: 20291
I20260927 18:34:24.839531 17301 rpc-test.cc:1237] Sleep() mean lat: 20291
I20260927 18:34:24.839556 17301 rpc-test.cc:1238] Sleep() max lat: 20291
I20260927 18:34:24.839568 17301 rpc-test.cc:1239] Sleep() #calls: 1
W20260927 18:34:24.840137 17615 connection.cc:196] Error closing socket: Network error: TlsSocket::Close: Broken pipe
[       OK ] Parameters/TestRpc.TestRpcHandlerLatencyMetric/SSL_UnixSocket (60 ms)
[ RUN      ] Parameters/TestRpc.TimedOutOnResponseMetricServiceQueue/SSL_UnixSocket
I20260927 18:34:24.851989 17644 acceptor_pool.cc:254] collecting diagnostics on the listening RPC socket unix:/tmp/dist-test-tasklSkU3G/test-tmp/rpc-test-d3c390aa49544ca49996cec1e27c49e7.sock every 8 connection(s)
I20260927 18:34:24.852015 17645 acceptor_pool.cc:254] collecting diagnostics on the listening RPC socket unix:/tmp/dist-test-tasklSkU3G/test-tmp/rpc-test-d3c390aa49544ca49996cec1e27c49e7.sock every 8 connection(s)
W20260927 18:34:24.903990 17646 rpcz_store.cc:267] Call kudu.rpc_test.CalculatorService.Sleep from unix:<unnamed> (request call id 2) took 20 ms (client timeout 20 ms). Trace:
W20260927 18:34:24.904095 17646 rpcz_store.cc:269] 0927 18:34:24.883702 (+     0us) service_pool.cc:170] Inserting onto call queue
0927 18:34:24.903960 (+ 20258us) service_pool.cc:214] Skipping call since client already timed out
0927 18:34:24.903973 (+    13us) inbound_call.cc:173] Queueing failure response
Metrics: {}
W20260927 18:34:24.904707 17641 connection.cc:196] Error closing socket: Network error: TlsSocket::Close: Broken pipe
[       OK ] Parameters/TestRpc.TimedOutOnResponseMetricServiceQueue/SSL_UnixSocket (64 ms)
[ RUN      ] Parameters/TestRpc.RpcPendingConnectionsMetric/SSL_UnixSocket
I20260927 18:34:24.907054 17667 acceptor_pool.cc:254] collecting diagnostics on the listening RPC socket 0.0.0.0:39449 every 8 connection(s)
I20260927 18:34:24.907079 17668 acceptor_pool.cc:254] collecting diagnostics on the listening RPC socket 0.0.0.0:39449 every 8 connection(s)
W20260927 18:34:24.907594 17663 negotiation.cc:337] Failed RPC negotiation. Trace:
0927 18:34:24.907425 (+     0us) reactor.cc:625] Submitting negotiation task for server connection from 127.0.0.1:44882 (local address 127.0.0.1:39449)
0927 18:34:24.907466 (+    41us) server_negotiation.cc:206] Beginning negotiation
0927 18:34:24.907468 (+     2us) server_negotiation.cc:399] Waiting for connection header
0927 18:34:24.907544 (+    76us) negotiation.cc:327] Negotiation complete: Network error: Server connection negotiation failed: server connection from 127.0.0.1:44882: BlockingRecv error: recv got EOF from 127.0.0.1:44882 (error 108)
Metrics: {"server-negotiator.queue_time_us":13}
[       OK ] Parameters/TestRpc.RpcPendingConnectionsMetric/SSL_UnixSocket (12 ms)
[ RUN      ] Parameters/TestRpc.TestRpcContextClientDeadline/SSL_UnixSocket
I20260927 18:34:24.928269 17683 acceptor_pool.cc:254] collecting diagnostics on the listening RPC socket unix:/tmp/dist-test-tasklSkU3G/test-tmp/rpc-test-91495cf61a6b4d33a68ac5c683ead395.sock every 8 connection(s)
I20260927 18:34:24.928323 17684 acceptor_pool.cc:254] collecting diagnostics on the listening RPC socket unix:/tmp/dist-test-tasklSkU3G/test-tmp/rpc-test-91495cf61a6b4d33a68ac5c683ead395.sock every 8 connection(s)
[       OK ] Parameters/TestRpc.TestRpcContextClientDeadline/SSL_UnixSocket (46 ms)
[ RUN      ] Parameters/TestRpc.TestApplicationFeatureFlagUnsupportedServer/SSL_UnixSocket
I20260927 18:34:24.978374 17709 acceptor_pool.cc:254] collecting diagnostics on the listening RPC socket unix:/tmp/dist-test-tasklSkU3G/test-tmp/rpc-test-d26f7cd663f3478a880c8d3b96297155.sock every 8 connection(s)
I20260927 18:34:24.978332 17708 acceptor_pool.cc:254] collecting diagnostics on the listening RPC socket unix:/tmp/dist-test-tasklSkU3G/test-tmp/rpc-test-d26f7cd663f3478a880c8d3b96297155.sock every 8 connection(s)
[       OK ] Parameters/TestRpc.TestApplicationFeatureFlagUnsupportedServer/SSL_UnixSocket (29 ms)
[ RUN      ] Parameters/TestRpc.TestCancellationAsync/SSL_UnixSocket
I20260927 18:34:25.012485 17733 acceptor_pool.cc:254] collecting diagnostics on the listening RPC socket unix:/tmp/dist-test-tasklSkU3G/test-tmp/rpc-test-736ad4551bdc4706a7d941cf774a3182.sock every 8 connection(s)
I20260927 18:34:25.012540 17734 acceptor_pool.cc:254] collecting diagnostics on the listening RPC socket unix:/tmp/dist-test-tasklSkU3G/test-tmp/rpc-test-736ad4551bdc4706a7d941cf774a3182.sock every 8 connection(s)
I20260927 18:34:25.012676 17301 rpc-test.cc:1716] Connecting to unix:/tmp/dist-test-tasklSkU3G/test-tmp/rpc-test-736ad4551bdc4706a7d941cf774a3182.sock
I20260927 18:34:25.031653 17301 test_util.cc:268] Using random seed: 854034914
I20260927 18:34:25.047888 17737 rpc-test-base.h:240] got call: sleep_micros: 500 pattern: 4294967295 num_repetitions: 2097152 sidecar_idx: 0
I20260927 18:34:25.060041 17737 rpc-test-base.h:240] got call: sleep_micros: 500 pattern: 4294967295 num_repetitions: 2097152 sidecar_idx: 0
I20260927 18:34:25.072434 17737 rpc-test-base.h:240] got call: sleep_micros: 500 pattern: 4294967295 num_repetitions: 2097152 sidecar_idx: 0
I20260927 18:34:25.084795 17737 rpc-test-base.h:240] got call: sleep_micros: 500 pattern: 4294967295 num_repetitions: 2097152 sidecar_idx: 0
I20260927 18:34:25.097287 17737 rpc-test-base.h:240] got call: sleep_micros: 500 pattern: 4294967295 num_repetitions: 2097152 sidecar_idx: 0
I20260927 18:34:25.109516 17737 rpc-test-base.h:240] got call: sleep_micros: 500 pattern: 4294967295 num_repetitions: 2097152 sidecar_idx: 0
I20260927 18:34:25.121937 17737 rpc-test-base.h:240] got call: sleep_micros: 500 pattern: 4294967295 num_repetitions: 2097152 sidecar_idx: 0
I20260927 18:34:25.134094 17737 rpc-test-base.h:240] got call: sleep_micros: 500 pattern: 4294967295 num_repetitions: 2097152 sidecar_idx: 0
W20260927 18:34:25.135742 17730 connection.cc:196] Error closing socket: Network error: TlsSocket::Close: Broken pipe
W20260927 18:34:25.137151 17730 connection.cc:441] server connection from unix:<unnamed> torn down before Call kudu.rpc.GenericCalculatorService.SleepWithSidecar from unix:<unnamed> (request call id 9) could send its response
[       OK ] Parameters/TestRpc.TestCancellationAsync/SSL_UnixSocket (143 ms)
[ RUN      ] Parameters/TestRpc.TestPerformanceBySocketType/SSL_UnixSocket
I20260927 18:34:25.148315 17759 acceptor_pool.cc:254] collecting diagnostics on the listening RPC socket unix:/tmp/dist-test-tasklSkU3G/test-tmp/rpc-test-dc83ce817fda482f9c8b647179ececc6.sock every 8 connection(s)
I20260927 18:34:25.148283 17758 acceptor_pool.cc:254] collecting diagnostics on the listening RPC socket unix:/tmp/dist-test-tasklSkU3G/test-tmp/rpc-test-dc83ce817fda482f9c8b647179ececc6.sock every 8 connection(s)
I20260927 18:34:25.148473 17301 rpc-test.cc:1846] Connecting to unix:/tmp/dist-test-tasklSkU3G/test-tmp/rpc-test-dc83ce817fda482f9c8b647179ececc6.sock
I20260927 18:34:26.398784 17301 rpc-test.cc:1859] Sending 1024MB via ssl-enabled unix socket: real 1.243s	user 1.565s	sys 0.664s
I20260927 18:34:27.617156 17301 rpc-test.cc:1859] Sending 1024MB via ssl-enabled unix socket: real 1.218s	user 1.277s	sys 0.903s
I20260927 18:34:28.851148 17301 rpc-test.cc:1859] Sending 1024MB via ssl-enabled unix socket: real 1.234s	user 1.383s	sys 0.820s
I20260927 18:34:30.065665 17301 rpc-test.cc:1859] Sending 1024MB via ssl-enabled unix socket: real 1.214s	user 1.280s	sys 0.898s
I20260927 18:34:31.234160 17301 rpc-test.cc:1859] Sending 1024MB via ssl-enabled unix socket: real 1.168s	user 1.248s	sys 0.851s
W20260927 18:34:31.234784 17755 connection.cc:196] Error closing socket: Network error: TlsSocket::Close: Broken pipe
[       OK ] Parameters/TestRpc.TestPerformanceBySocketType/SSL_UnixSocket (6097 ms)
[----------] 20 tests from Parameters/TestRpc (25199 ms total)

[----------] 1 test from Parameters/TestRpcSocketTxRxQueue
[ RUN      ] Parameters/TestRpcSocketTxRxQueue.AcceptorRxQueueSizeMetric/0
I20260927 18:34:31.241551 17783 acceptor_pool.cc:254] collecting diagnostics on the listening RPC socket 0.0.0.0:35709 every 1 connection(s)
I20260927 18:34:31.241597 17784 acceptor_pool.cc:254] collecting diagnostics on the listening RPC socket 0.0.0.0:35709 every 1 connection(s)
W20260927 18:34:31.242137 17779 negotiation.cc:337] Failed RPC negotiation. Trace:
0927 18:34:31.242002 (+     0us) reactor.cc:625] Submitting negotiation task for server connection from 127.0.0.1:35482 (local address 127.0.0.1:35709)
0927 18:34:31.242043 (+    41us) server_negotiation.cc:206] Beginning negotiation
0927 18:34:31.242045 (+     2us) server_negotiation.cc:399] Waiting for connection header
0927 18:34:31.242107 (+    62us) negotiation.cc:327] Negotiation complete: Network error: Server connection negotiation failed: server connection from 127.0.0.1:35482: BlockingRecv error: recv got EOF from 127.0.0.1:35482 (error 108)
Metrics: {"server-negotiator.queue_time_us":14}
[       OK ] Parameters/TestRpcSocketTxRxQueue.AcceptorRxQueueSizeMetric/0 (8 ms)
[----------] 1 test from Parameters/TestRpcSocketTxRxQueue (8 ms total)

[----------] Global test environment tear-down
[==========] 21 tests from 2 test suites ran. (25208 ms total)
[  PASSED  ] 20 tests.
[  FAILED  ] 1 test, listed below:
[  FAILED  ] Parameters/TestRpc.TestCallWithChainCertAndChainCA/SSL_UnixSocket, where GetParam() = (true, true)

 1 FAILED TEST