Diagnosed failure
Parameters/TestRpc.TestCallWithChainCertAndChainCA/SSL_UnixSocket: /data0/somelongdirectorytoavoidrpathissues/src/kudu/src/kudu/rpc/rpc-test.cc:270: Failure
Failed
Bad status: Runtime error: could not verify certificate chain (error with cert: subject=CN = localhost, ST = sadfjas, C = AS, emailAddress = sdflkdsajf, O = lskdfjlsad, OU = sldfkja, issuer=C = AS, ST = ASDfkjdhf, L = lskdjf, O = saldfja, OU = skdjf, CN = localhost, emailAddress = sadjflkadsj): : certificate has expired
Google Test trace:
/data0/somelongdirectorytoavoidrpathissues/src/kudu/src/kudu/rpc/rpc-test.cc:267: Connecting to unix:/tmp/dist-test-taskhHXClq/test-tmp/rpc-test-b1d13199bc2742eaa6b035c19b1a0c3d.sock
I20260924 14:37:19.503785 17646 test_util.cc:175] -----------------------------------------------
I20260924 14:37:19.503985 17646 test_util.cc:176] Had fatal failures, leaving test files at /tmp/dist-test-taskhHXClq/test-tmp/rpc-test.6.Parameters_TestRpc.TestCallWithChainCertAndChainCA_SSL_UnixSocket.1790260638156048-17646-0
Full log
Note: This is test shard 7 of 8.
[==========] Running 21 tests from 2 test suites.
[----------] Global test environment set-up.
[----------] 20 tests from Parameters/TestRpc
[ RUN ] Parameters/TestRpc.TestMessengerCreateDestroy/SSL_UnixSocket
WARNING: Logging before InitGoogleLogging() is written to STDERR
I20260924 14:37:18.255999 17646 rpc-test.cc:169] started messenger TestCreateDestroy
[ OK ] Parameters/TestRpc.TestMessengerCreateDestroy/SSL_UnixSocket (1157 ms)
[ RUN ] Parameters/TestRpc.TestNegotiationDeadlock/SSL_UnixSocket
I20260924 14:37:19.394817 17668 acceptor_pool.cc:254] collecting diagnostics on the listening RPC socket unix:/tmp/dist-test-taskhHXClq/test-tmp/rpc-test-bad13e802f2e469db9b675cd04ed8973.sock every 8 connection(s)
I20260924 14:37:19.396570 17669 acceptor_pool.cc:254] collecting diagnostics on the listening RPC socket unix:/tmp/dist-test-taskhHXClq/test-tmp/rpc-test-bad13e802f2e469db9b675cd04ed8973.sock every 8 connection(s)
[ OK ] Parameters/TestRpc.TestNegotiationDeadlock/SSL_UnixSocket (81 ms)
[ RUN ] Parameters/TestRpc.TestCallWithChainCertAndChainCA/SSL_UnixSocket
I20260924 14:37:19.474905 17684 acceptor_pool.cc:254] collecting diagnostics on the listening RPC socket unix:/tmp/dist-test-taskhHXClq/test-tmp/rpc-test-b1d13199bc2742eaa6b035c19b1a0c3d.sock every 8 connection(s)
I20260924 14:37:19.477195 17685 acceptor_pool.cc:254] collecting diagnostics on the listening RPC socket unix:/tmp/dist-test-taskhHXClq/test-tmp/rpc-test-b1d13199bc2742eaa6b035c19b1a0c3d.sock every 8 connection(s)
/data0/somelongdirectorytoavoidrpathissues/src/kudu/src/kudu/rpc/rpc-test.cc:270: Failure
Failed
Bad status: Runtime error: could not verify certificate chain (error with cert: subject=CN = localhost, ST = sadfjas, C = AS, emailAddress = sdflkdsajf, O = lskdfjlsad, OU = sldfkja, issuer=C = AS, ST = ASDfkjdhf, L = lskdjf, O = saldfja, OU = skdjf, CN = localhost, emailAddress = sadjflkadsj): : certificate has expired
Google Test trace:
/data0/somelongdirectorytoavoidrpathissues/src/kudu/src/kudu/rpc/rpc-test.cc:267: Connecting to unix:/tmp/dist-test-taskhHXClq/test-tmp/rpc-test-b1d13199bc2742eaa6b035c19b1a0c3d.sock
I20260924 14:37:19.503785 17646 test_util.cc:175] -----------------------------------------------
I20260924 14:37:19.503985 17646 test_util.cc:176] Had fatal failures, leaving test files at /tmp/dist-test-taskhHXClq/test-tmp/rpc-test.6.Parameters_TestRpc.TestCallWithChainCertAndChainCA_SSL_UnixSocket.1790260638156048-17646-0
[ FAILED ] Parameters/TestRpc.TestCallWithChainCertAndChainCA/SSL_UnixSocket, where GetParam() = (true, true) (55 ms)
[ RUN ] Parameters/TestRpc.TestCallWithPasswordProtectedKey/SSL_UnixSocket
I20260924 14:37:19.528767 17709 acceptor_pool.cc:254] collecting diagnostics on the listening RPC socket unix:/tmp/dist-test-taskhHXClq/test-tmp/rpc-test-3b1e987c1ff44d3e8e6d5b06e9f0fa29.sock every 8 connection(s)
I20260924 14:37:19.529521 17710 acceptor_pool.cc:254] collecting diagnostics on the listening RPC socket unix:/tmp/dist-test-taskhHXClq/test-tmp/rpc-test-3b1e987c1ff44d3e8e6d5b06e9f0fa29.sock every 8 connection(s)
W20260924 14:37:19.572225 17706 connection.cc:196] Error closing socket: Network error: TlsSocket::Close: Broken pipe
[ OK ] Parameters/TestRpc.TestCallWithPasswordProtectedKey/SSL_UnixSocket (73 ms)
[ RUN ] Parameters/TestRpc.TestCallToBadServer/SSL_UnixSocket
I20260924 14:37:19.608942 17646 rpc-test.cc:394] Status: Network error: Client connection negotiation failed: client connection to 0.0.0.0:0: connect: Connection refused (error 111)
I20260924 14:37:19.610294 17646 rpc-test.cc:394] Status: Network error: Client connection negotiation failed: client connection to 0.0.0.0:0: connect: Connection refused (error 111)
I20260924 14:37:19.611689 17646 rpc-test.cc:394] Status: Network error: Client connection negotiation failed: client connection to 0.0.0.0:0: connect: Connection refused (error 111)
I20260924 14:37:19.613008 17646 rpc-test.cc:394] Status: Network error: Client connection negotiation failed: client connection to 0.0.0.0:0: connect: Connection refused (error 111)
I20260924 14:37:19.614296 17646 rpc-test.cc:394] Status: Network error: Client connection negotiation failed: client connection to 0.0.0.0:0: connect: Connection refused (error 111)
[ OK ] Parameters/TestRpc.TestCallToBadServer/SSL_UnixSocket (39 ms)
[ RUN ] Parameters/TestRpc.TestWrongService/SSL_UnixSocket
I20260924 14:37:19.645494 17744 acceptor_pool.cc:254] collecting diagnostics on the listening RPC socket unix:/tmp/dist-test-taskhHXClq/test-tmp/rpc-test-b8099e6481654851b6aac5a2ca84a804.sock every 8 connection(s)
I20260924 14:37:19.646415 17745 acceptor_pool.cc:254] collecting diagnostics on the listening RPC socket unix:/tmp/dist-test-taskhHXClq/test-tmp/rpc-test-b8099e6481654851b6aac5a2ca84a804.sock every 8 connection(s)
I20260924 14:37:19.678629 17741 messenger.cc:345] service WrongServiceName not registered on TestServer
W20260924 14:37:19.681566 17741 connection.cc:196] Error closing socket: Network error: TlsSocket::Close: Broken pipe
[ OK ] Parameters/TestRpc.TestWrongService/SSL_UnixSocket (68 ms)
[ RUN ] Parameters/TestRpc.TestConnectionKeepalive/SSL_UnixSocket
I20260924 14:37:19.725054 17767 acceptor_pool.cc:254] collecting diagnostics on the listening RPC socket unix:/tmp/dist-test-taskhHXClq/test-tmp/rpc-test-15b01f68d66f4a8db1cf9767be003b97.sock every 8 connection(s)
I20260924 14:37:19.725809 17768 acceptor_pool.cc:254] collecting diagnostics on the listening RPC socket unix:/tmp/dist-test-taskhHXClq/test-tmp/rpc-test-15b01f68d66f4a8db1cf9767be003b97.sock every 8 connection(s)
I20260924 14:37:19.729020 17646 rpc-test.cc:488] Connecting to unix:/tmp/dist-test-taskhHXClq/test-tmp/rpc-test-15b01f68d66f4a8db1cf9767be003b97.sock
W20260924 14:37:20.189644 17780 connection.cc:196] Error closing socket: Network error: TlsSocket::Close: Broken pipe
[ OK ] Parameters/TestRpc.TestConnectionKeepalive/SSL_UnixSocket (1092 ms)
[ RUN ] Parameters/TestRpc.TestClientConnectionMetrics/SSL_UnixSocket
I20260924 14:37:20.799878 17792 acceptor_pool.cc:254] collecting diagnostics on the listening RPC socket unix:/tmp/dist-test-taskhHXClq/test-tmp/rpc-test-4a3a597bef38434192626a5faf24bbef.sock every 8 connection(s)
I20260924 14:37:20.800607 17793 acceptor_pool.cc:254] collecting diagnostics on the listening RPC socket unix:/tmp/dist-test-taskhHXClq/test-tmp/rpc-test-4a3a597bef38434192626a5faf24bbef.sock every 8 connection(s)
I20260924 14:37:20.803851 17646 rpc-test.cc:569] Connecting to unix:/tmp/dist-test-taskhHXClq/test-tmp/rpc-test-4a3a597bef38434192626a5faf24bbef.sock
W20260924 14:39:36.168496 17789 connection.cc:196] Error closing socket: Network error: TlsSocket::Close: Broken pipe
[ OK ] Parameters/TestRpc.TestClientConnectionMetrics/SSL_UnixSocket (135397 ms)
[ RUN ] Parameters/TestRpc.TestCredentialsPolicy/SSL_UnixSocket
I20260924 14:39:36.208020 17828 acceptor_pool.cc:254] collecting diagnostics on the listening RPC socket unix:/tmp/dist-test-taskhHXClq/test-tmp/rpc-test-390797699dee4aaf8b3dabcf83025c48.sock every 8 connection(s)
I20260924 14:39:36.208988 17829 acceptor_pool.cc:254] collecting diagnostics on the listening RPC socket unix:/tmp/dist-test-taskhHXClq/test-tmp/rpc-test-390797699dee4aaf8b3dabcf83025c48.sock every 8 connection(s)
I20260924 14:39:36.212253 17646 rpc-test.cc:700] Connecting to unix:/tmp/dist-test-taskhHXClq/test-tmp/rpc-test-390797699dee4aaf8b3dabcf83025c48.sock
W20260924 14:39:36.248534 17827 connection.cc:196] Error closing socket: Network error: TlsSocket::Close: Broken pipe
[ OK ] Parameters/TestRpc.TestCredentialsPolicy/SSL_UnixSocket (92 ms)
[ RUN ] Parameters/TestRpc.TestCallLongerThanKeepalive/SSL_UnixSocket
I20260924 14:39:36.289496 17853 acceptor_pool.cc:254] collecting diagnostics on the listening RPC socket unix:/tmp/dist-test-taskhHXClq/test-tmp/rpc-test-7014bbd05d044cab8f2304210504417a.sock every 8 connection(s)
I20260924 14:39:36.290241 17854 acceptor_pool.cc:254] collecting diagnostics on the listening RPC socket unix:/tmp/dist-test-taskhHXClq/test-tmp/rpc-test-7014bbd05d044cab8f2304210504417a.sock every 8 connection(s)
I20260924 14:39:36.334489 17857 rpc-test-base.h:222] got call: sleep_micros: 3000000 deferred: true
I20260924 14:39:39.339131 17857 rpcz_store.cc:275] Call kudu.rpc.GenericCalculatorService.Sleep from unix:<unnamed> (request call id 0) took 3004 ms. Trace:
I20260924 14:39:39.339620 17857 rpcz_store.cc:276] 0924 14:39:36.334330 (+ 0us) service_pool.cc:170] Inserting onto call queue
0924 14:39:36.334432 (+ 102us) service_pool.cc:227] Handling call
0924 14:39:39.338964 (+3004532us) inbound_call.cc:173] Queueing success response
Metrics: {}
W20260924 14:39:39.345541 17850 connection.cc:196] Error closing socket: Network error: TlsSocket::Close: Broken pipe
[ OK ] Parameters/TestRpc.TestCallLongerThanKeepalive/SSL_UnixSocket (3082 ms)
[ RUN ] Parameters/TestRpc.TestRpcSidecar/SSL_UnixSocket
I20260924 14:39:39.394522 17879 acceptor_pool.cc:254] collecting diagnostics on the listening RPC socket unix:/tmp/dist-test-taskhHXClq/test-tmp/rpc-test-0193609ccac74ebe87ff665634d6764f.sock every 8 connection(s)
I20260924 14:39:39.395558 17880 acceptor_pool.cc:254] collecting diagnostics on the listening RPC socket unix:/tmp/dist-test-taskhHXClq/test-tmp/rpc-test-0193609ccac74ebe87ff665634d6764f.sock every 8 connection(s)
W20260924 14:39:39.924872 17876 connection.cc:196] Error closing socket: Network error: TlsSocket::Close: Broken pipe
[ OK ] Parameters/TestRpc.TestRpcSidecar/SSL_UnixSocket (577 ms)
[ RUN ] Parameters/TestRpc.TestRpcSidecarLimits/SSL_UnixSocket
I20260924 14:39:59.218544 17906 acceptor_pool.cc:254] collecting diagnostics on the listening RPC socket unix:/tmp/dist-test-taskhHXClq/test-tmp/rpc-test-35465ae3c39940dc826aac4aeefd657e.sock every 8 connection(s)
I20260924 14:39:59.219821 17907 acceptor_pool.cc:254] collecting diagnostics on the listening RPC socket unix:/tmp/dist-test-taskhHXClq/test-tmp/rpc-test-35465ae3c39940dc826aac4aeefd657e.sock every 8 connection(s)
W20260924 14:39:59.266510 17646 serialization.cc:72] Serialized kudu.rpc_test.PushStringsRequestPB (2147483654 bytes) is larger than the maximum configured RPC message size (52428800 bytes). Sending anyway, but peer may reject the data.
W20260924 14:39:59.277741 17903 connection.cc:535] server connection from unix:<unnamed> recv error: Network error: RPC frame had a length of 2147483714, but we only support messages up to 52428800 bytes long.
W20260924 14:39:59.278107 17903 connection.cc:158] shutting down server connection from unix:<unnamed> with pending inbound data: 4/2147483714 bytes received; last active 0 ns ago: status Network error: RPC frame had a length of 2147483714, but we only support messages up to 52428800 bytes long.
W20260924 14:39:59.278973 17919 connection.cc:698] client connection to unix:/tmp/dist-test-taskhHXClq/test-tmp/rpc-test-35465ae3c39940dc826aac4aeefd657e.sock send error: Network error: failed to write to TLS socket: Broken pipe
W20260924 14:39:59.279624 17919 connection.cc:196] Error closing socket: Network error: TlsSocket::Close: Success
[ OK ] Parameters/TestRpc.TestRpcSidecarLimits/SSL_UnixSocket (19976 ms)
[ RUN ] Parameters/TestRpc.TestCallTimeoutDoesntAffectNegotiation/SSL_UnixSocket
I20260924 14:39:59.928647 17931 acceptor_pool.cc:254] collecting diagnostics on the listening RPC socket unix:/tmp/dist-test-taskhHXClq/test-tmp/rpc-test-6cc11a80194a4cf88b941705bd272ec7.sock every 8 connection(s)
I20260924 14:39:59.929396 17932 acceptor_pool.cc:254] collecting diagnostics on the listening RPC socket unix:/tmp/dist-test-taskhHXClq/test-tmp/rpc-test-6cc11a80194a4cf88b941705bd272ec7.sock every 8 connection(s)
W20260924 14:39:59.961870 17927 negotiation.cc:266] Injecting 500ms delay in negotiation
I20260924 14:40:00.012049 17646 rpc-test-base.h:595] status: Timed out: connection negotiation to unix:/tmp/dist-test-taskhHXClq/test-tmp/rpc-test-6cc11a80194a4cf88b941705bd272ec7.sock for RPC Sleep timed out after 0.050s (ON_OUTBOUND_QUEUE), seconds elapsed: 0.0511692
W20260924 14:40:00.475901 17928 connection.cc:196] Error closing socket: Network error: TlsSocket::Close: Broken pipe
[ OK ] Parameters/TestRpc.TestCallTimeoutDoesntAffectNegotiation/SSL_UnixSocket (573 ms)
[ RUN ] Parameters/TestRpc.TestRpcHandlerLatencyMetric/SSL_UnixSocket
I20260924 14:40:00.498051 17956 acceptor_pool.cc:254] collecting diagnostics on the listening RPC socket unix:/tmp/dist-test-taskhHXClq/test-tmp/rpc-test-af13176e753646d58fd3309f27c7da9e.sock every 8 connection(s)
I20260924 14:40:00.498805 17957 acceptor_pool.cc:254] collecting diagnostics on the listening RPC socket unix:/tmp/dist-test-taskhHXClq/test-tmp/rpc-test-af13176e753646d58fd3309f27c7da9e.sock every 8 connection(s)
I20260924 14:40:00.602578 17646 rpc-test.cc:1236] Sleep() min lat: 21646
I20260924 14:40:00.602792 17646 rpc-test.cc:1237] Sleep() mean lat: 21646
I20260924 14:40:00.602929 17646 rpc-test.cc:1238] Sleep() max lat: 21646
I20260924 14:40:00.603040 17646 rpc-test.cc:1239] Sleep() #calls: 1
W20260924 14:40:00.606128 17953 connection.cc:196] Error closing socket: Network error: TlsSocket::Close: Broken pipe
[ OK ] Parameters/TestRpc.TestRpcHandlerLatencyMetric/SSL_UnixSocket (129 ms)
[ RUN ] Parameters/TestRpc.TimedOutOnResponseMetricServiceQueue/SSL_UnixSocket
I20260924 14:40:00.632800 17982 acceptor_pool.cc:254] collecting diagnostics on the listening RPC socket unix:/tmp/dist-test-taskhHXClq/test-tmp/rpc-test-0d3ed918c3a143c8882f54869bb56a1a.sock every 8 connection(s)
I20260924 14:40:00.633522 17983 acceptor_pool.cc:254] collecting diagnostics on the listening RPC socket unix:/tmp/dist-test-taskhHXClq/test-tmp/rpc-test-0d3ed918c3a143c8882f54869bb56a1a.sock every 8 connection(s)
W20260924 14:40:00.712081 17984 rpcz_store.cc:267] Call kudu.rpc_test.CalculatorService.Sleep from unix:<unnamed> (request call id 2) took 20 ms (client timeout 20 ms). Trace:
W20260924 14:40:00.712446 17984 rpcz_store.cc:269] 0924 14:40:00.691390 (+ 0us) service_pool.cc:170] Inserting onto call queue
0924 14:40:00.711892 (+ 20502us) service_pool.cc:214] Skipping call since client already timed out
0924 14:40:00.712013 (+ 121us) inbound_call.cc:173] Queueing failure response
Metrics: {}
W20260924 14:40:00.715173 17979 connection.cc:196] Error closing socket: Network error: TlsSocket::Close: Broken pipe
[ OK ] Parameters/TestRpc.TimedOutOnResponseMetricServiceQueue/SSL_UnixSocket (109 ms)
[ RUN ] Parameters/TestRpc.RpcPendingConnectionsMetric/SSL_UnixSocket
I20260924 14:40:00.729964 18005 acceptor_pool.cc:254] collecting diagnostics on the listening RPC socket 0.0.0.0:35655 every 8 connection(s)
I20260924 14:40:00.730722 18006 acceptor_pool.cc:254] collecting diagnostics on the listening RPC socket 0.0.0.0:35655 every 8 connection(s)
W20260924 14:40:00.736011 18001 negotiation.cc:337] Failed RPC negotiation. Trace:
0924 14:40:00.734700 (+ 0us) reactor.cc:625] Submitting negotiation task for server connection from 127.0.0.1:45176 (local address 127.0.0.1:35655)
0924 14:40:00.735092 (+ 392us) server_negotiation.cc:206] Beginning negotiation
0924 14:40:00.735110 (+ 18us) server_negotiation.cc:399] Waiting for connection header
0924 14:40:00.735367 (+ 257us) negotiation.cc:327] Negotiation complete: Network error: Server connection negotiation failed: server connection from 127.0.0.1:45176: BlockingRecv error: recv got EOF from 127.0.0.1:45176 (error 108)
Metrics: {"server-negotiator.queue_time_us":105}
[ OK ] Parameters/TestRpc.RpcPendingConnectionsMetric/SSL_UnixSocket (30 ms)
[ RUN ] Parameters/TestRpc.TestRpcContextClientDeadline/SSL_UnixSocket
I20260924 14:40:00.765403 18021 acceptor_pool.cc:254] collecting diagnostics on the listening RPC socket unix:/tmp/dist-test-taskhHXClq/test-tmp/rpc-test-b3b7610d9bd54a97853b284210f44f6e.sock every 8 connection(s)
I20260924 14:40:00.766171 18022 acceptor_pool.cc:254] collecting diagnostics on the listening RPC socket unix:/tmp/dist-test-taskhHXClq/test-tmp/rpc-test-b3b7610d9bd54a97853b284210f44f6e.sock every 8 connection(s)
W20260924 14:40:00.829146 18018 connection.cc:196] Error closing socket: Network error: TlsSocket::Close: Broken pipe
[ OK ] Parameters/TestRpc.TestRpcContextClientDeadline/SSL_UnixSocket (83 ms)
[ RUN ] Parameters/TestRpc.TestApplicationFeatureFlagUnsupportedServer/SSL_UnixSocket
I20260924 14:40:00.867012 18046 acceptor_pool.cc:254] collecting diagnostics on the listening RPC socket unix:/tmp/dist-test-taskhHXClq/test-tmp/rpc-test-6ecbc0bdcea3493d8f893e5146d45ede.sock every 8 connection(s)
I20260924 14:40:00.867844 18047 acceptor_pool.cc:254] collecting diagnostics on the listening RPC socket unix:/tmp/dist-test-taskhHXClq/test-tmp/rpc-test-6ecbc0bdcea3493d8f893e5146d45ede.sock every 8 connection(s)
W20260924 14:40:00.905319 18043 connection.cc:196] Error closing socket: Network error: TlsSocket::Close: Broken pipe
[ OK ] Parameters/TestRpc.TestApplicationFeatureFlagUnsupportedServer/SSL_UnixSocket (76 ms)
[ RUN ] Parameters/TestRpc.TestCancellationAsync/SSL_UnixSocket
I20260924 14:40:00.925659 18071 acceptor_pool.cc:254] collecting diagnostics on the listening RPC socket unix:/tmp/dist-test-taskhHXClq/test-tmp/rpc-test-e8e5420215704a0ba0e1d8f240c01b90.sock every 8 connection(s)
I20260924 14:40:00.926400 18072 acceptor_pool.cc:254] collecting diagnostics on the listening RPC socket unix:/tmp/dist-test-taskhHXClq/test-tmp/rpc-test-e8e5420215704a0ba0e1d8f240c01b90.sock every 8 connection(s)
I20260924 14:40:00.929549 17646 rpc-test.cc:1716] Connecting to unix:/tmp/dist-test-taskhHXClq/test-tmp/rpc-test-e8e5420215704a0ba0e1d8f240c01b90.sock
I20260924 14:40:00.945900 17646 test_util.cc:268] Using random seed: -1827111210
I20260924 14:40:01.181655 18075 rpc-test-base.h:240] got call: sleep_micros: 500 pattern: 4294967295 num_repetitions: 2097152 sidecar_idx: 0
I20260924 14:40:01.377344 18074 rpc-test-base.h:240] got call: sleep_micros: 500 pattern: 4294967295 num_repetitions: 2097152 sidecar_idx: 0
I20260924 14:40:01.598237 18075 rpc-test-base.h:240] got call: sleep_micros: 500 pattern: 4294967295 num_repetitions: 2097152 sidecar_idx: 0
I20260924 14:40:01.826610 18075 rpc-test-base.h:240] got call: sleep_micros: 500 pattern: 4294967295 num_repetitions: 2097152 sidecar_idx: 0
I20260924 14:40:02.032915 18075 rpc-test-base.h:240] got call: sleep_micros: 500 pattern: 4294967295 num_repetitions: 2097152 sidecar_idx: 0
I20260924 14:40:02.251075 18075 rpc-test-base.h:240] got call: sleep_micros: 500 pattern: 4294967295 num_repetitions: 2097152 sidecar_idx: 0
I20260924 14:40:02.439349 18074 rpc-test-base.h:240] got call: sleep_micros: 500 pattern: 4294967295 num_repetitions: 2097152 sidecar_idx: 0
I20260924 14:40:02.669113 18075 rpc-test-base.h:240] got call: sleep_micros: 500 pattern: 4294967295 num_repetitions: 2097152 sidecar_idx: 0
I20260924 14:40:02.880856 18074 rpc-test-base.h:240] got call: sleep_micros: 500 pattern: 4294967295 num_repetitions: 2097152 sidecar_idx: 0
W20260924 14:40:02.898968 18068 connection.cc:196] Error closing socket: Network error: TlsSocket::Close: Broken pipe
W20260924 14:40:03.019026 18068 connection.cc:441] server connection from unix:<unnamed> torn down before Call kudu.rpc.GenericCalculatorService.SleepWithSidecar from unix:<unnamed> (request call id 9) could send its response
[ OK ] Parameters/TestRpc.TestCancellationAsync/SSL_UnixSocket (2118 ms)
[ RUN ] Parameters/TestRpc.TestPerformanceBySocketType/SSL_UnixSocket
I20260924 14:40:03.116765 18096 acceptor_pool.cc:254] collecting diagnostics on the listening RPC socket unix:/tmp/dist-test-taskhHXClq/test-tmp/rpc-test-c104ca286ef64cec9fed93359f78065c.sock every 8 connection(s)
I20260924 14:40:03.117477 18097 acceptor_pool.cc:254] collecting diagnostics on the listening RPC socket unix:/tmp/dist-test-taskhHXClq/test-tmp/rpc-test-c104ca286ef64cec9fed93359f78065c.sock every 8 connection(s)
I20260924 14:40:03.120771 17646 rpc-test.cc:1846] Connecting to unix:/tmp/dist-test-taskhHXClq/test-tmp/rpc-test-c104ca286ef64cec9fed93359f78065c.sock
I20260924 14:40:24.765100 17646 rpc-test.cc:1859] Sending 1024MB via ssl-enabled unix socket: real 21.623s user 19.283s sys 13.091s
I20260924 14:40:46.225274 17646 rpc-test.cc:1859] Sending 1024MB via ssl-enabled unix socket: real 21.460s user 18.972s sys 13.001s
I20260924 14:41:07.709105 17646 rpc-test.cc:1859] Sending 1024MB via ssl-enabled unix socket: real 21.483s user 19.034s sys 12.949s
I20260924 14:41:28.904134 17646 rpc-test.cc:1859] Sending 1024MB via ssl-enabled unix socket: real 21.195s user 18.340s sys 13.074s
I20260924 14:41:50.195726 17646 rpc-test.cc:1859] Sending 1024MB via ssl-enabled unix socket: real 21.291s user 18.771s sys 12.831s
[ OK ] Parameters/TestRpc.TestPerformanceBySocketType/SSL_UnixSocket (107185 ms)
[----------] 20 tests from Parameters/TestRpc (272005 ms total)
[----------] 1 test from Parameters/TestRpcSocketTxRxQueue
[ RUN ] Parameters/TestRpcSocketTxRxQueue.AcceptorRxQueueSizeMetric/0
I20260924 14:41:50.226536 18132 acceptor_pool.cc:254] collecting diagnostics on the listening RPC socket 0.0.0.0:37451 every 1 connection(s)
I20260924 14:41:50.227348 18133 acceptor_pool.cc:254] collecting diagnostics on the listening RPC socket 0.0.0.0:37451 every 1 connection(s)
W20260924 14:41:50.232718 18128 negotiation.cc:337] Failed RPC negotiation. Trace:
0924 14:41:50.231129 (+ 0us) reactor.cc:625] Submitting negotiation task for server connection from 127.0.0.1:36234 (local address 127.0.0.1:37451)
0924 14:41:50.231613 (+ 484us) server_negotiation.cc:206] Beginning negotiation
0924 14:41:50.231639 (+ 26us) server_negotiation.cc:399] Waiting for connection header
0924 14:41:50.231880 (+ 241us) negotiation.cc:327] Negotiation complete: Network error: Server connection negotiation failed: server connection from 127.0.0.1:36234: BlockingRecv error: recv got EOF from 127.0.0.1:36234 (error 108)
Metrics: {"server-negotiator.queue_time_us":101}
[ OK ] Parameters/TestRpcSocketTxRxQueue.AcceptorRxQueueSizeMetric/0 (24 ms)
[----------] 1 test from Parameters/TestRpcSocketTxRxQueue (24 ms total)
[----------] Global test environment tear-down
[==========] 21 tests from 2 test suites ran. (272031 ms total)
[ PASSED ] 20 tests.
[ FAILED ] 1 test, listed below:
[ FAILED ] Parameters/TestRpc.TestCallWithChainCertAndChainCA/SSL_UnixSocket, where GetParam() = (true, true)
1 FAILED TEST