Diagnosed failure

Parameters/TestRpc.TestCallWithChainCertAndChainCA/SSL_TCP: /data0/somelongdirectorytoavoidrpathissues/src/kudu/src/kudu/rpc/rpc-test.cc:270: Failure
Failed
Bad status: Runtime error: could not verify certificate chain (error with cert: subject=CN = localhost, ST = sadfjas, C = AS, emailAddress = sdflkdsajf, O = lskdfjlsad, OU = sldfkja, issuer=C = AS, ST = ASDfkjdhf, L = lskdjf, O = saldfja, OU = skdjf, CN = localhost, emailAddress = sadjflkadsj): : certificate has expired
Google Test trace:
/data0/somelongdirectorytoavoidrpathissues/src/kudu/src/kudu/rpc/rpc-test.cc:267: Connecting to 0.0.0.0:43951
I20260927 22:51:22.796382 32169 test_util.cc:175] -----------------------------------------------
I20260927 22:51:22.796553 32169 test_util.cc:176] Had fatal failures, leaving test files at /tmp/dist-test-taskgbcHNz/test-tmp/rpc-test.5.Parameters_TestRpc.TestCallWithChainCertAndChainCA_SSL_TCP.1790549482668077-32169-0

Full log

Note: This is test shard 6 of 8.
[==========] Running 21 tests from 2 test suites.
[----------] Global test environment set-up.
[----------] 20 tests from Parameters/TestRpc
[ RUN      ] Parameters/TestRpc.TestMessengerCreateDestroy/SSL_TCP
WARNING: Logging before InitGoogleLogging() is written to STDERR
I20260927 22:51:22.714690 32169 rpc-test.cc:169] started messenger TestCreateDestroy
[       OK ] Parameters/TestRpc.TestMessengerCreateDestroy/SSL_TCP (29 ms)
[ RUN      ] Parameters/TestRpc.TestNegotiationDeadlock/SSL_TCP
I20260927 22:51:22.736171 32189 acceptor_pool.cc:254] collecting diagnostics on the listening RPC socket 0.0.0.0:35793 every 8 connection(s)
I20260927 22:51:22.736438 32190 acceptor_pool.cc:254] collecting diagnostics on the listening RPC socket 0.0.0.0:35793 every 8 connection(s)
[       OK ] Parameters/TestRpc.TestNegotiationDeadlock/SSL_TCP (38 ms)
[ RUN      ] Parameters/TestRpc.TestCallWithChainCertAndChainCA/SSL_TCP
I20260927 22:51:22.783768 32205 acceptor_pool.cc:254] collecting diagnostics on the listening RPC socket 0.0.0.0:43951 every 8 connection(s)
I20260927 22:51:22.784086 32206 acceptor_pool.cc:254] collecting diagnostics on the listening RPC socket 0.0.0.0:43951 every 8 connection(s)
/data0/somelongdirectorytoavoidrpathissues/src/kudu/src/kudu/rpc/rpc-test.cc:270: Failure
Failed
Bad status: Runtime error: could not verify certificate chain (error with cert: subject=CN = localhost, ST = sadfjas, C = AS, emailAddress = sdflkdsajf, O = lskdfjlsad, OU = sldfkja, issuer=C = AS, ST = ASDfkjdhf, L = lskdjf, O = saldfja, OU = skdjf, CN = localhost, emailAddress = sadjflkadsj): : certificate has expired
Google Test trace:
/data0/somelongdirectorytoavoidrpathissues/src/kudu/src/kudu/rpc/rpc-test.cc:267: Connecting to 0.0.0.0:43951
I20260927 22:51:22.796382 32169 test_util.cc:175] -----------------------------------------------
I20260927 22:51:22.796553 32169 test_util.cc:176] Had fatal failures, leaving test files at /tmp/dist-test-taskgbcHNz/test-tmp/rpc-test.5.Parameters_TestRpc.TestCallWithChainCertAndChainCA_SSL_TCP.1790549482668077-32169-0
[  FAILED  ] Parameters/TestRpc.TestCallWithChainCertAndChainCA/SSL_TCP, where GetParam() = (true, false) (39 ms)
[ RUN      ] Parameters/TestRpc.TestCallWithPasswordProtectedKey/SSL_TCP
I20260927 22:51:22.820966 32230 acceptor_pool.cc:254] collecting diagnostics on the listening RPC socket 0.0.0.0:44775 every 8 connection(s)
I20260927 22:51:22.821221 32231 acceptor_pool.cc:254] collecting diagnostics on the listening RPC socket 0.0.0.0:44775 every 8 connection(s)
[       OK ] Parameters/TestRpc.TestCallWithPasswordProtectedKey/SSL_TCP (61 ms)
[ RUN      ] Parameters/TestRpc.TestCallToBadServer/SSL_TCP
I20260927 22:51:22.870137 32169 rpc-test.cc:394] Status: Network error: Client connection negotiation failed: client connection to 0.0.0.0:0: connect: Connection refused (error 111)
I20260927 22:51:22.870880 32169 rpc-test.cc:394] Status: Network error: Client connection negotiation failed: client connection to 0.0.0.0:0: connect: Connection refused (error 111)
I20260927 22:51:22.871510 32169 rpc-test.cc:394] Status: Network error: Client connection negotiation failed: client connection to 0.0.0.0:0: connect: Connection refused (error 111)
I20260927 22:51:22.872025 32169 rpc-test.cc:394] Status: Network error: Client connection negotiation failed: client connection to 0.0.0.0:0: connect: Connection refused (error 111)
I20260927 22:51:22.872632 32169 rpc-test.cc:394] Status: Network error: Client connection negotiation failed: client connection to 0.0.0.0:0: connect: Connection refused (error 111)
[       OK ] Parameters/TestRpc.TestCallToBadServer/SSL_TCP (16 ms)
[ RUN      ] Parameters/TestRpc.TestWrongService/SSL_TCP
I20260927 22:51:22.897970 32265 acceptor_pool.cc:254] collecting diagnostics on the listening RPC socket 0.0.0.0:42279 every 8 connection(s)
I20260927 22:51:22.898255 32266 acceptor_pool.cc:254] collecting diagnostics on the listening RPC socket 0.0.0.0:42279 every 8 connection(s)
I20260927 22:51:22.926411 32263 messenger.cc:345] service WrongServiceName not registered on TestServer
[       OK ] Parameters/TestRpc.TestWrongService/SSL_TCP (56 ms)
[ RUN      ] Parameters/TestRpc.TestConnectionKeepalive/SSL_TCP
I20260927 22:51:22.951645 32288 acceptor_pool.cc:254] collecting diagnostics on the listening RPC socket 0.0.0.0:42681 every 8 connection(s)
I20260927 22:51:22.951889 32289 acceptor_pool.cc:254] collecting diagnostics on the listening RPC socket 0.0.0.0:42681 every 8 connection(s)
I20260927 22:51:22.952958 32169 rpc-test.cc:488] Connecting to 0.0.0.0:42681
[       OK ] Parameters/TestRpc.TestConnectionKeepalive/SSL_TCP (1056 ms)
[ RUN      ] Parameters/TestRpc.TestClientConnectionMetrics/SSL_TCP
I20260927 22:51:24.003356 32313 acceptor_pool.cc:254] collecting diagnostics on the listening RPC socket 0.0.0.0:40307 every 8 connection(s)
I20260927 22:51:24.003643 32314 acceptor_pool.cc:254] collecting diagnostics on the listening RPC socket 0.0.0.0:40307 every 8 connection(s)
I20260927 22:51:24.004647 32169 rpc-test.cc:569] Connecting to 0.0.0.0:40307
[       OK ] Parameters/TestRpc.TestClientConnectionMetrics/SSL_TCP (20126 ms)
[ RUN      ] Parameters/TestRpc.TestCredentialsPolicy/SSL_TCP
I20260927 22:51:44.161967 32336 acceptor_pool.cc:254] collecting diagnostics on the listening RPC socket 0.0.0.0:40045 every 8 connection(s)
I20260927 22:51:44.162173 32337 acceptor_pool.cc:254] collecting diagnostics on the listening RPC socket 0.0.0.0:40045 every 8 connection(s)
I20260927 22:51:44.163094 32169 rpc-test.cc:700] Connecting to 0.0.0.0:40045
[       OK ] Parameters/TestRpc.TestCredentialsPolicy/SSL_TCP (105 ms)
[ RUN      ] Parameters/TestRpc.TestCallLongerThanKeepalive/SSL_TCP
I20260927 22:51:44.231225 32361 acceptor_pool.cc:254] collecting diagnostics on the listening RPC socket 0.0.0.0:45649 every 8 connection(s)
I20260927 22:51:44.231462 32362 acceptor_pool.cc:254] collecting diagnostics on the listening RPC socket 0.0.0.0:45649 every 8 connection(s)
I20260927 22:51:44.253935 32365 rpc-test-base.h:222] got call: sleep_micros: 3000000 deferred: true
I20260927 22:51:47.256857 32365 rpcz_store.cc:275] Call kudu.rpc.GenericCalculatorService.Sleep from 127.0.0.1:39484 (request call id 0) took 3003 ms. Trace:
I20260927 22:51:47.257053 32365 rpcz_store.cc:276] 0927 22:51:44.253746 (+     0us) service_pool.cc:170] Inserting onto call queue
0927 22:51:44.253870 (+   124us) service_pool.cc:227] Handling call
0927 22:51:47.256808 (+3002938us) inbound_call.cc:173] Queueing success response
Metrics: {}
[       OK ] Parameters/TestRpc.TestCallLongerThanKeepalive/SSL_TCP (3043 ms)
[ RUN      ] Parameters/TestRpc.TestRpcSidecar/SSL_TCP
I20260927 22:51:47.273290 32386 acceptor_pool.cc:254] collecting diagnostics on the listening RPC socket 0.0.0.0:40559 every 8 connection(s)
I20260927 22:51:47.273713 32387 acceptor_pool.cc:254] collecting diagnostics on the listening RPC socket 0.0.0.0:40559 every 8 connection(s)
[       OK ] Parameters/TestRpc.TestRpcSidecar/SSL_TCP (124 ms)
[ RUN      ] Parameters/TestRpc.TestRpcSidecarLimits/SSL_TCP
I20260927 22:51:49.513304 32411 acceptor_pool.cc:254] collecting diagnostics on the listening RPC socket 0.0.0.0:40821 every 8 connection(s)
I20260927 22:51:49.513567 32412 acceptor_pool.cc:254] collecting diagnostics on the listening RPC socket 0.0.0.0:40821 every 8 connection(s)
W20260927 22:51:49.534027 32169 serialization.cc:72] Serialized kudu.rpc_test.PushStringsRequestPB (2147483654 bytes) is larger than the maximum configured RPC message size (52428800 bytes). Sending anyway, but peer may reject the data.
W20260927 22:51:49.540784 32409 connection.cc:535] server connection from 127.0.0.1:47776 recv error: Network error: RPC frame had a length of 2147483714, but we only support messages up to 52428800 bytes long.
W20260927 22:51:49.540940 32409 connection.cc:158] shutting down server connection from 127.0.0.1:47776 with pending inbound data: 4/2147483714 bytes received; last active 0 ns ago: status Network error: RPC frame had a length of 2147483714, but we only support messages up to 52428800 bytes long.
W20260927 22:51:49.541534 32424 connection.cc:196] Error closing socket: Network error: TlsSocket::Close: Connection reset by peer
I20260927 22:51:49.557809 32436 acceptor_pool.cc:254] collecting diagnostics on the listening RPC socket 0.0.0.0:38891 every 8 connection(s)
I20260927 22:51:49.557929 32437 acceptor_pool.cc:254] collecting diagnostics on the listening RPC socket 0.0.0.0:38891 every 8 connection(s)
W20260927 22:51:54.938302 32435 connection.cc:577] server connection from 127.0.0.1:43620: received bad data: 'Corruption: Invalid packet: message had a length of 2147483710, but we only support messages up to 2147483647 bytes
'
[       OK ] Parameters/TestRpc.TestRpcSidecarLimits/SSL_TCP (8041 ms)
[ RUN      ] Parameters/TestRpc.TestCallTimeoutDoesntAffectNegotiation/SSL_TCP
I20260927 22:51:55.466904 32461 acceptor_pool.cc:254] collecting diagnostics on the listening RPC socket 0.0.0.0:38685 every 8 connection(s)
I20260927 22:51:55.467235 32462 acceptor_pool.cc:254] collecting diagnostics on the listening RPC socket 0.0.0.0:38685 every 8 connection(s)
W20260927 22:51:55.489302 32457 negotiation.cc:266] Injecting 500ms delay in negotiation
I20260927 22:51:55.539727 32169 rpc-test-base.h:595] status: Timed out: connection negotiation to 0.0.0.0:38685 for RPC Sleep timed out after 0.050s (ON_OUTBOUND_QUEUE), seconds elapsed: 0.0511613
[       OK ] Parameters/TestRpc.TestCallTimeoutDoesntAffectNegotiation/SSL_TCP (570 ms)
[ RUN      ] Parameters/TestRpc.TestRpcHandlerLatencyMetric/SSL_TCP
I20260927 22:51:56.017558 32486 acceptor_pool.cc:254] collecting diagnostics on the listening RPC socket 0.0.0.0:38571 every 8 connection(s)
I20260927 22:51:56.017786 32487 acceptor_pool.cc:254] collecting diagnostics on the listening RPC socket 0.0.0.0:38571 every 8 connection(s)
I20260927 22:51:56.058138 32169 rpc-test.cc:1236] Sleep() min lat: 20707
I20260927 22:51:56.058248 32169 rpc-test.cc:1237] Sleep() mean lat: 20707
I20260927 22:51:56.058303 32169 rpc-test.cc:1238] Sleep() max lat: 20707
I20260927 22:51:56.058337 32169 rpc-test.cc:1239] Sleep() #calls: 1
[       OK ] Parameters/TestRpc.TestRpcHandlerLatencyMetric/SSL_TCP (64 ms)
[ RUN      ] Parameters/TestRpc.TimedOutOnResponseMetricServiceQueue/SSL_TCP
I20260927 22:51:56.103865 32512 acceptor_pool.cc:254] collecting diagnostics on the listening RPC socket 0.0.0.0:46699 every 8 connection(s)
I20260927 22:51:56.104144 32513 acceptor_pool.cc:254] collecting diagnostics on the listening RPC socket 0.0.0.0:46699 every 8 connection(s)
W20260927 22:51:56.188346 32514 rpcz_store.cc:267] Call kudu.rpc_test.CalculatorService.Sleep from 127.0.0.1:58198 (request call id 2) took 20 ms (client timeout 20 ms). Trace:
W20260927 22:51:56.188503 32514 rpcz_store.cc:269] 0927 22:51:56.167763 (+     0us) service_pool.cc:170] Inserting onto call queue
0927 22:51:56.188234 (+ 20471us) service_pool.cc:214] Skipping call since client already timed out
0927 22:51:56.188321 (+    87us) inbound_call.cc:173] Queueing failure response
Metrics: {}
[       OK ] Parameters/TestRpc.TimedOutOnResponseMetricServiceQueue/SSL_TCP (128 ms)
[ RUN      ] Parameters/TestRpc.RpcPendingConnectionsMetric/SSL_TCP
I20260927 22:51:56.198062 32535 acceptor_pool.cc:254] collecting diagnostics on the listening RPC socket 0.0.0.0:41653 every 8 connection(s)
I20260927 22:51:56.198307 32536 acceptor_pool.cc:254] collecting diagnostics on the listening RPC socket 0.0.0.0:41653 every 8 connection(s)
W20260927 22:51:56.200513 32531 negotiation.cc:337] Failed RPC negotiation. Trace:
0927 22:51:56.199735 (+     0us) reactor.cc:625] Submitting negotiation task for server connection from 127.0.0.1:57648 (local address 127.0.0.1:41653)
0927 22:51:56.199917 (+   182us) server_negotiation.cc:206] Beginning negotiation
0927 22:51:56.199921 (+     4us) server_negotiation.cc:399] Waiting for connection header
0927 22:51:56.200058 (+   137us) negotiation.cc:327] Negotiation complete: Network error: Server connection negotiation failed: server connection from 127.0.0.1:57648: BlockingRecv error: recv got EOF from 127.0.0.1:57648 (error 108)
Metrics: {"server-negotiator.queue_time_us":59}
[       OK ] Parameters/TestRpc.RpcPendingConnectionsMetric/SSL_TCP (19 ms)
[ RUN      ] Parameters/TestRpc.TestRpcContextClientDeadline/SSL_TCP
I20260927 22:51:56.223960 32551 acceptor_pool.cc:254] collecting diagnostics on the listening RPC socket 0.0.0.0:46511 every 8 connection(s)
I20260927 22:51:56.224172 32552 acceptor_pool.cc:254] collecting diagnostics on the listening RPC socket 0.0.0.0:46511 every 8 connection(s)
[       OK ] Parameters/TestRpc.TestRpcContextClientDeadline/SSL_TCP (53 ms)
[ RUN      ] Parameters/TestRpc.TestApplicationFeatureFlagUnsupportedServer/SSL_TCP
I20260927 22:51:56.288339 32576 acceptor_pool.cc:254] collecting diagnostics on the listening RPC socket 0.0.0.0:33549 every 8 connection(s)
I20260927 22:51:56.288514 32577 acceptor_pool.cc:254] collecting diagnostics on the listening RPC socket 0.0.0.0:33549 every 8 connection(s)
[       OK ] Parameters/TestRpc.TestApplicationFeatureFlagUnsupportedServer/SSL_TCP (60 ms)
[ RUN      ] Parameters/TestRpc.TestCancellationAsync/SSL_TCP
I20260927 22:51:56.340071 32601 acceptor_pool.cc:254] collecting diagnostics on the listening RPC socket 0.0.0.0:42393 every 8 connection(s)
I20260927 22:51:56.340332 32602 acceptor_pool.cc:254] collecting diagnostics on the listening RPC socket 0.0.0.0:42393 every 8 connection(s)
I20260927 22:51:56.341229 32169 rpc-test.cc:1716] Connecting to 0.0.0.0:42393
I20260927 22:51:56.376223 32169 test_util.cc:268] Using random seed: -874489729
I20260927 22:51:56.410390 32605 rpc-test-base.h:240] got call: sleep_micros: 500 pattern: 4294967295 num_repetitions: 2097152 sidecar_idx: 0
I20260927 22:51:56.430666 32604 rpc-test-base.h:240] got call: sleep_micros: 500 pattern: 4294967295 num_repetitions: 2097152 sidecar_idx: 0
I20260927 22:51:56.463948 32603 rpc-test-base.h:240] got call: sleep_micros: 500 pattern: 4294967295 num_repetitions: 2097152 sidecar_idx: 0
I20260927 22:51:56.503959 32604 rpc-test-base.h:240] got call: sleep_micros: 500 pattern: 4294967295 num_repetitions: 2097152 sidecar_idx: 0
I20260927 22:51:56.526450 32603 rpc-test-base.h:240] got call: sleep_micros: 500 pattern: 4294967295 num_repetitions: 2097152 sidecar_idx: 0
I20260927 22:51:56.551388 32605 rpc-test-base.h:240] got call: sleep_micros: 500 pattern: 4294967295 num_repetitions: 2097152 sidecar_idx: 0
W20260927 22:51:56.574626 32600 connection.cc:196] Error closing socket: Network error: TlsSocket::Close: Broken pipe
W20260927 22:51:56.590202 32600 connection.cc:441] server connection from 127.0.0.1:46228 torn down before Call kudu.rpc.GenericCalculatorService.SleepWithSidecar from 127.0.0.1:46228 (request call id 7) could send its response
W20260927 22:51:56.602767 32600 connection.cc:441] server connection from 127.0.0.1:46228 torn down before Call kudu.rpc.GenericCalculatorService.SleepWithSidecar from 127.0.0.1:46228 (request call id 8) could send its response
[       OK ] Parameters/TestRpc.TestCancellationAsync/SSL_TCP (278 ms)
[ RUN      ] Parameters/TestRpc.TestPerformanceBySocketType/SSL_TCP
I20260927 22:51:56.624917 32626 acceptor_pool.cc:254] collecting diagnostics on the listening RPC socket 0.0.0.0:39727 every 8 connection(s)
I20260927 22:51:56.625182 32627 acceptor_pool.cc:254] collecting diagnostics on the listening RPC socket 0.0.0.0:39727 every 8 connection(s)
I20260927 22:51:56.626224 32169 rpc-test.cc:1846] Connecting to 0.0.0.0:39727
I20260927 22:51:59.598443 32169 rpc-test.cc:1859] Sending 1024MB via ssl-enabled tcp socket: real 2.958s	user 2.698s	sys 2.230s
I20260927 22:52:02.611809 32169 rpc-test.cc:1859] Sending 1024MB via ssl-enabled tcp socket: real 3.013s	user 2.819s	sys 2.192s
I20260927 22:52:05.624069 32169 rpc-test.cc:1859] Sending 1024MB via ssl-enabled tcp socket: real 3.012s	user 2.653s	sys 2.323s
I20260927 22:52:08.697752 32169 rpc-test.cc:1859] Sending 1024MB via ssl-enabled tcp socket: real 3.074s	user 2.914s	sys 2.200s
I20260927 22:52:11.821273 32169 rpc-test.cc:1859] Sending 1024MB via ssl-enabled tcp socket: real 3.123s	user 2.903s	sys 2.352s
[       OK ] Parameters/TestRpc.TestPerformanceBySocketType/SSL_TCP (15223 ms)
[----------] 20 tests from Parameters/TestRpc (49141 ms total)

[----------] 1 test from Parameters/TestRpcSocketTxRxQueue
[ RUN      ] Parameters/TestRpcSocketTxRxQueue.OverCapacity/0
W20260927 22:52:12.133409 32652 negotiation.cc:337] Failed RPC negotiation. Trace:
0927 22:52:11.842066 (+     0us) reactor.cc:625] Submitting negotiation task for client connection to 0.0.0.0:37719 (local address 127.0.0.1:58158)
0927 22:52:11.842290 (+   224us) negotiation.cc:107] Waiting for socket to connect
0927 22:52:11.842313 (+    23us) client_negotiation.cc:174] Beginning negotiation
0927 22:52:11.842429 (+   116us) client_negotiation.cc:252] Sending NEGOTIATE NegotiatePB request
0927 22:52:12.132979 (+290550us) negotiation.cc:327] Negotiation complete: Network error: Client connection negotiation failed: client connection to 0.0.0.0:37719: BlockingRecv error: recv error from unknown peer: Transport endpoint is not connected (error 107)
Metrics: {"client-negotiator.queue_time_us":74}
W20260927 22:52:12.133358 32670 negotiation.cc:337] Failed RPC negotiation. Trace:
0927 22:52:11.848139 (+     0us) reactor.cc:625] Submitting negotiation task for client connection to 0.0.0.0:37719 (local address 127.0.0.1:58184)
0927 22:52:11.848401 (+   262us) negotiation.cc:107] Waiting for socket to connect
0927 22:52:11.848421 (+    20us) client_negotiation.cc:174] Beginning negotiation
0927 22:52:11.848526 (+   105us) client_negotiation.cc:252] Sending NEGOTIATE NegotiatePB request
0927 22:52:12.132979 (+284453us) negotiation.cc:327] Negotiation complete: Network error: Client connection negotiation failed: client connection to 0.0.0.0:37719: BlockingRecv error: recv error from unknown peer: Transport endpoint is not connected (error 107)
Metrics: {"client-negotiator.queue_time_us":32}
W20260927 22:52:12.133368 32643 negotiation.cc:337] Failed RPC negotiation. Trace:
0927 22:52:11.838825 (+     0us) reactor.cc:625] Submitting negotiation task for client connection to 0.0.0.0:37719 (local address 127.0.0.1:58146)
0927 22:52:11.839011 (+   186us) negotiation.cc:107] Waiting for socket to connect
0927 22:52:11.839026 (+    15us) client_negotiation.cc:174] Beginning negotiation
0927 22:52:11.839136 (+   110us) client_negotiation.cc:252] Sending NEGOTIATE NegotiatePB request
0927 22:52:12.133021 (+293885us) negotiation.cc:327] Negotiation complete: Network error: Client connection negotiation failed: client connection to 0.0.0.0:37719: BlockingRecv error: recv error from unknown peer: Transport endpoint is not connected (error 107)
Metrics: {"client-negotiator.queue_time_us":60}
W20260927 22:52:12.133889 32661 negotiation.cc:337] Failed RPC negotiation. Trace:
0927 22:52:11.845300 (+     0us) reactor.cc:625] Submitting negotiation task for client connection to 0.0.0.0:37719 (local address 127.0.0.1:58172)
0927 22:52:11.845529 (+   229us) negotiation.cc:107] Waiting for socket to connect
0927 22:52:11.845547 (+    18us) client_negotiation.cc:174] Beginning negotiation
0927 22:52:11.845685 (+   138us) client_negotiation.cc:252] Sending NEGOTIATE NegotiatePB request
0927 22:52:12.132979 (+287294us) negotiation.cc:327] Negotiation complete: Network error: Client connection negotiation failed: client connection to 0.0.0.0:37719: BlockingRecv error: recv error from unknown peer: Transport endpoint is not connected (error 107)
Metrics: {"client-negotiator.queue_time_us":84}
W20260927 22:52:12.134178 32679 negotiation.cc:337] Failed RPC negotiation. Trace:
0927 22:52:11.850945 (+     0us) reactor.cc:625] Submitting negotiation task for client connection to 0.0.0.0:37719 (local address 127.0.0.1:58196)
0927 22:52:11.851173 (+   228us) negotiation.cc:107] Waiting for socket to connect
0927 22:52:11.851198 (+    25us) client_negotiation.cc:174] Beginning negotiation
0927 22:52:11.851328 (+   130us) client_negotiation.cc:252] Sending NEGOTIATE NegotiatePB request
0927 22:52:12.133550 (+282222us) negotiation.cc:327] Negotiation complete: Network error: Client connection negotiation failed: client connection to 0.0.0.0:37719: BlockingRecv error: recv error from unknown peer: Transport endpoint is not connected (error 107)
Metrics: {"client-negotiator.queue_time_us":56}
W20260927 22:52:12.134418 32688 negotiation.cc:337] Failed RPC negotiation. Trace:
0927 22:52:11.854055 (+     0us) reactor.cc:625] Submitting negotiation task for client connection to 0.0.0.0:37719 (local address 127.0.0.1:58200)
0927 22:52:11.854255 (+   200us) negotiation.cc:107] Waiting for socket to connect
0927 22:52:11.854274 (+    19us) client_negotiation.cc:174] Beginning negotiation
0927 22:52:11.854382 (+   108us) client_negotiation.cc:252] Sending NEGOTIATE NegotiatePB request
0927 22:52:12.133667 (+279285us) negotiation.cc:327] Negotiation complete: Network error: Client connection negotiation failed: client connection to 0.0.0.0:37719: BlockingRecv error: recv error from unknown peer: Transport endpoint is not connected (error 107)
Metrics: {"client-negotiator.queue_time_us":65}
[       OK ] Parameters/TestRpcSocketTxRxQueue.OverCapacity/0 (1079 ms)
[----------] 1 test from Parameters/TestRpcSocketTxRxQueue (1079 ms total)

[----------] Global test environment tear-down
[==========] 21 tests from 2 test suites ran. (50221 ms total)
[  PASSED  ] 20 tests.
[  FAILED  ] 1 test, listed below:
[  FAILED  ] Parameters/TestRpc.TestCallWithChainCertAndChainCA/SSL_TCP, where GetParam() = (true, false)

 1 FAILED TEST