Parameters/TestRpc.TestCallWithChainCertAndRootCA/SSL_TCP: /data0/somelongdirectorytoavoidrpathissues/src/kudu/src/kudu/rpc/rpc-test.cc:303: Failure
Failed
Bad status: Runtime error: could not verify certificate chain (error with cert: subject=CN = localhost, ST = sadfjas, C = AS, emailAddress = sdflkdsajf, O = lskdfjlsad, OU = sldfkja, issuer=C = AS, ST = ASDfkjdhf, L = lskdjf, O = saldfja, OU = skdjf, CN = localhost, emailAddress = sadjflkadsj): : certificate has expired
Google Test trace:
/data0/somelongdirectorytoavoidrpathissues/src/kudu/src/kudu/rpc/rpc-test.cc:300: Connecting to 0.0.0.0:38875
I20260924 00:22:14.770188 5078 test_util.cc:175] -----------------------------------------------
I20260924 00:22:14.770392 5078 test_util.cc:176] Had fatal failures, leaving test files at /tmp/dist-test-taskWHF_MG/test-tmp/rpc-test.1.Parameters_TestRpc.TestCallWithChainCertAndRootCA_SSL_TCP.1790209333239709-5078-0
Note: This is test shard 2 of 8.
[==========] Running 21 tests from 2 test suites.
[----------] Global test environment set-up.
[----------] 1 test from TestRpc
[ RUN ] TestRpc.TestMethodsByName
[ OK ] TestRpc.TestMethodsByName (6 ms)
[----------] 1 test from TestRpc (6 ms total)
[----------] 20 tests from Parameters/TestRpc
[ RUN ] Parameters/TestRpc.TestAcceptorPoolStartStop/SSL_TCP
WARNING: Logging before InitGoogleLogging() is written to STDERR
I20260924 00:22:13.356467 5093 acceptor_pool.cc:254] collecting diagnostics on the listening RPC socket 0.0.0.0:43905 every 8 connection(s)
W20260924 00:22:14.358727 5078 thread.cc:536] Waited for 1000ms trying to join with acceptor (tid 5094)
I20260924 00:22:13.358139 5094 acceptor_pool.cc:254] collecting diagnostics on the listening RPC socket 0.0.0.0:43905 every 8 connection(s)
I20260924 00:22:14.512961 5105 acceptor_pool.cc:254] collecting diagnostics on the listening RPC socket 0.0.0.0:35389 every 8 connection(s)
I20260924 00:22:14.514499 5106 acceptor_pool.cc:254] collecting diagnostics on the listening RPC socket 0.0.0.0:35389 every 8 connection(s)
I20260924 00:22:14.535897 5116 acceptor_pool.cc:254] collecting diagnostics on the listening RPC socket 0.0.0.0:36429 every 8 connection(s)
I20260924 00:22:14.537322 5117 acceptor_pool.cc:254] collecting diagnostics on the listening RPC socket 0.0.0.0:36429 every 8 connection(s)
I20260924 00:22:14.558111 5127 acceptor_pool.cc:254] collecting diagnostics on the listening RPC socket 0.0.0.0:38427 every 8 connection(s)
I20260924 00:22:14.558825 5128 acceptor_pool.cc:254] collecting diagnostics on the listening RPC socket 0.0.0.0:38427 every 8 connection(s)
I20260924 00:22:14.590987 5138 acceptor_pool.cc:254] collecting diagnostics on the listening RPC socket 0.0.0.0:42325 every 8 connection(s)
I20260924 00:22:14.591710 5139 acceptor_pool.cc:254] collecting diagnostics on the listening RPC socket 0.0.0.0:42325 every 8 connection(s)
[ OK ] Parameters/TestRpc.TestAcceptorPoolStartStop/SSL_TCP (1296 ms)
[ RUN ] Parameters/TestRpc.TestCall/SSL_TCP
I20260924 00:22:14.623405 5151 acceptor_pool.cc:254] collecting diagnostics on the listening RPC socket 0.0.0.0:34493 every 8 connection(s)
I20260924 00:22:14.625476 5152 acceptor_pool.cc:254] collecting diagnostics on the listening RPC socket 0.0.0.0:34493 every 8 connection(s)
I20260924 00:22:14.630793 5078 rpc-test.cc:234] Connecting to 0.0.0.0:34493
[ OK ] Parameters/TestRpc.TestCall/SSL_TCP (132 ms)
[ RUN ] Parameters/TestRpc.TestCallWithChainCertAndRootCA/SSL_TCP
I20260924 00:22:14.750133 5176 acceptor_pool.cc:254] collecting diagnostics on the listening RPC socket 0.0.0.0:38875 every 8 connection(s)
I20260924 00:22:14.750872 5177 acceptor_pool.cc:254] collecting diagnostics on the listening RPC socket 0.0.0.0:38875 every 8 connection(s)
/data0/somelongdirectorytoavoidrpathissues/src/kudu/src/kudu/rpc/rpc-test.cc:303: Failure
Failed
Bad status: Runtime error: could not verify certificate chain (error with cert: subject=CN = localhost, ST = sadfjas, C = AS, emailAddress = sdflkdsajf, O = lskdfjlsad, OU = sldfkja, issuer=C = AS, ST = ASDfkjdhf, L = lskdjf, O = saldfja, OU = skdjf, CN = localhost, emailAddress = sadjflkadsj): : certificate has expired
Google Test trace:
/data0/somelongdirectorytoavoidrpathissues/src/kudu/src/kudu/rpc/rpc-test.cc:300: Connecting to 0.0.0.0:38875
I20260924 00:22:14.770188 5078 test_util.cc:175] -----------------------------------------------
I20260924 00:22:14.770392 5078 test_util.cc:176] Had fatal failures, leaving test files at /tmp/dist-test-taskWHF_MG/test-tmp/rpc-test.1.Parameters_TestRpc.TestCallWithChainCertAndRootCA_SSL_TCP.1790209333239709-5078-0
[ FAILED ] Parameters/TestRpc.TestCallWithChainCertAndRootCA/SSL_TCP, where GetParam() = (true, false) (41 ms)
[ RUN ] Parameters/TestRpc.TestCallWithBadPasswordProtectedKey/SSL_TCP
[ OK ] Parameters/TestRpc.TestCallWithBadPasswordProtectedKey/SSL_TCP (29 ms)
[ RUN ] Parameters/TestRpc.TestInvalidMethodCall/SSL_TCP
I20260924 00:22:14.823249 5213 acceptor_pool.cc:254] collecting diagnostics on the listening RPC socket 0.0.0.0:37771 every 8 connection(s)
I20260924 00:22:14.824064 5214 acceptor_pool.cc:254] collecting diagnostics on the listening RPC socket 0.0.0.0:37771 every 8 connection(s)
I20260924 00:22:14.827385 5078 rpc-test.cc:406] Connecting to 0.0.0.0:37771
[ OK ] Parameters/TestRpc.TestInvalidMethodCall/SSL_TCP (66 ms)
[ RUN ] Parameters/TestRpc.TestHighFDs/SSL_TCP
I20260924 00:22:15.072860 5238 acceptor_pool.cc:254] collecting diagnostics on the listening RPC socket 0.0.0.0:37489 every 8 connection(s)
I20260924 00:22:15.073621 5239 acceptor_pool.cc:254] collecting diagnostics on the listening RPC socket 0.0.0.0:37489 every 8 connection(s)
[ OK ] Parameters/TestRpc.TestHighFDs/SSL_TCP (256 ms)
[ RUN ] Parameters/TestRpc.TestConnectionAlwaysKeepalive/SSL_TCP
I20260924 00:22:15.140770 5261 acceptor_pool.cc:254] collecting diagnostics on the listening RPC socket 0.0.0.0:40247 every 8 connection(s)
I20260924 00:22:15.141459 5262 acceptor_pool.cc:254] collecting diagnostics on the listening RPC socket 0.0.0.0:40247 every 8 connection(s)
I20260924 00:22:15.144743 5078 rpc-test.cc:532] Connecting to 0.0.0.0:40247
[ OK ] Parameters/TestRpc.TestConnectionAlwaysKeepalive/SSL_TCP (3059 ms)
[ RUN ] Parameters/TestRpc.TestReopenOutboundConnections/SSL_TCP
I20260924 00:22:18.205854 5284 acceptor_pool.cc:254] collecting diagnostics on the listening RPC socket 0.0.0.0:41895 every 8 connection(s)
I20260924 00:22:18.206565 5285 acceptor_pool.cc:254] collecting diagnostics on the listening RPC socket 0.0.0.0:41895 every 8 connection(s)
I20260924 00:22:18.209613 5078 rpc-test.cc:658] Connecting to 0.0.0.0:41895
[ OK ] Parameters/TestRpc.TestReopenOutboundConnections/SSL_TCP (385 ms)
[ RUN ] Parameters/TestRpc.TestConnectionNetworkPlane/SSL_TCP
I20260924 00:22:18.592370 5307 acceptor_pool.cc:254] collecting diagnostics on the listening RPC socket 0.0.0.0:39835 every 8 connection(s)
I20260924 00:22:18.593128 5308 acceptor_pool.cc:254] collecting diagnostics on the listening RPC socket 0.0.0.0:39835 every 8 connection(s)
I20260924 00:22:18.596228 5078 rpc-test.cc:772] Connecting to 0.0.0.0:39835
[ OK ] Parameters/TestRpc.TestConnectionNetworkPlane/SSL_TCP (73 ms)
[ RUN ] Parameters/TestRpc.TestTCPKeepalive/SSL_TCP
I20260924 00:22:18.680413 5332 acceptor_pool.cc:254] collecting diagnostics on the listening RPC socket 0.0.0.0:34021 every 8 connection(s)
I20260924 00:22:18.681169 5333 acceptor_pool.cc:254] collecting diagnostics on the listening RPC socket 0.0.0.0:34021 every 8 connection(s)
I20260924 00:22:18.704948 5336 rpc-test-base.h:222] got call: sleep_micros: 8000000 deferred: true
I20260924 00:22:26.708956 5336 rpcz_store.cc:275] Call kudu.rpc.GenericCalculatorService.Sleep from 127.0.0.1:34452 (request call id 0) took 8004 ms. Trace:
I20260924 00:22:26.709403 5336 rpcz_store.cc:276] 0924 00:22:18.704696 (+ 0us) service_pool.cc:170] Inserting onto call queue
0924 00:22:18.704799 (+ 103us) service_pool.cc:227] Handling call
0924 00:22:26.708763 (+8003964us) inbound_call.cc:173] Queueing success response
Metrics: {}
[ OK ] Parameters/TestRpc.TestTCPKeepalive/SSL_TCP (8080 ms)
[ RUN ] Parameters/TestRpc.TestMaxSmallSidecars/SSL_TCP
I20260924 00:22:26.746596 5358 acceptor_pool.cc:254] collecting diagnostics on the listening RPC socket 0.0.0.0:35381 every 8 connection(s)
I20260924 00:22:26.747429 5359 acceptor_pool.cc:254] collecting diagnostics on the listening RPC socket 0.0.0.0:35381 every 8 connection(s)
[ OK ] Parameters/TestRpc.TestMaxSmallSidecars/SSL_TCP (207 ms)
[ RUN ] Parameters/TestRpc.TestCallTimeout/SSL_TCP
I20260924 00:22:26.948943 5383 acceptor_pool.cc:254] collecting diagnostics on the listening RPC socket 0.0.0.0:43669 every 8 connection(s)
I20260924 00:22:26.949689 5384 acceptor_pool.cc:254] collecting diagnostics on the listening RPC socket 0.0.0.0:43669 every 8 connection(s)
I20260924 00:22:26.979091 5078 rpc-test-base.h:595] status: Timed out: connection negotiation to 0.0.0.0:43669 for RPC Sleep timed out after 0.000s (ON_OUTBOUND_QUEUE), seconds elapsed: 0.00250604
I20260924 00:22:26.986328 5387 rpc-test-base.h:222] got call: sleep_micros: 700000
I20260924 00:22:27.179945 5078 rpc-test-base.h:595] status: Timed out: Sleep RPC to 0.0.0.0:43669 timed out after 0.200s (SENT), seconds elapsed: 0.200484
I20260924 00:22:27.181576 5386 rpc-test-base.h:222] got call: sleep_micros: 2000000
W20260924 00:22:27.686949 5387 rpcz_store.cc:267] Call kudu.rpc.GenericCalculatorService.Sleep from 127.0.0.1:39074 (request call id 1) took 700 ms (client timeout 200 ms). Trace:
W20260924 00:22:27.687253 5387 rpcz_store.cc:269] 0924 00:22:26.986152 (+ 0us) service_pool.cc:170] Inserting onto call queue
0924 00:22:26.986254 (+ 102us) service_pool.cc:227] Handling call
0924 00:22:27.686884 (+700630us) inbound_call.cc:173] Queueing success response
Metrics: {}
I20260924 00:22:28.682498 5078 rpc-test-base.h:595] status: Timed out: Sleep RPC to 0.0.0.0:43669 timed out after 1.500s (SENT), seconds elapsed: 1.50213
W20260924 00:22:29.182087 5386 rpcz_store.cc:267] Call kudu.rpc.GenericCalculatorService.Sleep from 127.0.0.1:39074 (request call id 2) took 2000 ms (client timeout 1500 ms). Trace:
W20260924 00:22:29.182382 5386 rpcz_store.cc:269] 0924 00:22:27.181275 (+ 0us) service_pool.cc:170] Inserting onto call queue
0924 00:22:27.181400 (+ 125us) service_pool.cc:227] Handling call
0924 00:22:29.182033 (+2000633us) inbound_call.cc:173] Queueing success response
Metrics: {}
W20260924 00:22:29.182910 5380 connection.cc:441] server connection from 127.0.0.1:39074 torn down before Call kudu.rpc.GenericCalculatorService.Sleep from 127.0.0.1:39074 (request call id 2) could send its response
[ OK ] Parameters/TestRpc.TestCallTimeout/SSL_TCP (2256 ms)
[ RUN ] Parameters/TestRpc.TestServerShutsDown/SSL_TCP
I20260924 00:22:29.189993 5078 rpc-test.cc:1125] Connecting to 0.0.0.0:44339
W20260924 00:22:29.199659 5400 negotiation.cc:337] Failed RPC negotiation. Trace:
0924 00:22:29.197996 (+ 0us) reactor.cc:625] Submitting negotiation task for client connection to 0.0.0.0:44339 (local address 127.0.0.1:42654)
0924 00:22:29.198495 (+ 499us) negotiation.cc:107] Waiting for socket to connect
0924 00:22:29.198534 (+ 39us) client_negotiation.cc:174] Beginning negotiation
0924 00:22:29.198803 (+ 269us) client_negotiation.cc:252] Sending NEGOTIATE NegotiatePB request
0924 00:22:29.199033 (+ 230us) negotiation.cc:327] Negotiation complete: Network error: Client connection negotiation failed: client connection to 0.0.0.0:44339: BlockingWrite error: write error: Broken pipe (error 32)
Metrics: {"client-negotiator.queue_time_us":131}
[ OK ] Parameters/TestRpc.TestServerShutsDown/SSL_TCP (14 ms)
[ RUN ] Parameters/TestRpc.TimedOutOnResponseMetric/SSL_TCP
I20260924 00:22:29.228814 5417 acceptor_pool.cc:254] collecting diagnostics on the listening RPC socket 0.0.0.0:43589 every 8 connection(s)
I20260924 00:22:29.229580 5418 acceptor_pool.cc:254] collecting diagnostics on the listening RPC socket 0.0.0.0:43589 every 8 connection(s)
W20260924 00:22:29.464519 5421 rpcz_store.cc:267] Call kudu.rpc_test.CalculatorService.Sleep from 127.0.0.1:40326 (request call id 3) took 50 ms (client timeout 25 ms). Trace:
W20260924 00:22:29.464808 5421 rpcz_store.cc:269] 0924 00:22:29.413859 (+ 0us) service_pool.cc:170] Inserting onto call queue
0924 00:22:29.413992 (+ 133us) service_pool.cc:227] Handling call
0924 00:22:29.464449 (+ 50457us) inbound_call.cc:173] Queueing success response
Related trace 'test_child':
Metrics: {"test_sleep_us":50000,"child_traces":[["test_child",{"related_trace_metric":1}]]}
W20260924 00:22:29.523665 5421 rpcz_store.cc:267] Call kudu.rpc_test.CalculatorService.Sleep from 127.0.0.1:40326 (request call id 4) took 50 ms (client timeout 50 ms). Trace:
W20260924 00:22:29.523933 5421 rpcz_store.cc:269] 0924 00:22:29.473150 (+ 0us) service_pool.cc:170] Inserting onto call queue
0924 00:22:29.473264 (+ 114us) service_pool.cc:227] Handling call
0924 00:22:29.523610 (+ 50346us) inbound_call.cc:173] Queueing success response
Related trace 'test_child':
Metrics: {"test_sleep_us":50000,"child_traces":[["test_child",{"related_trace_metric":1}]]}
[ OK ] Parameters/TestRpc.TimedOutOnResponseMetric/SSL_TCP (329 ms)
[ RUN ] Parameters/TestRpc.AcceptorDispatchingTimesMetric/SSL_TCP
I20260924 00:22:29.543766 5442 acceptor_pool.cc:254] collecting diagnostics on the listening RPC socket 0.0.0.0:40715 every 8 connection(s)
I20260924 00:22:29.544507 5443 acceptor_pool.cc:254] collecting diagnostics on the listening RPC socket 0.0.0.0:40715 every 8 connection(s)
W20260924 00:22:29.550041 5438 negotiation.cc:337] Failed RPC negotiation. Trace:
0924 00:22:29.548031 (+ 0us) reactor.cc:625] Submitting negotiation task for server connection from 127.0.0.1:57836 (local address 127.0.0.1:40715)
0924 00:22:29.548566 (+ 535us) server_negotiation.cc:206] Beginning negotiation
0924 00:22:29.548584 (+ 18us) server_negotiation.cc:399] Waiting for connection header
0924 00:22:29.548951 (+ 367us) negotiation.cc:327] Negotiation complete: Network error: Server connection negotiation failed: server connection from 127.0.0.1:57836: BlockingRecv error: recv got EOF from 127.0.0.1:57836 (error 108)
Metrics: {"server-negotiator.queue_time_us":111}
[ OK ] Parameters/TestRpc.AcceptorDispatchingTimesMetric/SSL_TCP (20 ms)
[ RUN ] Parameters/TestRpc.TestRpcCallbackDestroysMessenger/SSL_TCP
[ OK ] Parameters/TestRpc.TestRpcCallbackDestroysMessenger/SSL_TCP (23 ms)
[ RUN ] Parameters/TestRpc.TestApplicationFeatureFlag/SSL_TCP
I20260924 00:22:29.619901 5467 acceptor_pool.cc:254] collecting diagnostics on the listening RPC socket 0.0.0.0:34089 every 8 connection(s)
I20260924 00:22:29.620628 5468 acceptor_pool.cc:254] collecting diagnostics on the listening RPC socket 0.0.0.0:34089 every 8 connection(s)
W20260924 00:22:29.645790 5464 messenger.cc:357] Unable to handle RPC call: Not implemented: call requires unsupported application feature flags: 99
[ OK ] Parameters/TestRpc.TestApplicationFeatureFlag/SSL_TCP (76 ms)
[ RUN ] Parameters/TestRpc.TestCancellation/SSL_TCP
I20260924 00:22:29.698913 5492 acceptor_pool.cc:254] collecting diagnostics on the listening RPC socket 0.0.0.0:46307 every 8 connection(s)
I20260924 00:22:29.699622 5493 acceptor_pool.cc:254] collecting diagnostics on the listening RPC socket 0.0.0.0:46307 every 8 connection(s)
I20260924 00:22:29.702669 5078 rpc-test.cc:1648] Connecting to 0.0.0.0:46307
I20260924 00:22:29.804365 5078 rpc-test-base.h:595] status: Aborted: Sleep RPC to 0.0.0.0:46307 is cancelled in state READY, seconds elapsed: 0.000354536
I20260924 00:22:29.944476 5078 rpc-test-base.h:595] status: Aborted: Sleep RPC to 0.0.0.0:46307 is cancelled in state SENT, seconds elapsed: 0.000845554
I20260924 00:22:29.990396 5495 rpc-test-base.h:222] got call: sleep_micros: 510000
I20260924 00:22:30.116264 5078 rpc-test-base.h:595] status: Aborted: Sleep RPC to 0.0.0.0:46307 is cancelled in state SENT, seconds elapsed: 0.000836874
I20260924 00:22:30.156780 5494 rpc-test-base.h:222] got call: sleep_micros: 510000
I20260924 00:22:30.274214 5078 rpc-test-base.h:595] status: Aborted: Sleep RPC to 0.0.0.0:46307 is cancelled in state SENT, seconds elapsed: 0.000810387
W20260924 00:22:30.312863 5496 rpcz_store.cc:267] Call kudu.rpc.GenericCalculatorService.Sleep from 127.0.0.1:42874 (request call id 11) took 15 ms (client timeout 10 ms). Trace:
W20260924 00:22:30.313155 5496 rpcz_store.cc:269] 0924 00:22:30.297763 (+ 0us) service_pool.cc:170] Inserting onto call queue
0924 00:22:30.312569 (+ 14806us) service_pool.cc:214] Skipping call since client already timed out
0924 00:22:30.312686 (+ 117us) inbound_call.cc:173] Queueing failure response
Metrics: {}
I20260924 00:22:30.313711 5496 rpc-test-base.h:222] got call: sleep_micros: 1500000
W20260924 00:22:30.501154 5495 rpcz_store.cc:267] Call kudu.rpc.GenericCalculatorService.Sleep from 127.0.0.1:42874 (request call id 3) took 510 ms (client timeout 10 ms). Trace:
W20260924 00:22:30.501467 5495 rpcz_store.cc:269] 0924 00:22:29.990221 (+ 0us) service_pool.cc:170] Inserting onto call queue
0924 00:22:29.990320 (+ 99us) service_pool.cc:227] Handling call
0924 00:22:30.501101 (+510781us) inbound_call.cc:173] Queueing success response
Metrics: {}
W20260924 00:22:30.667414 5494 rpcz_store.cc:267] Call kudu.rpc.GenericCalculatorService.Sleep from 127.0.0.1:42874 (request call id 7) took 510 ms (client timeout 10 ms). Trace:
W20260924 00:22:30.667718 5494 rpcz_store.cc:269] 0924 00:22:30.156557 (+ 0us) service_pool.cc:170] Inserting onto call queue
0924 00:22:30.156707 (+ 150us) service_pool.cc:227] Handling call
0924 00:22:30.667361 (+510654us) inbound_call.cc:173] Queueing success response
Metrics: {}
I20260924 00:22:31.276479 5078 rpc-test-base.h:595] status: Timed out: Sleep RPC to 0.0.0.0:46307 timed out after 1.000s (SENT), seconds elapsed: 1.00188
I20260924 00:22:31.277736 5494 rpc-test-base.h:222] got call: sleep_micros: 1500000
W20260924 00:22:31.814205 5496 rpcz_store.cc:267] Call kudu.rpc.GenericCalculatorService.Sleep from 127.0.0.1:42874 (request call id 12) took 1516 ms (client timeout 1000 ms). Trace:
W20260924 00:22:31.814551 5496 rpcz_store.cc:269] 0924 00:22:30.298137 (+ 0us) service_pool.cc:170] Inserting onto call queue
0924 00:22:30.313682 (+ 15545us) service_pool.cc:227] Handling call
0924 00:22:31.814155 (+1500473us) inbound_call.cc:173] Queueing success response
Metrics: {}
I20260924 00:22:32.278821 5078 rpc-test-base.h:595] status: Timed out: Sleep RPC to 0.0.0.0:46307 timed out after 1.000s (SENT), seconds elapsed: 1.00204
W20260924 00:22:32.280237 5490 messenger.cc:357] Unable to handle RPC call: Not implemented: call requires unsupported application feature flags: 99, 1
W20260924 00:22:32.281642 5490 messenger.cc:357] Unable to handle RPC call: Not implemented: call requires unsupported application feature flags: 99, 1
W20260924 00:22:32.778258 5494 rpcz_store.cc:267] Call kudu.rpc.GenericCalculatorService.Sleep from 127.0.0.1:42874 (request call id 13) took 1500 ms (client timeout 1000 ms). Trace:
W20260924 00:22:32.778599 5494 rpcz_store.cc:269] 0924 00:22:31.277579 (+ 0us) service_pool.cc:170] Inserting onto call queue
0924 00:22:31.277691 (+ 112us) service_pool.cc:227] Handling call
0924 00:22:32.778202 (+1500511us) inbound_call.cc:173] Queueing success response
Metrics: {}
W20260924 00:22:32.779181 5490 connection.cc:441] server connection from 127.0.0.1:42874 torn down before Call kudu.rpc.GenericCalculatorService.Sleep from 127.0.0.1:42874 (request call id 13) could send its response
[ OK ] Parameters/TestRpc.TestCancellation/SSL_TCP (3131 ms)
[ RUN ] Parameters/TestRpc.TestCancellationMultiThreads/SSL_TCP
I20260924 00:22:32.819129 5517 acceptor_pool.cc:254] collecting diagnostics on the listening RPC socket 0.0.0.0:37689 every 8 connection(s)
I20260924 00:22:32.819912 5518 acceptor_pool.cc:254] collecting diagnostics on the listening RPC socket 0.0.0.0:37689 every 8 connection(s)
I20260924 00:22:32.822896 5078 rpc-test.cc:1808] Connecting to 0.0.0.0:37689
I20260924 00:22:32.970361 5531 test_util.cc:268] Using random seed: -1735479202
I20260924 00:22:32.971928 5532 test_util.cc:268] Using random seed: -1735477638
I20260924 00:22:32.973264 5533 test_util.cc:268] Using random seed: -1735476300
I20260924 00:22:32.974597 5534 test_util.cc:268] Using random seed: -1735474977
I20260924 00:22:32.976176 5535 test_util.cc:268] Using random seed: -1735473505
I20260924 00:22:32.977478 5536 test_util.cc:268] Using random seed: -1735472177
I20260924 00:22:32.978814 5537 test_util.cc:268] Using random seed: -1735470843
I20260924 00:22:32.980486 5538 test_util.cc:268] Using random seed: -1735469180
I20260924 00:22:32.981786 5539 test_util.cc:268] Using random seed: -1735467873
I20260924 00:22:32.983161 5540 test_util.cc:268] Using random seed: -1735466526
I20260924 00:22:32.984504 5541 test_util.cc:268] Using random seed: -1735465182
I20260924 00:22:32.986014 5542 test_util.cc:268] Using random seed: -1735463636
I20260924 00:22:32.987593 5543 test_util.cc:268] Using random seed: -1735462116
I20260924 00:22:32.988926 5544 test_util.cc:268] Using random seed: -1735460762
I20260924 00:22:32.991321 5545 test_util.cc:268] Using random seed: -1735459009
I20260924 00:22:32.993064 5546 test_util.cc:268] Using random seed: -1735456682
I20260924 00:22:32.995055 5547 test_util.cc:268] Using random seed: -1735454770
I20260924 00:22:32.996863 5548 test_util.cc:268] Using random seed: -1735452921
I20260924 00:22:32.998642 5549 test_util.cc:268] Using random seed: -1735451105
I20260924 00:22:33.000429 5550 test_util.cc:268] Using random seed: -1735449289
I20260924 00:22:33.009413 5551 test_util.cc:268] Using random seed: -1735440288
I20260924 00:22:33.011236 5552 test_util.cc:268] Using random seed: -1735438541
I20260924 00:22:33.014290 5553 test_util.cc:268] Using random seed: -1735435407
I20260924 00:22:33.016390 5554 test_util.cc:268] Using random seed: -1735433356
I20260924 00:22:33.020916 5555 test_util.cc:268] Using random seed: -1735428823
I20260924 00:22:33.023420 5556 test_util.cc:268] Using random seed: -1735426293
I20260924 00:22:33.025007 5557 test_util.cc:268] Using random seed: -1735424721
I20260924 00:22:33.026547 5558 test_util.cc:268] Using random seed: -1735423173
I20260924 00:22:33.028164 5559 test_util.cc:268] Using random seed: -1735421548
I20260924 00:22:33.029784 5560 test_util.cc:268] Using random seed: -1735419927
[ OK ] Parameters/TestRpc.TestCancellationMultiThreads/SSL_TCP (17420 ms)
[ RUN ] Parameters/TestRpc.TestCallId/SSL_TCP
I20260924 00:22:50.246022 5574 acceptor_pool.cc:254] collecting diagnostics on the listening RPC socket 0.0.0.0:34111 every 8 connection(s)
I20260924 00:22:50.246800 5575 acceptor_pool.cc:254] collecting diagnostics on the listening RPC socket 0.0.0.0:34111 every 8 connection(s)
[ OK ] Parameters/TestRpc.TestCallId/SSL_TCP (106 ms)
[----------] 20 tests from Parameters/TestRpc (37013 ms total)
[----------] Global test environment tear-down
[==========] 21 tests from 2 test suites ran. (37021 ms total)
[ PASSED ] 20 tests.
[ FAILED ] 1 test, listed below:
[ FAILED ] Parameters/TestRpc.TestCallWithChainCertAndRootCA/SSL_TCP, where GetParam() = (true, false)
1 FAILED TEST