Diagnosed failure

Parameters/TestRpc.TestCallWithChainCertAndChainCA/SSL_TCP: /data0/somelongdirectorytoavoidrpathissues/src/kudu/src/kudu/rpc/rpc-test.cc:270: Failure
Failed
Bad status: Runtime error: could not verify certificate chain (error with cert: subject=CN = localhost, ST = sadfjas, C = AS, emailAddress = sdflkdsajf, O = lskdfjlsad, OU = sldfkja, issuer=C = AS, ST = ASDfkjdhf, L = lskdjf, O = saldfja, OU = skdjf, CN = localhost, emailAddress = sadjflkadsj): : certificate has expired
Google Test trace:
/data0/somelongdirectorytoavoidrpathissues/src/kudu/src/kudu/rpc/rpc-test.cc:267: Connecting to 0.0.0.0:39543
I20260927 01:30:13.422513  5812 test_util.cc:175] -----------------------------------------------
I20260927 01:30:13.422576  5812 test_util.cc:176] Had fatal failures, leaving test files at /tmp/dist-test-taskH71D7F/test-tmp/rpc-test.5.Parameters_TestRpc.TestCallWithChainCertAndChainCA_SSL_TCP.1790472613338414-5812-0

Full log

Note: This is test shard 6 of 8.
[==========] Running 21 tests from 2 test suites.
[----------] Global test environment set-up.
[----------] 20 tests from Parameters/TestRpc
[ RUN      ] Parameters/TestRpc.TestMessengerCreateDestroy/SSL_TCP
WARNING: Logging before InitGoogleLogging() is written to STDERR
I20260927 01:30:13.370883  5812 rpc-test.cc:169] started messenger TestCreateDestroy
[       OK ] Parameters/TestRpc.TestMessengerCreateDestroy/SSL_TCP (27 ms)
[ RUN      ] Parameters/TestRpc.TestNegotiationDeadlock/SSL_TCP
I20260927 01:30:13.379092  5832 acceptor_pool.cc:254] collecting diagnostics on the listening RPC socket 0.0.0.0:42535 every 8 connection(s)
I20260927 01:30:13.379091  5833 acceptor_pool.cc:254] collecting diagnostics on the listening RPC socket 0.0.0.0:42535 every 8 connection(s)
[       OK ] Parameters/TestRpc.TestNegotiationDeadlock/SSL_TCP (17 ms)
[ RUN      ] Parameters/TestRpc.TestCallWithChainCertAndChainCA/SSL_TCP
I20260927 01:30:13.417286  5849 acceptor_pool.cc:254] collecting diagnostics on the listening RPC socket 0.0.0.0:39543 every 8 connection(s)
I20260927 01:30:13.417248  5848 acceptor_pool.cc:254] collecting diagnostics on the listening RPC socket 0.0.0.0:39543 every 8 connection(s)
/data0/somelongdirectorytoavoidrpathissues/src/kudu/src/kudu/rpc/rpc-test.cc:270: Failure
Failed
Bad status: Runtime error: could not verify certificate chain (error with cert: subject=CN = localhost, ST = sadfjas, C = AS, emailAddress = sdflkdsajf, O = lskdfjlsad, OU = sldfkja, issuer=C = AS, ST = ASDfkjdhf, L = lskdjf, O = saldfja, OU = skdjf, CN = localhost, emailAddress = sadjflkadsj): : certificate has expired
Google Test trace:
/data0/somelongdirectorytoavoidrpathissues/src/kudu/src/kudu/rpc/rpc-test.cc:267: Connecting to 0.0.0.0:39543
I20260927 01:30:13.422513  5812 test_util.cc:175] -----------------------------------------------
I20260927 01:30:13.422576  5812 test_util.cc:176] Had fatal failures, leaving test files at /tmp/dist-test-taskH71D7F/test-tmp/rpc-test.5.Parameters_TestRpc.TestCallWithChainCertAndChainCA_SSL_TCP.1790472613338414-5812-0
[  FAILED  ] Parameters/TestRpc.TestCallWithChainCertAndChainCA/SSL_TCP, where GetParam() = (true, false) (31 ms)
[ RUN      ] Parameters/TestRpc.TestCallWithPasswordProtectedKey/SSL_TCP
I20260927 01:30:13.444857  5874 acceptor_pool.cc:254] collecting diagnostics on the listening RPC socket 0.0.0.0:37683 every 8 connection(s)
I20260927 01:30:13.445003  5873 acceptor_pool.cc:254] collecting diagnostics on the listening RPC socket 0.0.0.0:37683 every 8 connection(s)
[       OK ] Parameters/TestRpc.TestCallWithPasswordProtectedKey/SSL_TCP (38 ms)
[ RUN      ] Parameters/TestRpc.TestCallToBadServer/SSL_TCP
I20260927 01:30:13.468616  5812 rpc-test.cc:394] Status: Network error: Client connection negotiation failed: client connection to 0.0.0.0:0: connect: Connection refused (error 111)
I20260927 01:30:13.469049  5812 rpc-test.cc:394] Status: Network error: Client connection negotiation failed: client connection to 0.0.0.0:0: connect: Connection refused (error 111)
I20260927 01:30:13.469444  5812 rpc-test.cc:394] Status: Network error: Client connection negotiation failed: client connection to 0.0.0.0:0: connect: Connection refused (error 111)
I20260927 01:30:13.469885  5812 rpc-test.cc:394] Status: Network error: Client connection negotiation failed: client connection to 0.0.0.0:0: connect: Connection refused (error 111)
I20260927 01:30:13.470376  5812 rpc-test.cc:394] Status: Network error: Client connection negotiation failed: client connection to 0.0.0.0:0: connect: Connection refused (error 111)
[       OK ] Parameters/TestRpc.TestCallToBadServer/SSL_TCP (9 ms)
[ RUN      ] Parameters/TestRpc.TestWrongService/SSL_TCP
I20260927 01:30:13.487084  5908 acceptor_pool.cc:254] collecting diagnostics on the listening RPC socket 0.0.0.0:43135 every 8 connection(s)
I20260927 01:30:13.487113  5909 acceptor_pool.cc:254] collecting diagnostics on the listening RPC socket 0.0.0.0:43135 every 8 connection(s)
I20260927 01:30:13.505172  5906 messenger.cc:345] service WrongServiceName not registered on TestServer
[       OK ] Parameters/TestRpc.TestWrongService/SSL_TCP (36 ms)
[ RUN      ] Parameters/TestRpc.TestConnectionKeepalive/SSL_TCP
I20260927 01:30:13.517513  5932 acceptor_pool.cc:254] collecting diagnostics on the listening RPC socket 0.0.0.0:33897 every 8 connection(s)
I20260927 01:30:13.517645  5931 acceptor_pool.cc:254] collecting diagnostics on the listening RPC socket 0.0.0.0:33897 every 8 connection(s)
I20260927 01:30:13.517792  5812 rpc-test.cc:488] Connecting to 0.0.0.0:33897
[       OK ] Parameters/TestRpc.TestConnectionKeepalive/SSL_TCP (1049 ms)
[ RUN      ] Parameters/TestRpc.TestClientConnectionMetrics/SSL_TCP
I20260927 01:30:14.598841  5956 acceptor_pool.cc:254] collecting diagnostics on the listening RPC socket 0.0.0.0:41131 every 8 connection(s)
I20260927 01:30:14.598853  5957 acceptor_pool.cc:254] collecting diagnostics on the listening RPC socket 0.0.0.0:41131 every 8 connection(s)
I20260927 01:30:14.599184  5812 rpc-test.cc:569] Connecting to 0.0.0.0:41131
[       OK ] Parameters/TestRpc.TestClientConnectionMetrics/SSL_TCP (14341 ms)
[ RUN      ] Parameters/TestRpc.TestCredentialsPolicy/SSL_TCP
I20260927 01:30:28.908458  5979 acceptor_pool.cc:254] collecting diagnostics on the listening RPC socket 0.0.0.0:41515 every 8 connection(s)
I20260927 01:30:28.908582  5980 acceptor_pool.cc:254] collecting diagnostics on the listening RPC socket 0.0.0.0:41515 every 8 connection(s)
I20260927 01:30:28.908875  5812 rpc-test.cc:700] Connecting to 0.0.0.0:41515
[       OK ] Parameters/TestRpc.TestCredentialsPolicy/SSL_TCP (33 ms)
[ RUN      ] Parameters/TestRpc.TestCallLongerThanKeepalive/SSL_TCP
I20260927 01:30:28.946771  6004 acceptor_pool.cc:254] collecting diagnostics on the listening RPC socket 0.0.0.0:35603 every 8 connection(s)
I20260927 01:30:28.946797  6005 acceptor_pool.cc:254] collecting diagnostics on the listening RPC socket 0.0.0.0:35603 every 8 connection(s)
I20260927 01:30:28.986914  6008 rpc-test-base.h:222] got call: sleep_micros: 3000000 deferred: true
I20260927 01:30:31.987727  6008 rpcz_store.cc:275] Call kudu.rpc.GenericCalculatorService.Sleep from 127.0.0.1:48312 (request call id 0) took 3000 ms. Trace:
I20260927 01:30:31.987864  6008 rpcz_store.cc:276] 0927 01:30:28.986817 (+     0us) service_pool.cc:170] Inserting onto call queue
0927 01:30:28.986876 (+    59us) service_pool.cc:227] Handling call
0927 01:30:31.987706 (+3000830us) inbound_call.cc:173] Queueing success response
Metrics: {}
[       OK ] Parameters/TestRpc.TestCallLongerThanKeepalive/SSL_TCP (3058 ms)
[ RUN      ] Parameters/TestRpc.TestRpcSidecar/SSL_TCP
I20260927 01:30:31.998504  6029 acceptor_pool.cc:254] collecting diagnostics on the listening RPC socket 0.0.0.0:44329 every 8 connection(s)
I20260927 01:30:31.998560  6030 acceptor_pool.cc:254] collecting diagnostics on the listening RPC socket 0.0.0.0:44329 every 8 connection(s)
[       OK ] Parameters/TestRpc.TestRpcSidecar/SSL_TCP (65 ms)
[ RUN      ] Parameters/TestRpc.TestRpcSidecarLimits/SSL_TCP
I20260927 01:30:33.671628  6054 acceptor_pool.cc:254] collecting diagnostics on the listening RPC socket 0.0.0.0:44239 every 8 connection(s)
I20260927 01:30:33.671677  6055 acceptor_pool.cc:254] collecting diagnostics on the listening RPC socket 0.0.0.0:44239 every 8 connection(s)
W20260927 01:30:33.684305  5812 serialization.cc:72] Serialized kudu.rpc_test.PushStringsRequestPB (2147483654 bytes) is larger than the maximum configured RPC message size (52428800 bytes). Sending anyway, but peer may reject the data.
W20260927 01:30:33.688544  6052 connection.cc:535] server connection from 127.0.0.1:37646 recv error: Network error: RPC frame had a length of 2147483714, but we only support messages up to 52428800 bytes long.
W20260927 01:30:33.688630  6052 connection.cc:158] shutting down server connection from 127.0.0.1:37646 with pending inbound data: 4/2147483714 bytes received; last active 0 ns ago: status Network error: RPC frame had a length of 2147483714, but we only support messages up to 52428800 bytes long.
W20260927 01:30:33.688951  6067 connection.cc:196] Error closing socket: Network error: TlsSocket::Close: Connection reset by peer
I20260927 01:30:33.709164  6079 acceptor_pool.cc:254] collecting diagnostics on the listening RPC socket 0.0.0.0:43499 every 8 connection(s)
I20260927 01:30:33.709297  6080 acceptor_pool.cc:254] collecting diagnostics on the listening RPC socket 0.0.0.0:43499 every 8 connection(s)
W20260927 01:30:37.928763  6076 connection.cc:577] server connection from 127.0.0.1:44562: received bad data: 'Corruption: Invalid packet: message had a length of 2147483710, but we only support messages up to 2147483647 bytes
'
[       OK ] Parameters/TestRpc.TestRpcSidecarLimits/SSL_TCP (5875 ms)
[ RUN      ] Parameters/TestRpc.TestCallTimeoutDoesntAffectNegotiation/SSL_TCP
I20260927 01:30:37.952744  6104 acceptor_pool.cc:254] collecting diagnostics on the listening RPC socket 0.0.0.0:44611 every 8 connection(s)
I20260927 01:30:37.952772  6105 acceptor_pool.cc:254] collecting diagnostics on the listening RPC socket 0.0.0.0:44611 every 8 connection(s)
W20260927 01:30:37.969053  6100 negotiation.cc:266] Injecting 500ms delay in negotiation
I20260927 01:30:38.019379  5812 rpc-test-base.h:595] status: Timed out: connection negotiation to 0.0.0.0:44611 for RPC Sleep timed out after 0.050s (ON_OUTBOUND_QUEUE), seconds elapsed: 0.0508605
[       OK ] Parameters/TestRpc.TestCallTimeoutDoesntAffectNegotiation/SSL_TCP (543 ms)
[ RUN      ] Parameters/TestRpc.TestRpcHandlerLatencyMetric/SSL_TCP
I20260927 01:30:38.484181  6129 acceptor_pool.cc:254] collecting diagnostics on the listening RPC socket 0.0.0.0:41095 every 8 connection(s)
I20260927 01:30:38.484310  6130 acceptor_pool.cc:254] collecting diagnostics on the listening RPC socket 0.0.0.0:41095 every 8 connection(s)
I20260927 01:30:38.519932  5812 rpc-test.cc:1236] Sleep() min lat: 20373
I20260927 01:30:38.520061  5812 rpc-test.cc:1237] Sleep() mean lat: 20373
I20260927 01:30:38.520124  5812 rpc-test.cc:1238] Sleep() max lat: 20373
I20260927 01:30:38.520149  5812 rpc-test.cc:1239] Sleep() #calls: 1
[       OK ] Parameters/TestRpc.TestRpcHandlerLatencyMetric/SSL_TCP (46 ms)
[ RUN      ] Parameters/TestRpc.TimedOutOnResponseMetricServiceQueue/SSL_TCP
I20260927 01:30:38.534063  6155 acceptor_pool.cc:254] collecting diagnostics on the listening RPC socket 0.0.0.0:43841 every 8 connection(s)
I20260927 01:30:38.534113  6156 acceptor_pool.cc:254] collecting diagnostics on the listening RPC socket 0.0.0.0:43841 every 8 connection(s)
W20260927 01:30:38.596802  6157 rpcz_store.cc:267] Call kudu.rpc_test.CalculatorService.Sleep from 127.0.0.1:47676 (request call id 2) took 20 ms (client timeout 20 ms). Trace:
W20260927 01:30:38.596921  6157 rpcz_store.cc:269] 0927 01:30:38.576378 (+     0us) service_pool.cc:170] Inserting onto call queue
0927 01:30:38.596749 (+ 20371us) service_pool.cc:214] Skipping call since client already timed out
0927 01:30:38.596786 (+    37us) inbound_call.cc:173] Queueing failure response
Metrics: {}
[       OK ] Parameters/TestRpc.TimedOutOnResponseMetricServiceQueue/SSL_TCP (76 ms)
[ RUN      ] Parameters/TestRpc.RpcPendingConnectionsMetric/SSL_TCP
I20260927 01:30:38.601251  6178 acceptor_pool.cc:254] collecting diagnostics on the listening RPC socket 0.0.0.0:35827 every 8 connection(s)
I20260927 01:30:38.601310  6179 acceptor_pool.cc:254] collecting diagnostics on the listening RPC socket 0.0.0.0:35827 every 8 connection(s)
W20260927 01:30:38.602473  6174 negotiation.cc:337] Failed RPC negotiation. Trace:
0927 01:30:38.601990 (+     0us) reactor.cc:625] Submitting negotiation task for server connection from 127.0.0.1:37784 (local address 127.0.0.1:35827)
0927 01:30:38.602104 (+   114us) server_negotiation.cc:206] Beginning negotiation
0927 01:30:38.602107 (+     3us) server_negotiation.cc:399] Waiting for connection header
0927 01:30:38.602280 (+   173us) negotiation.cc:327] Negotiation complete: Network error: Server connection negotiation failed: server connection from 127.0.0.1:37784: BlockingRecv error: recv got EOF from 127.0.0.1:37784 (error 108)
Metrics: {"server-negotiator.queue_time_us":49}
[       OK ] Parameters/TestRpc.RpcPendingConnectionsMetric/SSL_TCP (14 ms)
[ RUN      ] Parameters/TestRpc.TestRpcContextClientDeadline/SSL_TCP
I20260927 01:30:38.628763  6194 acceptor_pool.cc:254] collecting diagnostics on the listening RPC socket 0.0.0.0:38247 every 8 connection(s)
I20260927 01:30:38.628820  6195 acceptor_pool.cc:254] collecting diagnostics on the listening RPC socket 0.0.0.0:38247 every 8 connection(s)
[       OK ] Parameters/TestRpc.TestRpcContextClientDeadline/SSL_TCP (60 ms)
[ RUN      ] Parameters/TestRpc.TestApplicationFeatureFlagUnsupportedServer/SSL_TCP
I20260927 01:30:38.687126  6219 acceptor_pool.cc:254] collecting diagnostics on the listening RPC socket 0.0.0.0:34875 every 8 connection(s)
I20260927 01:30:38.687155  6220 acceptor_pool.cc:254] collecting diagnostics on the listening RPC socket 0.0.0.0:34875 every 8 connection(s)
[       OK ] Parameters/TestRpc.TestApplicationFeatureFlagUnsupportedServer/SSL_TCP (31 ms)
[ RUN      ] Parameters/TestRpc.TestCancellationAsync/SSL_TCP
I20260927 01:30:38.712020  6244 acceptor_pool.cc:254] collecting diagnostics on the listening RPC socket 0.0.0.0:33793 every 8 connection(s)
I20260927 01:30:38.712071  6245 acceptor_pool.cc:254] collecting diagnostics on the listening RPC socket 0.0.0.0:33793 every 8 connection(s)
I20260927 01:30:38.712363  5812 rpc-test.cc:1716] Connecting to 0.0.0.0:33793
I20260927 01:30:38.741204  5812 test_util.cc:268] Using random seed: -442713393
I20260927 01:30:38.761519  6248 rpc-test-base.h:240] got call: sleep_micros: 500 pattern: 4294967295 num_repetitions: 2097152 sidecar_idx: 0
I20260927 01:30:38.777642  6247 rpc-test-base.h:240] got call: sleep_micros: 500 pattern: 4294967295 num_repetitions: 2097152 sidecar_idx: 0
I20260927 01:30:38.794044  6248 rpc-test-base.h:240] got call: sleep_micros: 500 pattern: 4294967295 num_repetitions: 2097152 sidecar_idx: 0
I20260927 01:30:38.812021  6247 rpc-test-base.h:240] got call: sleep_micros: 500 pattern: 4294967295 num_repetitions: 2097152 sidecar_idx: 0
I20260927 01:30:38.833444  6248 rpc-test-base.h:240] got call: sleep_micros: 500 pattern: 4294967295 num_repetitions: 2097152 sidecar_idx: 0
I20260927 01:30:38.851490  6247 rpc-test-base.h:240] got call: sleep_micros: 500 pattern: 4294967295 num_repetitions: 2097152 sidecar_idx: 0
I20260927 01:30:38.869554  6248 rpc-test-base.h:240] got call: sleep_micros: 500 pattern: 4294967295 num_repetitions: 2097152 sidecar_idx: 0
W20260927 01:30:38.877662  6243 connection.cc:441] server connection from 127.0.0.1:34778 torn down before Call kudu.rpc.GenericCalculatorService.SleepWithSidecar from 127.0.0.1:34778 (request call id 8) could send its response
W20260927 01:30:38.887513  6243 connection.cc:441] server connection from 127.0.0.1:34778 torn down before Call kudu.rpc.GenericCalculatorService.SleepWithSidecar from 127.0.0.1:34778 (request call id 9) could send its response
[       OK ] Parameters/TestRpc.TestCancellationAsync/SSL_TCP (183 ms)
[ RUN      ] Parameters/TestRpc.TestPerformanceBySocketType/SSL_TCP
I20260927 01:30:38.899353  6269 acceptor_pool.cc:254] collecting diagnostics on the listening RPC socket 0.0.0.0:35581 every 8 connection(s)
I20260927 01:30:38.899493  6270 acceptor_pool.cc:254] collecting diagnostics on the listening RPC socket 0.0.0.0:35581 every 8 connection(s)
I20260927 01:30:38.899746  5812 rpc-test.cc:1846] Connecting to 0.0.0.0:35581
I20260927 01:30:41.102442  5812 rpc-test.cc:1859] Sending 1024MB via ssl-enabled tcp socket: real 2.198s	user 2.277s	sys 1.621s
I20260927 01:30:43.387351  5812 rpc-test.cc:1859] Sending 1024MB via ssl-enabled tcp socket: real 2.285s	user 2.376s	sys 1.683s
I20260927 01:30:45.687609  5812 rpc-test.cc:1859] Sending 1024MB via ssl-enabled tcp socket: real 2.300s	user 2.453s	sys 1.637s
I20260927 01:30:47.953398  5812 rpc-test.cc:1859] Sending 1024MB via ssl-enabled tcp socket: real 2.266s	user 2.342s	sys 1.686s
I20260927 01:30:50.309134  5812 rpc-test.cc:1859] Sending 1024MB via ssl-enabled tcp socket: real 2.356s	user 2.575s	sys 1.605s
[       OK ] Parameters/TestRpc.TestPerformanceBySocketType/SSL_TCP (11422 ms)
[----------] 20 tests from Parameters/TestRpc (36966 ms total)

[----------] 1 test from Parameters/TestRpcSocketTxRxQueue
[ RUN      ] Parameters/TestRpcSocketTxRxQueue.OverCapacity/0
W20260927 01:30:50.581779  6295 negotiation.cc:337] Failed RPC negotiation. Trace:
0927 01:30:50.314964 (+     0us) reactor.cc:625] Submitting negotiation task for client connection to 0.0.0.0:44575 (local address 127.0.0.1:39742)
0927 01:30:50.315109 (+   145us) negotiation.cc:107] Waiting for socket to connect
0927 01:30:50.315124 (+    15us) client_negotiation.cc:174] Beginning negotiation
0927 01:30:50.315208 (+    84us) client_negotiation.cc:252] Sending NEGOTIATE NegotiatePB request
0927 01:30:50.581625 (+266417us) negotiation.cc:327] Negotiation complete: Network error: Client connection negotiation failed: client connection to 0.0.0.0:44575: BlockingRecv error: recv error from unknown peer: Transport endpoint is not connected (error 107)
Metrics: {"client-negotiator.queue_time_us":69}
W20260927 01:30:50.581933  6331 negotiation.cc:337] Failed RPC negotiation. Trace:
0927 01:30:50.319618 (+     0us) reactor.cc:625] Submitting negotiation task for client connection to 0.0.0.0:44575 (local address 127.0.0.1:39786)
0927 01:30:50.319694 (+    76us) negotiation.cc:107] Waiting for socket to connect
0927 01:30:50.319729 (+    35us) client_negotiation.cc:174] Beginning negotiation
0927 01:30:50.319806 (+    77us) client_negotiation.cc:252] Sending NEGOTIATE NegotiatePB request
0927 01:30:50.581860 (+262054us) negotiation.cc:327] Negotiation complete: Network error: Client connection negotiation failed: client connection to 0.0.0.0:44575: BlockingRecv error: recv error from unknown peer: Transport endpoint is not connected (error 107)
Metrics: {"client-negotiator.queue_time_us":24}
W20260927 01:30:50.582023  6322 negotiation.cc:337] Failed RPC negotiation. Trace:
0927 01:30:50.318500 (+     0us) reactor.cc:625] Submitting negotiation task for client connection to 0.0.0.0:44575 (local address 127.0.0.1:39778)
0927 01:30:50.318578 (+    78us) negotiation.cc:107] Waiting for socket to connect
0927 01:30:50.318612 (+    34us) client_negotiation.cc:174] Beginning negotiation
0927 01:30:50.318693 (+    81us) client_negotiation.cc:252] Sending NEGOTIATE NegotiatePB request
0927 01:30:50.581702 (+263009us) negotiation.cc:327] Negotiation complete: Network error: Client connection negotiation failed: client connection to 0.0.0.0:44575: BlockingRecv error: recv error from unknown peer: Transport endpoint is not connected (error 107)
Metrics: {"client-negotiator.queue_time_us":25}
W20260927 01:30:50.582137  6304 negotiation.cc:337] Failed RPC negotiation. Trace:
0927 01:30:50.316112 (+     0us) reactor.cc:625] Submitting negotiation task for client connection to 0.0.0.0:44575 (local address 127.0.0.1:39752)
0927 01:30:50.316226 (+   114us) negotiation.cc:107] Waiting for socket to connect
0927 01:30:50.316239 (+    13us) client_negotiation.cc:174] Beginning negotiation
0927 01:30:50.316312 (+    73us) client_negotiation.cc:252] Sending NEGOTIATE NegotiatePB request
0927 01:30:50.581623 (+265311us) negotiation.cc:327] Negotiation complete: Network error: Client connection negotiation failed: client connection to 0.0.0.0:44575: BlockingRecv error: recv error from unknown peer: Transport endpoint is not connected (error 107)
Metrics: {"client-negotiator.queue_time_us":25}
W20260927 01:30:50.581813  6286 negotiation.cc:337] Failed RPC negotiation. Trace:
0927 01:30:50.313673 (+     0us) reactor.cc:625] Submitting negotiation task for client connection to 0.0.0.0:44575 (local address 127.0.0.1:39740)
0927 01:30:50.313786 (+   113us) negotiation.cc:107] Waiting for socket to connect
0927 01:30:50.313802 (+    16us) client_negotiation.cc:174] Beginning negotiation
0927 01:30:50.313895 (+    93us) client_negotiation.cc:252] Sending NEGOTIATE NegotiatePB request
0927 01:30:50.581625 (+267730us) negotiation.cc:327] Negotiation complete: Network error: Client connection negotiation failed: client connection to 0.0.0.0:44575: BlockingRecv error: recv error from unknown peer: Transport endpoint is not connected (error 107)
Metrics: {"client-negotiator.queue_time_us":26}
W20260927 01:30:50.582261  6313 negotiation.cc:337] Failed RPC negotiation. Trace:
0927 01:30:50.317200 (+     0us) reactor.cc:625] Submitting negotiation task for client connection to 0.0.0.0:44575 (local address 127.0.0.1:39768)
0927 01:30:50.317338 (+   138us) negotiation.cc:107] Waiting for socket to connect
0927 01:30:50.317350 (+    12us) client_negotiation.cc:174] Beginning negotiation
0927 01:30:50.317426 (+    76us) client_negotiation.cc:252] Sending NEGOTIATE NegotiatePB request
0927 01:30:50.581797 (+264371us) negotiation.cc:327] Negotiation complete: Network error: Client connection negotiation failed: client connection to 0.0.0.0:44575: BlockingRecv error: recv error from unknown peer: Transport endpoint is not connected (error 107)
Metrics: {"client-negotiator.queue_time_us":44}
[       OK ] Parameters/TestRpcSocketTxRxQueue.OverCapacity/0 (1049 ms)
[----------] 1 test from Parameters/TestRpcSocketTxRxQueue (1049 ms total)

[----------] Global test environment tear-down
[==========] 21 tests from 2 test suites ran. (38015 ms total)
[  PASSED  ] 20 tests.
[  FAILED  ] 1 test, listed below:
[  FAILED  ] Parameters/TestRpc.TestCallWithChainCertAndChainCA/SSL_TCP, where GetParam() = (true, false)

 1 FAILED TEST