Diagnosed failure

Parameters/TestRpc.TestCallWithChainCertAndChainCA/SSL_TCP: /data0/somelongdirectorytoavoidrpathissues/src/kudu/src/kudu/rpc/rpc-test.cc:270: Failure
Failed
Bad status: Runtime error: could not verify certificate chain (error with cert: subject=CN = localhost, ST = sadfjas, C = AS, emailAddress = sdflkdsajf, O = lskdfjlsad, OU = sldfkja, issuer=C = AS, ST = ASDfkjdhf, L = lskdjf, O = saldfja, OU = skdjf, CN = localhost, emailAddress = sadjflkadsj): : certificate has expired
Google Test trace:
/data0/somelongdirectorytoavoidrpathissues/src/kudu/src/kudu/rpc/rpc-test.cc:267: Connecting to 0.0.0.0:34107
I20260929 06:28:38.888248  2936 test_util.cc:175] -----------------------------------------------
I20260929 06:28:38.888296  2936 test_util.cc:176] Had fatal failures, leaving test files at /tmp/dist-test-task00Hvxg/test-tmp/rpc-test.5.Parameters_TestRpc.TestCallWithChainCertAndChainCA_SSL_TCP.1790663318825576-2936-0

Full log

Note: This is test shard 6 of 8.
[==========] Running 21 tests from 2 test suites.
[----------] Global test environment set-up.
[----------] 20 tests from Parameters/TestRpc
[ RUN      ] Parameters/TestRpc.TestMessengerCreateDestroy/SSL_TCP
WARNING: Logging before InitGoogleLogging() is written to STDERR
I20260929 06:28:38.839933  2936 rpc-test.cc:169] started messenger TestCreateDestroy
[       OK ] Parameters/TestRpc.TestMessengerCreateDestroy/SSL_TCP (12 ms)
[ RUN      ] Parameters/TestRpc.TestNegotiationDeadlock/SSL_TCP
I20260929 06:28:38.862452  2956 acceptor_pool.cc:254] collecting diagnostics on the listening RPC socket 0.0.0.0:43273 every 8 connection(s)
I20260929 06:28:38.862483  2957 acceptor_pool.cc:254] collecting diagnostics on the listening RPC socket 0.0.0.0:43273 every 8 connection(s)
[       OK ] Parameters/TestRpc.TestNegotiationDeadlock/SSL_TCP (28 ms)
[ RUN      ] Parameters/TestRpc.TestCallWithChainCertAndChainCA/SSL_TCP
I20260929 06:28:38.884442  2972 acceptor_pool.cc:254] collecting diagnostics on the listening RPC socket 0.0.0.0:34107 every 8 connection(s)
I20260929 06:28:38.884492  2973 acceptor_pool.cc:254] collecting diagnostics on the listening RPC socket 0.0.0.0:34107 every 8 connection(s)
/data0/somelongdirectorytoavoidrpathissues/src/kudu/src/kudu/rpc/rpc-test.cc:270: Failure
Failed
Bad status: Runtime error: could not verify certificate chain (error with cert: subject=CN = localhost, ST = sadfjas, C = AS, emailAddress = sdflkdsajf, O = lskdfjlsad, OU = sldfkja, issuer=C = AS, ST = ASDfkjdhf, L = lskdjf, O = saldfja, OU = skdjf, CN = localhost, emailAddress = sadjflkadsj): : certificate has expired
Google Test trace:
/data0/somelongdirectorytoavoidrpathissues/src/kudu/src/kudu/rpc/rpc-test.cc:267: Connecting to 0.0.0.0:34107
I20260929 06:28:38.888248  2936 test_util.cc:175] -----------------------------------------------
I20260929 06:28:38.888296  2936 test_util.cc:176] Had fatal failures, leaving test files at /tmp/dist-test-task00Hvxg/test-tmp/rpc-test.5.Parameters_TestRpc.TestCallWithChainCertAndChainCA_SSL_TCP.1790663318825576-2936-0
[  FAILED  ] Parameters/TestRpc.TestCallWithChainCertAndChainCA/SSL_TCP, where GetParam() = (true, false) (18 ms)
[ RUN      ] Parameters/TestRpc.TestCallWithPasswordProtectedKey/SSL_TCP
I20260929 06:28:38.894584  2997 acceptor_pool.cc:254] collecting diagnostics on the listening RPC socket 0.0.0.0:33629 every 8 connection(s)
I20260929 06:28:38.894634  2998 acceptor_pool.cc:254] collecting diagnostics on the listening RPC socket 0.0.0.0:33629 every 8 connection(s)
[       OK ] Parameters/TestRpc.TestCallWithPasswordProtectedKey/SSL_TCP (18 ms)
[ RUN      ] Parameters/TestRpc.TestCallToBadServer/SSL_TCP
I20260929 06:28:38.921284  2936 rpc-test.cc:394] Status: Network error: Client connection negotiation failed: client connection to 0.0.0.0:0: connect: Connection refused (error 111)
I20260929 06:28:38.921643  2936 rpc-test.cc:394] Status: Network error: Client connection negotiation failed: client connection to 0.0.0.0:0: connect: Connection refused (error 111)
I20260929 06:28:38.921893  2936 rpc-test.cc:394] Status: Network error: Client connection negotiation failed: client connection to 0.0.0.0:0: connect: Connection refused (error 111)
I20260929 06:28:38.922108  2936 rpc-test.cc:394] Status: Network error: Client connection negotiation failed: client connection to 0.0.0.0:0: connect: Connection refused (error 111)
I20260929 06:28:38.922288  2936 rpc-test.cc:394] Status: Network error: Client connection negotiation failed: client connection to 0.0.0.0:0: connect: Connection refused (error 111)
[       OK ] Parameters/TestRpc.TestCallToBadServer/SSL_TCP (15 ms)
[ RUN      ] Parameters/TestRpc.TestWrongService/SSL_TCP
I20260929 06:28:38.933386  3032 acceptor_pool.cc:254] collecting diagnostics on the listening RPC socket 0.0.0.0:34301 every 8 connection(s)
I20260929 06:28:38.933452  3033 acceptor_pool.cc:254] collecting diagnostics on the listening RPC socket 0.0.0.0:34301 every 8 connection(s)
I20260929 06:28:38.949044  3029 messenger.cc:345] service WrongServiceName not registered on TestServer
[       OK ] Parameters/TestRpc.TestWrongService/SSL_TCP (28 ms)
[ RUN      ] Parameters/TestRpc.TestConnectionKeepalive/SSL_TCP
I20260929 06:28:38.970350  3055 acceptor_pool.cc:254] collecting diagnostics on the listening RPC socket 0.0.0.0:41809 every 8 connection(s)
I20260929 06:28:38.970379  3056 acceptor_pool.cc:254] collecting diagnostics on the listening RPC socket 0.0.0.0:41809 every 8 connection(s)
I20260929 06:28:38.970636  2936 rpc-test.cc:488] Connecting to 0.0.0.0:41809
[       OK ] Parameters/TestRpc.TestConnectionKeepalive/SSL_TCP (1041 ms)
[ RUN      ] Parameters/TestRpc.TestClientConnectionMetrics/SSL_TCP
I20260929 06:28:40.003125  3080 acceptor_pool.cc:254] collecting diagnostics on the listening RPC socket 0.0.0.0:40293 every 8 connection(s)
I20260929 06:28:40.003176  3081 acceptor_pool.cc:254] collecting diagnostics on the listening RPC socket 0.0.0.0:40293 every 8 connection(s)
I20260929 06:28:40.003347  2936 rpc-test.cc:569] Connecting to 0.0.0.0:40293
[       OK ] Parameters/TestRpc.TestClientConnectionMetrics/SSL_TCP (8395 ms)
[ RUN      ] Parameters/TestRpc.TestCredentialsPolicy/SSL_TCP
I20260929 06:28:48.404301  3103 acceptor_pool.cc:254] collecting diagnostics on the listening RPC socket 0.0.0.0:40743 every 8 connection(s)
I20260929 06:28:48.404354  3104 acceptor_pool.cc:254] collecting diagnostics on the listening RPC socket 0.0.0.0:40743 every 8 connection(s)
I20260929 06:28:48.404511  2936 rpc-test.cc:700] Connecting to 0.0.0.0:40743
[       OK ] Parameters/TestRpc.TestCredentialsPolicy/SSL_TCP (49 ms)
[ RUN      ] Parameters/TestRpc.TestCallLongerThanKeepalive/SSL_TCP
I20260929 06:28:48.449859  3128 acceptor_pool.cc:254] collecting diagnostics on the listening RPC socket 0.0.0.0:38565 every 8 connection(s)
I20260929 06:28:48.449904  3129 acceptor_pool.cc:254] collecting diagnostics on the listening RPC socket 0.0.0.0:38565 every 8 connection(s)
I20260929 06:28:48.475935  3132 rpc-test-base.h:222] got call: sleep_micros: 3000000 deferred: true
I20260929 06:28:51.476591  3132 rpcz_store.cc:275] Call kudu.rpc.GenericCalculatorService.Sleep from 127.0.0.1:56778 (request call id 0) took 3000 ms. Trace:
I20260929 06:28:51.476697  3132 rpcz_store.cc:276] 0929 06:28:48.475879 (+     0us) service_pool.cc:170] Inserting onto call queue
0929 06:28:48.475914 (+    35us) service_pool.cc:227] Handling call
0929 06:28:51.476576 (+3000662us) inbound_call.cc:173] Queueing success response
Metrics: {}
[       OK ] Parameters/TestRpc.TestCallLongerThanKeepalive/SSL_TCP (3040 ms)
[ RUN      ] Parameters/TestRpc.TestRpcSidecar/SSL_TCP
I20260929 06:28:51.484987  3153 acceptor_pool.cc:254] collecting diagnostics on the listening RPC socket 0.0.0.0:33217 every 8 connection(s)
I20260929 06:28:51.485085  3154 acceptor_pool.cc:254] collecting diagnostics on the listening RPC socket 0.0.0.0:33217 every 8 connection(s)
[       OK ] Parameters/TestRpc.TestRpcSidecar/SSL_TCP (50 ms)
[ RUN      ] Parameters/TestRpc.TestRpcSidecarLimits/SSL_TCP
I20260929 06:28:53.263588  3178 acceptor_pool.cc:254] collecting diagnostics on the listening RPC socket 0.0.0.0:37741 every 8 connection(s)
I20260929 06:28:53.263631  3179 acceptor_pool.cc:254] collecting diagnostics on the listening RPC socket 0.0.0.0:37741 every 8 connection(s)
W20260929 06:28:53.292264  2936 serialization.cc:72] Serialized kudu.rpc_test.PushStringsRequestPB (2147483654 bytes) is larger than the maximum configured RPC message size (52428800 bytes). Sending anyway, but peer may reject the data.
W20260929 06:28:53.295846  3176 connection.cc:535] server connection from 127.0.0.1:59744 recv error: Network error: RPC frame had a length of 2147483714, but we only support messages up to 52428800 bytes long.
W20260929 06:28:53.295926  3176 connection.cc:158] shutting down server connection from 127.0.0.1:59744 with pending inbound data: 4/2147483714 bytes received; last active 0 ns ago: status Network error: RPC frame had a length of 2147483714, but we only support messages up to 52428800 bytes long.
W20260929 06:28:53.296152  3191 connection.cc:196] Error closing socket: Network error: TlsSocket::Close: Connection reset by peer
I20260929 06:28:53.305943  3203 acceptor_pool.cc:254] collecting diagnostics on the listening RPC socket 0.0.0.0:37081 every 8 connection(s)
I20260929 06:28:53.306057  3204 acceptor_pool.cc:254] collecting diagnostics on the listening RPC socket 0.0.0.0:37081 every 8 connection(s)
W20260929 06:28:57.337216  3200 connection.cc:577] server connection from 127.0.0.1:36850: received bad data: 'Corruption: Invalid packet: message had a length of 2147483710, but we only support messages up to 2147483647 bytes
'
[       OK ] Parameters/TestRpc.TestRpcSidecarLimits/SSL_TCP (5810 ms)
[ RUN      ] Parameters/TestRpc.TestCallTimeoutDoesntAffectNegotiation/SSL_TCP
I20260929 06:28:57.349171  3228 acceptor_pool.cc:254] collecting diagnostics on the listening RPC socket 0.0.0.0:45845 every 8 connection(s)
I20260929 06:28:57.349278  3229 acceptor_pool.cc:254] collecting diagnostics on the listening RPC socket 0.0.0.0:45845 every 8 connection(s)
W20260929 06:28:57.354543  3224 negotiation.cc:266] Injecting 500ms delay in negotiation
I20260929 06:28:57.404840  2936 rpc-test-base.h:595] status: Timed out: connection negotiation to 0.0.0.0:45845 for RPC Sleep timed out after 0.050s (ON_OUTBOUND_QUEUE), seconds elapsed: 0.0506317
[       OK ] Parameters/TestRpc.TestCallTimeoutDoesntAffectNegotiation/SSL_TCP (519 ms)
[ RUN      ] Parameters/TestRpc.TestRpcHandlerLatencyMetric/SSL_TCP
I20260929 06:28:57.879413  3253 acceptor_pool.cc:254] collecting diagnostics on the listening RPC socket 0.0.0.0:39319 every 8 connection(s)
I20260929 06:28:57.879446  3254 acceptor_pool.cc:254] collecting diagnostics on the listening RPC socket 0.0.0.0:39319 every 8 connection(s)
I20260929 06:28:57.914840  2936 rpc-test.cc:1236] Sleep() min lat: 20320
I20260929 06:28:57.914909  2936 rpc-test.cc:1237] Sleep() mean lat: 20320
I20260929 06:28:57.914935  2936 rpc-test.cc:1238] Sleep() max lat: 20320
I20260929 06:28:57.914948  2936 rpc-test.cc:1239] Sleep() #calls: 1
[       OK ] Parameters/TestRpc.TestRpcHandlerLatencyMetric/SSL_TCP (56 ms)
[ RUN      ] Parameters/TestRpc.TimedOutOnResponseMetricServiceQueue/SSL_TCP
I20260929 06:28:57.925486  3279 acceptor_pool.cc:254] collecting diagnostics on the listening RPC socket 0.0.0.0:39933 every 8 connection(s)
I20260929 06:28:57.925527  3280 acceptor_pool.cc:254] collecting diagnostics on the listening RPC socket 0.0.0.0:39933 every 8 connection(s)
W20260929 06:28:57.984076  3281 rpcz_store.cc:267] Call kudu.rpc_test.CalculatorService.Sleep from 127.0.0.1:46706 (request call id 2) took 20 ms (client timeout 20 ms). Trace:
W20260929 06:28:57.984194  3281 rpcz_store.cc:269] 0929 06:28:57.963735 (+     0us) service_pool.cc:170] Inserting onto call queue
0929 06:28:57.984043 (+ 20308us) service_pool.cc:214] Skipping call since client already timed out
0929 06:28:57.984055 (+    12us) inbound_call.cc:173] Queueing failure response
Metrics: {}
[       OK ] Parameters/TestRpc.TimedOutOnResponseMetricServiceQueue/SSL_TCP (69 ms)
[ RUN      ] Parameters/TestRpc.RpcPendingConnectionsMetric/SSL_TCP
I20260929 06:28:57.987568  3302 acceptor_pool.cc:254] collecting diagnostics on the listening RPC socket 0.0.0.0:41253 every 8 connection(s)
I20260929 06:28:57.987645  3303 acceptor_pool.cc:254] collecting diagnostics on the listening RPC socket 0.0.0.0:41253 every 8 connection(s)
W20260929 06:28:57.997866  3298 negotiation.cc:337] Failed RPC negotiation. Trace:
0929 06:28:57.997612 (+     0us) reactor.cc:625] Submitting negotiation task for server connection from 127.0.0.1:51684 (local address 127.0.0.1:41253)
0929 06:28:57.997685 (+    73us) server_negotiation.cc:206] Beginning negotiation
0929 06:28:57.997687 (+     2us) server_negotiation.cc:399] Waiting for connection header
0929 06:28:57.997782 (+    95us) negotiation.cc:327] Negotiation complete: Network error: Server connection negotiation failed: server connection from 127.0.0.1:51684: BlockingRecv error: recv got EOF from 127.0.0.1:51684 (error 108)
Metrics: {"server-negotiator.queue_time_us":35}
[       OK ] Parameters/TestRpc.RpcPendingConnectionsMetric/SSL_TCP (22 ms)
[ RUN      ] Parameters/TestRpc.TestRpcContextClientDeadline/SSL_TCP
I20260929 06:28:58.023372  3318 acceptor_pool.cc:254] collecting diagnostics on the listening RPC socket 0.0.0.0:44117 every 8 connection(s)
I20260929 06:28:58.023425  3319 acceptor_pool.cc:254] collecting diagnostics on the listening RPC socket 0.0.0.0:44117 every 8 connection(s)
[       OK ] Parameters/TestRpc.TestRpcContextClientDeadline/SSL_TCP (59 ms)
[ RUN      ] Parameters/TestRpc.TestApplicationFeatureFlagUnsupportedServer/SSL_TCP
I20260929 06:28:58.087019  3343 acceptor_pool.cc:254] collecting diagnostics on the listening RPC socket 0.0.0.0:38357 every 8 connection(s)
I20260929 06:28:58.087074  3344 acceptor_pool.cc:254] collecting diagnostics on the listening RPC socket 0.0.0.0:38357 every 8 connection(s)
[       OK ] Parameters/TestRpc.TestApplicationFeatureFlagUnsupportedServer/SSL_TCP (38 ms)
[ RUN      ] Parameters/TestRpc.TestCancellationAsync/SSL_TCP
I20260929 06:28:58.111922  3368 acceptor_pool.cc:254] collecting diagnostics on the listening RPC socket 0.0.0.0:33099 every 8 connection(s)
I20260929 06:28:58.111984  3369 acceptor_pool.cc:254] collecting diagnostics on the listening RPC socket 0.0.0.0:33099 every 8 connection(s)
I20260929 06:28:58.112142  2936 rpc-test.cc:1716] Connecting to 0.0.0.0:33099
I20260929 06:28:58.124303  2936 test_util.cc:268] Using random seed: 1278108684
I20260929 06:28:58.139503  3372 rpc-test-base.h:240] got call: sleep_micros: 500 pattern: 4294967295 num_repetitions: 2097152 sidecar_idx: 0
I20260929 06:28:58.151667  3372 rpc-test-base.h:240] got call: sleep_micros: 500 pattern: 4294967295 num_repetitions: 2097152 sidecar_idx: 0
I20260929 06:28:58.164811  3372 rpc-test-base.h:240] got call: sleep_micros: 500 pattern: 4294967295 num_repetitions: 2097152 sidecar_idx: 0
I20260929 06:28:58.182261  3372 rpc-test-base.h:240] got call: sleep_micros: 500 pattern: 4294967295 num_repetitions: 2097152 sidecar_idx: 0
I20260929 06:28:58.199905  3372 rpc-test-base.h:240] got call: sleep_micros: 500 pattern: 4294967295 num_repetitions: 2097152 sidecar_idx: 0
I20260929 06:28:58.215811  3372 rpc-test-base.h:240] got call: sleep_micros: 500 pattern: 4294967295 num_repetitions: 2097152 sidecar_idx: 0
I20260929 06:28:58.228904  3372 rpc-test-base.h:240] got call: sleep_micros: 500 pattern: 4294967295 num_repetitions: 2097152 sidecar_idx: 0
I20260929 06:28:58.242619  3372 rpc-test-base.h:240] got call: sleep_micros: 500 pattern: 4294967295 num_repetitions: 2097152 sidecar_idx: 0
W20260929 06:28:58.245867  3366 connection.cc:441] server connection from 127.0.0.1:34208 torn down before Call kudu.rpc.GenericCalculatorService.SleepWithSidecar from 127.0.0.1:34208 (request call id 9) could send its response
[       OK ] Parameters/TestRpc.TestCancellationAsync/SSL_TCP (139 ms)
[ RUN      ] Parameters/TestRpc.TestPerformanceBySocketType/SSL_TCP
I20260929 06:28:58.284623  3393 acceptor_pool.cc:254] collecting diagnostics on the listening RPC socket 0.0.0.0:43057 every 8 connection(s)
I20260929 06:28:58.284653  3394 acceptor_pool.cc:254] collecting diagnostics on the listening RPC socket 0.0.0.0:43057 every 8 connection(s)
I20260929 06:28:58.284797  2936 rpc-test.cc:1846] Connecting to 0.0.0.0:43057
I20260929 06:28:59.827523  2936 rpc-test.cc:1859] Sending 1024MB via ssl-enabled tcp socket: real 1.535s	user 1.420s	sys 1.330s
I20260929 06:29:01.497391  2936 rpc-test.cc:1859] Sending 1024MB via ssl-enabled tcp socket: real 1.670s	user 1.532s	sys 1.448s
I20260929 06:29:03.137899  2936 rpc-test.cc:1859] Sending 1024MB via ssl-enabled tcp socket: real 1.640s	user 1.507s	sys 1.416s
I20260929 06:29:04.784082  2936 rpc-test.cc:1859] Sending 1024MB via ssl-enabled tcp socket: real 1.646s	user 1.502s	sys 1.436s
I20260929 06:29:06.438066  2936 rpc-test.cc:1859] Sending 1024MB via ssl-enabled tcp socket: real 1.654s	user 1.481s	sys 1.451s
[       OK ] Parameters/TestRpc.TestPerformanceBySocketType/SSL_TCP (8192 ms)
[----------] 20 tests from Parameters/TestRpc (27611 ms total)

[----------] 1 test from Parameters/TestRpcSocketTxRxQueue
[ RUN      ] Parameters/TestRpcSocketTxRxQueue.OverCapacity/0
W20260929 06:29:06.708621  3455 negotiation.cc:337] Failed RPC negotiation. Trace:
0929 06:29:06.449140 (+     0us) reactor.cc:625] Submitting negotiation task for client connection to 0.0.0.0:45917 (local address 127.0.0.1:43162)
0929 06:29:06.449193 (+    53us) negotiation.cc:107] Waiting for socket to connect
0929 06:29:06.449202 (+     9us) client_negotiation.cc:174] Beginning negotiation
0929 06:29:06.449242 (+    40us) client_negotiation.cc:252] Sending NEGOTIATE NegotiatePB request
0929 06:29:06.708578 (+259336us) negotiation.cc:327] Negotiation complete: Network error: Client connection negotiation failed: client connection to 0.0.0.0:45917: BlockingRecv error: recv error from unknown peer: Transport endpoint is not connected (error 107)
Metrics: {"client-negotiator.queue_time_us":33}
W20260929 06:29:06.708804  3419 negotiation.cc:337] Failed RPC negotiation. Trace:
0929 06:29:06.445727 (+     0us) reactor.cc:625] Submitting negotiation task for client connection to 0.0.0.0:45917 (local address 127.0.0.1:43132)
0929 06:29:06.445762 (+    35us) negotiation.cc:107] Waiting for socket to connect
0929 06:29:06.445770 (+     8us) client_negotiation.cc:174] Beginning negotiation
0929 06:29:06.445807 (+    37us) client_negotiation.cc:252] Sending NEGOTIATE NegotiatePB request
0929 06:29:06.708471 (+262664us) negotiation.cc:327] Negotiation complete: Network error: Client connection negotiation failed: client connection to 0.0.0.0:45917: BlockingRecv error: recv error from unknown peer: Transport endpoint is not connected (error 107)
Metrics: {"client-negotiator.queue_time_us":16}
W20260929 06:29:06.708621  3410 negotiation.cc:337] Failed RPC negotiation. Trace:
0929 06:29:06.444877 (+     0us) reactor.cc:625] Submitting negotiation task for client connection to 0.0.0.0:45917 (local address 127.0.0.1:43116)
0929 06:29:06.444935 (+    58us) negotiation.cc:107] Waiting for socket to connect
0929 06:29:06.444945 (+    10us) client_negotiation.cc:174] Beginning negotiation
0929 06:29:06.444995 (+    50us) client_negotiation.cc:252] Sending NEGOTIATE NegotiatePB request
0929 06:29:06.708498 (+263503us) negotiation.cc:327] Negotiation complete: Network error: Client connection negotiation failed: client connection to 0.0.0.0:45917: BlockingRecv error: recv error from unknown peer: Transport endpoint is not connected (error 107)
Metrics: {"client-negotiator.queue_time_us":33}
W20260929 06:29:06.708621  3428 negotiation.cc:337] Failed RPC negotiation. Trace:
0929 06:29:06.446598 (+     0us) reactor.cc:625] Submitting negotiation task for client connection to 0.0.0.0:45917 (local address 127.0.0.1:43138)
0929 06:29:06.446674 (+    76us) negotiation.cc:107] Waiting for socket to connect
0929 06:29:06.446682 (+     8us) client_negotiation.cc:174] Beginning negotiation
0929 06:29:06.446721 (+    39us) client_negotiation.cc:252] Sending NEGOTIATE NegotiatePB request
0929 06:29:06.708465 (+261744us) negotiation.cc:327] Negotiation complete: Network error: Client connection negotiation failed: client connection to 0.0.0.0:45917: BlockingRecv error: recv error from unknown peer: Transport endpoint is not connected (error 107)
Metrics: {"client-negotiator.queue_time_us":54}
W20260929 06:29:06.709108  3437 negotiation.cc:337] Failed RPC negotiation. Trace:
0929 06:29:06.447496 (+     0us) reactor.cc:625] Submitting negotiation task for client connection to 0.0.0.0:45917 (local address 127.0.0.1:43140)
0929 06:29:06.447554 (+    58us) negotiation.cc:107] Waiting for socket to connect
0929 06:29:06.447563 (+     9us) client_negotiation.cc:174] Beginning negotiation
0929 06:29:06.447601 (+    38us) client_negotiation.cc:252] Sending NEGOTIATE NegotiatePB request
0929 06:29:06.708655 (+261054us) negotiation.cc:327] Negotiation complete: Network error: Client connection negotiation failed: client connection to 0.0.0.0:45917: BlockingRecv error: recv error from unknown peer: Transport endpoint is not connected (error 107)
Metrics: {"client-negotiator.queue_time_us":36}
W20260929 06:29:06.709244  3446 negotiation.cc:337] Failed RPC negotiation. Trace:
0929 06:29:06.448307 (+     0us) reactor.cc:625] Submitting negotiation task for client connection to 0.0.0.0:45917 (local address 127.0.0.1:43152)
0929 06:29:06.448372 (+    65us) negotiation.cc:107] Waiting for socket to connect
0929 06:29:06.448381 (+     9us) client_negotiation.cc:174] Beginning negotiation
0929 06:29:06.448422 (+    41us) client_negotiation.cc:252] Sending NEGOTIATE NegotiatePB request
0929 06:29:06.708524 (+260102us) negotiation.cc:327] Negotiation complete: Network error: Client connection negotiation failed: client connection to 0.0.0.0:45917: BlockingRecv error: recv error from unknown peer: Transport endpoint is not connected (error 107)
Metrics: {"client-negotiator.queue_time_us":44}
[       OK ] Parameters/TestRpcSocketTxRxQueue.OverCapacity/0 (1042 ms)
[----------] 1 test from Parameters/TestRpcSocketTxRxQueue (1042 ms total)

[----------] Global test environment tear-down
[==========] 21 tests from 2 test suites ran. (28654 ms total)
[  PASSED  ] 20 tests.
[  FAILED  ] 1 test, listed below:
[  FAILED  ] Parameters/TestRpc.TestCallWithChainCertAndChainCA/SSL_TCP, where GetParam() = (true, false)

 1 FAILED TEST