Diagnosed failure
Parameters/TestRpc.TestCallWithChainCertAndChainCA/SSL_UnixSocket: /data0/somelongdirectorytoavoidrpathissues/src/kudu/src/kudu/rpc/rpc-test.cc:270: Failure
Failed
Bad status: Runtime error: could not verify certificate chain (error with cert: subject=CN = localhost, ST = sadfjas, C = AS, emailAddress = sdflkdsajf, O = lskdfjlsad, OU = sldfkja, issuer=C = AS, ST = ASDfkjdhf, L = lskdjf, O = saldfja, OU = skdjf, CN = localhost, emailAddress = sadjflkadsj): : certificate has expired
Google Test trace:
/data0/somelongdirectorytoavoidrpathissues/src/kudu/src/kudu/rpc/rpc-test.cc:267: Connecting to unix:/tmp/dist-test-task_x2zHM/test-tmp/rpc-test-eacf2ec797814a71be5c473f9eb32c9d.sock
I20260924 12:46:25.821826 2770 test_util.cc:175] -----------------------------------------------
I20260924 12:46:25.821952 2770 test_util.cc:176] Had fatal failures, leaving test files at /tmp/dist-test-task_x2zHM/test-tmp/rpc-test.6.Parameters_TestRpc.TestCallWithChainCertAndChainCA_SSL_UnixSocket.1790253985700032-2770-0
Full log
Note: This is test shard 7 of 8.
[==========] Running 21 tests from 2 test suites.
[----------] Global test environment set-up.
[----------] 20 tests from Parameters/TestRpc
[ RUN ] Parameters/TestRpc.TestMessengerCreateDestroy/SSL_UnixSocket
WARNING: Logging before InitGoogleLogging() is written to STDERR
I20260924 12:46:25.749531 2770 rpc-test.cc:169] started messenger TestCreateDestroy
[ OK ] Parameters/TestRpc.TestMessengerCreateDestroy/SSL_UnixSocket (32 ms)
[ RUN ] Parameters/TestRpc.TestNegotiationDeadlock/SSL_UnixSocket
I20260924 12:46:25.767089 2790 acceptor_pool.cc:254] collecting diagnostics on the listening RPC socket unix:/tmp/dist-test-task_x2zHM/test-tmp/rpc-test-a58b9fa658ed403a96c9cdfe788f42b0.sock every 8 connection(s)
I20260924 12:46:25.767431 2791 acceptor_pool.cc:254] collecting diagnostics on the listening RPC socket unix:/tmp/dist-test-task_x2zHM/test-tmp/rpc-test-a58b9fa658ed403a96c9cdfe788f42b0.sock every 8 connection(s)
[ OK ] Parameters/TestRpc.TestNegotiationDeadlock/SSL_UnixSocket (35 ms)
[ RUN ] Parameters/TestRpc.TestCallWithChainCertAndChainCA/SSL_UnixSocket
I20260924 12:46:25.807737 2806 acceptor_pool.cc:254] collecting diagnostics on the listening RPC socket unix:/tmp/dist-test-task_x2zHM/test-tmp/rpc-test-eacf2ec797814a71be5c473f9eb32c9d.sock every 8 connection(s)
I20260924 12:46:25.808053 2807 acceptor_pool.cc:254] collecting diagnostics on the listening RPC socket unix:/tmp/dist-test-task_x2zHM/test-tmp/rpc-test-eacf2ec797814a71be5c473f9eb32c9d.sock every 8 connection(s)
/data0/somelongdirectorytoavoidrpathissues/src/kudu/src/kudu/rpc/rpc-test.cc:270: Failure
Failed
Bad status: Runtime error: could not verify certificate chain (error with cert: subject=CN = localhost, ST = sadfjas, C = AS, emailAddress = sdflkdsajf, O = lskdfjlsad, OU = sldfkja, issuer=C = AS, ST = ASDfkjdhf, L = lskdjf, O = saldfja, OU = skdjf, CN = localhost, emailAddress = sadjflkadsj): : certificate has expired
Google Test trace:
/data0/somelongdirectorytoavoidrpathissues/src/kudu/src/kudu/rpc/rpc-test.cc:267: Connecting to unix:/tmp/dist-test-task_x2zHM/test-tmp/rpc-test-eacf2ec797814a71be5c473f9eb32c9d.sock
I20260924 12:46:25.821826 2770 test_util.cc:175] -----------------------------------------------
I20260924 12:46:25.821952 2770 test_util.cc:176] Had fatal failures, leaving test files at /tmp/dist-test-task_x2zHM/test-tmp/rpc-test.6.Parameters_TestRpc.TestCallWithChainCertAndChainCA_SSL_UnixSocket.1790253985700032-2770-0
[ FAILED ] Parameters/TestRpc.TestCallWithChainCertAndChainCA/SSL_UnixSocket, where GetParam() = (true, true) (33 ms)
[ RUN ] Parameters/TestRpc.TestCallWithPasswordProtectedKey/SSL_UnixSocket
I20260924 12:46:25.848891 2831 acceptor_pool.cc:254] collecting diagnostics on the listening RPC socket unix:/tmp/dist-test-task_x2zHM/test-tmp/rpc-test-748dd119da914fd7807100ab6b0dae38.sock every 8 connection(s)
I20260924 12:46:25.849159 2832 acceptor_pool.cc:254] collecting diagnostics on the listening RPC socket unix:/tmp/dist-test-task_x2zHM/test-tmp/rpc-test-748dd119da914fd7807100ab6b0dae38.sock every 8 connection(s)
W20260924 12:46:25.878692 2828 connection.cc:196] Error closing socket: Network error: TlsSocket::Close: Broken pipe
[ OK ] Parameters/TestRpc.TestCallWithPasswordProtectedKey/SSL_UnixSocket (60 ms)
[ RUN ] Parameters/TestRpc.TestCallToBadServer/SSL_UnixSocket
I20260924 12:46:25.900120 2770 rpc-test.cc:394] Status: Network error: Client connection negotiation failed: client connection to 0.0.0.0:0: connect: Connection refused (error 111)
I20260924 12:46:25.900830 2770 rpc-test.cc:394] Status: Network error: Client connection negotiation failed: client connection to 0.0.0.0:0: connect: Connection refused (error 111)
I20260924 12:46:25.901376 2770 rpc-test.cc:394] Status: Network error: Client connection negotiation failed: client connection to 0.0.0.0:0: connect: Connection refused (error 111)
I20260924 12:46:25.901881 2770 rpc-test.cc:394] Status: Network error: Client connection negotiation failed: client connection to 0.0.0.0:0: connect: Connection refused (error 111)
I20260924 12:46:25.902379 2770 rpc-test.cc:394] Status: Network error: Client connection negotiation failed: client connection to 0.0.0.0:0: connect: Connection refused (error 111)
[ OK ] Parameters/TestRpc.TestCallToBadServer/SSL_UnixSocket (21 ms)
[ RUN ] Parameters/TestRpc.TestWrongService/SSL_UnixSocket
I20260924 12:46:25.923952 2866 acceptor_pool.cc:254] collecting diagnostics on the listening RPC socket unix:/tmp/dist-test-task_x2zHM/test-tmp/rpc-test-81aaae98b35a4e46b928da62d99b09f3.sock every 8 connection(s)
I20260924 12:46:25.924196 2867 acceptor_pool.cc:254] collecting diagnostics on the listening RPC socket unix:/tmp/dist-test-task_x2zHM/test-tmp/rpc-test-81aaae98b35a4e46b928da62d99b09f3.sock every 8 connection(s)
I20260924 12:46:25.945720 2863 messenger.cc:345] service WrongServiceName not registered on TestServer
[ OK ] Parameters/TestRpc.TestWrongService/SSL_UnixSocket (46 ms)
[ RUN ] Parameters/TestRpc.TestConnectionKeepalive/SSL_UnixSocket
I20260924 12:46:25.980937 2889 acceptor_pool.cc:254] collecting diagnostics on the listening RPC socket unix:/tmp/dist-test-task_x2zHM/test-tmp/rpc-test-ced96f3a4ac84c5c856741283db8a86c.sock every 8 connection(s)
I20260924 12:46:25.981168 2890 acceptor_pool.cc:254] collecting diagnostics on the listening RPC socket unix:/tmp/dist-test-task_x2zHM/test-tmp/rpc-test-ced96f3a4ac84c5c856741283db8a86c.sock every 8 connection(s)
I20260924 12:46:25.982112 2770 rpc-test.cc:488] Connecting to unix:/tmp/dist-test-task_x2zHM/test-tmp/rpc-test-ced96f3a4ac84c5c856741283db8a86c.sock
W20260924 12:46:26.453342 2902 connection.cc:196] Error closing socket: Network error: TlsSocket::Close: Broken pipe
[ OK ] Parameters/TestRpc.TestConnectionKeepalive/SSL_UnixSocket (1057 ms)
[ RUN ] Parameters/TestRpc.TestClientConnectionMetrics/SSL_UnixSocket
I20260924 12:46:27.018324 2914 acceptor_pool.cc:254] collecting diagnostics on the listening RPC socket unix:/tmp/dist-test-task_x2zHM/test-tmp/rpc-test-b7ecbfcd758c4c40a3b81b4e18804e72.sock every 8 connection(s)
I20260924 12:46:27.018590 2915 acceptor_pool.cc:254] collecting diagnostics on the listening RPC socket unix:/tmp/dist-test-task_x2zHM/test-tmp/rpc-test-b7ecbfcd758c4c40a3b81b4e18804e72.sock every 8 connection(s)
I20260924 12:46:27.019572 2770 rpc-test.cc:569] Connecting to unix:/tmp/dist-test-task_x2zHM/test-tmp/rpc-test-b7ecbfcd758c4c40a3b81b4e18804e72.sock
W20260924 12:46:48.334947 2911 connection.cc:196] Error closing socket: Network error: TlsSocket::Close: Broken pipe
[ OK ] Parameters/TestRpc.TestClientConnectionMetrics/SSL_UnixSocket (21332 ms)
[ RUN ] Parameters/TestRpc.TestCredentialsPolicy/SSL_UnixSocket
I20260924 12:46:48.357128 2937 acceptor_pool.cc:254] collecting diagnostics on the listening RPC socket unix:/tmp/dist-test-task_x2zHM/test-tmp/rpc-test-7aef22eb84a546c1ab9ab9ad45ead88e.sock every 8 connection(s)
I20260924 12:46:48.357371 2938 acceptor_pool.cc:254] collecting diagnostics on the listening RPC socket unix:/tmp/dist-test-task_x2zHM/test-tmp/rpc-test-7aef22eb84a546c1ab9ab9ad45ead88e.sock every 8 connection(s)
I20260924 12:46:48.358274 2770 rpc-test.cc:700] Connecting to unix:/tmp/dist-test-task_x2zHM/test-tmp/rpc-test-7aef22eb84a546c1ab9ab9ad45ead88e.sock
W20260924 12:46:48.386940 2936 connection.cc:196] Error closing socket: Network error: TlsSocket::Close: Broken pipe
W20260924 12:46:48.393515 2936 connection.cc:196] Error closing socket: Network error: TlsSocket::Close: Broken pipe
[ OK ] Parameters/TestRpc.TestCredentialsPolicy/SSL_UnixSocket (56 ms)
[ RUN ] Parameters/TestRpc.TestCallLongerThanKeepalive/SSL_UnixSocket
I20260924 12:46:48.421718 2962 acceptor_pool.cc:254] collecting diagnostics on the listening RPC socket unix:/tmp/dist-test-task_x2zHM/test-tmp/rpc-test-b629aa0c17de47978e53631f5f6b6585.sock every 8 connection(s)
I20260924 12:46:48.421944 2963 acceptor_pool.cc:254] collecting diagnostics on the listening RPC socket unix:/tmp/dist-test-task_x2zHM/test-tmp/rpc-test-b629aa0c17de47978e53631f5f6b6585.sock every 8 connection(s)
I20260924 12:46:48.442837 2966 rpc-test-base.h:222] got call: sleep_micros: 3000000 deferred: true
I20260924 12:46:51.444530 2966 rpcz_store.cc:275] Call kudu.rpc.GenericCalculatorService.Sleep from unix:<unnamed> (request call id 0) took 3001 ms. Trace:
I20260924 12:46:51.444726 2966 rpcz_store.cc:276] 0924 12:46:48.442727 (+ 0us) service_pool.cc:170] Inserting onto call queue
0924 12:46:48.442790 (+ 63us) service_pool.cc:227] Handling call
0924 12:46:51.444487 (+3001697us) inbound_call.cc:173] Queueing success response
Metrics: {}
W20260924 12:46:51.447450 2959 connection.cc:196] Error closing socket: Network error: TlsSocket::Close: Broken pipe
[ OK ] Parameters/TestRpc.TestCallLongerThanKeepalive/SSL_UnixSocket (3053 ms)
[ RUN ] Parameters/TestRpc.TestRpcSidecar/SSL_UnixSocket
I20260924 12:46:51.476286 2987 acceptor_pool.cc:254] collecting diagnostics on the listening RPC socket unix:/tmp/dist-test-task_x2zHM/test-tmp/rpc-test-cfa051dd34394862ad11c7fa68c28c7a.sock every 8 connection(s)
I20260924 12:46:51.476533 2988 acceptor_pool.cc:254] collecting diagnostics on the listening RPC socket unix:/tmp/dist-test-task_x2zHM/test-tmp/rpc-test-cfa051dd34394862ad11c7fa68c28c7a.sock every 8 connection(s)
W20260924 12:46:51.582788 2984 connection.cc:196] Error closing socket: Network error: TlsSocket::Close: Broken pipe
[ OK ] Parameters/TestRpc.TestRpcSidecar/SSL_UnixSocket (135 ms)
[ RUN ] Parameters/TestRpc.TestRpcSidecarLimits/SSL_UnixSocket
I20260924 12:46:53.696275 3012 acceptor_pool.cc:254] collecting diagnostics on the listening RPC socket unix:/tmp/dist-test-task_x2zHM/test-tmp/rpc-test-6f771fda635e448c8433b3905ee2b1d8.sock every 8 connection(s)
I20260924 12:46:53.696530 3013 acceptor_pool.cc:254] collecting diagnostics on the listening RPC socket unix:/tmp/dist-test-task_x2zHM/test-tmp/rpc-test-6f771fda635e448c8433b3905ee2b1d8.sock every 8 connection(s)
W20260924 12:46:53.720934 2770 serialization.cc:72] Serialized kudu.rpc_test.PushStringsRequestPB (2147483654 bytes) is larger than the maximum configured RPC message size (52428800 bytes). Sending anyway, but peer may reject the data.
W20260924 12:46:53.726449 3009 connection.cc:535] server connection from unix:<unnamed> recv error: Network error: RPC frame had a length of 2147483714, but we only support messages up to 52428800 bytes long.
W20260924 12:46:53.726557 3009 connection.cc:158] shutting down server connection from unix:<unnamed> with pending inbound data: 4/2147483714 bytes received; last active 0 ns ago: status Network error: RPC frame had a length of 2147483714, but we only support messages up to 52428800 bytes long.
W20260924 12:46:53.726976 3025 connection.cc:196] Error closing socket: Network error: TlsSocket::Close: Broken pipe
I20260924 12:46:53.747186 3037 acceptor_pool.cc:254] collecting diagnostics on the listening RPC socket unix:/tmp/dist-test-task_x2zHM/test-tmp/rpc-test-6f771fda635e448c8433b3905ee2b1d8.sock every 8 connection(s)
I20260924 12:46:53.747445 3038 acceptor_pool.cc:254] collecting diagnostics on the listening RPC socket unix:/tmp/dist-test-task_x2zHM/test-tmp/rpc-test-6f771fda635e448c8433b3905ee2b1d8.sock every 8 connection(s)
W20260924 12:46:59.569978 3034 connection.cc:577] server connection from unix:<unnamed>: received bad data: 'Corruption: Invalid packet: message had a length of 2147483710, but we only support messages up to 2147483647 bytes
'
W20260924 12:46:59.570534 3050 connection.cc:196] Error closing socket: Network error: TlsSocket::Close: Broken pipe
[ OK ] Parameters/TestRpc.TestRpcSidecarLimits/SSL_UnixSocket (8472 ms)
[ RUN ] Parameters/TestRpc.TestCallTimeoutDoesntAffectNegotiation/SSL_UnixSocket
I20260924 12:47:00.074592 3062 acceptor_pool.cc:254] collecting diagnostics on the listening RPC socket unix:/tmp/dist-test-task_x2zHM/test-tmp/rpc-test-6da380ae98ca4064b252139d314a12d5.sock every 8 connection(s)
I20260924 12:47:00.074862 3063 acceptor_pool.cc:254] collecting diagnostics on the listening RPC socket unix:/tmp/dist-test-task_x2zHM/test-tmp/rpc-test-6da380ae98ca4064b252139d314a12d5.sock every 8 connection(s)
W20260924 12:47:00.093918 3058 negotiation.cc:266] Injecting 500ms delay in negotiation
I20260924 12:47:00.144467 2770 rpc-test-base.h:595] status: Timed out: connection negotiation to unix:/tmp/dist-test-task_x2zHM/test-tmp/rpc-test-6da380ae98ca4064b252139d314a12d5.sock for RPC Sleep timed out after 0.050s (ON_OUTBOUND_QUEUE), seconds elapsed: 0.05113
[ OK ] Parameters/TestRpc.TestCallTimeoutDoesntAffectNegotiation/SSL_UnixSocket (544 ms)
[ RUN ] Parameters/TestRpc.TestRpcHandlerLatencyMetric/SSL_UnixSocket
I20260924 12:47:00.626679 3087 acceptor_pool.cc:254] collecting diagnostics on the listening RPC socket unix:/tmp/dist-test-task_x2zHM/test-tmp/rpc-test-531e898abb114e4c9d9cd6f767228955.sock every 8 connection(s)
I20260924 12:47:00.626947 3088 acceptor_pool.cc:254] collecting diagnostics on the listening RPC socket unix:/tmp/dist-test-task_x2zHM/test-tmp/rpc-test-531e898abb114e4c9d9cd6f767228955.sock every 8 connection(s)
I20260924 12:47:00.673718 2770 rpc-test.cc:1236] Sleep() min lat: 20587
I20260924 12:47:00.673820 2770 rpc-test.cc:1237] Sleep() mean lat: 20587
I20260924 12:47:00.673861 2770 rpc-test.cc:1238] Sleep() max lat: 20587
I20260924 12:47:00.673880 2770 rpc-test.cc:1239] Sleep() #calls: 1
[ OK ] Parameters/TestRpc.TestRpcHandlerLatencyMetric/SSL_UnixSocket (75 ms)
[ RUN ] Parameters/TestRpc.TimedOutOnResponseMetricServiceQueue/SSL_UnixSocket
I20260924 12:47:00.697367 3113 acceptor_pool.cc:254] collecting diagnostics on the listening RPC socket unix:/tmp/dist-test-task_x2zHM/test-tmp/rpc-test-f1d9abc0d5a74a94905b1b42474fed3f.sock every 8 connection(s)
I20260924 12:47:00.697597 3114 acceptor_pool.cc:254] collecting diagnostics on the listening RPC socket unix:/tmp/dist-test-task_x2zHM/test-tmp/rpc-test-f1d9abc0d5a74a94905b1b42474fed3f.sock every 8 connection(s)
W20260924 12:47:00.757881 3115 rpcz_store.cc:267] Call kudu.rpc_test.CalculatorService.Sleep from unix:<unnamed> (request call id 2) took 20 ms (client timeout 20 ms). Trace:
W20260924 12:47:00.758039 3115 rpcz_store.cc:269] 0924 12:47:00.737377 (+ 0us) service_pool.cc:170] Inserting onto call queue
0924 12:47:00.757797 (+ 20420us) service_pool.cc:214] Skipping call since client already timed out
0924 12:47:00.757852 (+ 55us) inbound_call.cc:173] Queueing failure response
Metrics: {}
[ OK ] Parameters/TestRpc.TimedOutOnResponseMetricServiceQueue/SSL_UnixSocket (83 ms)
[ RUN ] Parameters/TestRpc.RpcPendingConnectionsMetric/SSL_UnixSocket
I20260924 12:47:00.767521 3136 acceptor_pool.cc:254] collecting diagnostics on the listening RPC socket 0.0.0.0:46571 every 8 connection(s)
I20260924 12:47:00.767729 3137 acceptor_pool.cc:254] collecting diagnostics on the listening RPC socket 0.0.0.0:46571 every 8 connection(s)
W20260924 12:47:00.769718 3132 negotiation.cc:337] Failed RPC negotiation. Trace:
0924 12:47:00.769136 (+ 0us) reactor.cc:625] Submitting negotiation task for server connection from 127.0.0.1:54886 (local address 127.0.0.1:46571)
0924 12:47:00.769311 (+ 175us) server_negotiation.cc:206] Beginning negotiation
0924 12:47:00.769315 (+ 4us) server_negotiation.cc:399] Waiting for connection header
0924 12:47:00.769435 (+ 120us) negotiation.cc:327] Negotiation complete: Network error: Server connection negotiation failed: server connection from 127.0.0.1:54886: BlockingRecv error: recv got EOF from 127.0.0.1:54886 (error 108)
Metrics: {"server-negotiator.queue_time_us":54}
[ OK ] Parameters/TestRpc.RpcPendingConnectionsMetric/SSL_UnixSocket (19 ms)
[ RUN ] Parameters/TestRpc.TestRpcContextClientDeadline/SSL_UnixSocket
I20260924 12:47:00.807433 3152 acceptor_pool.cc:254] collecting diagnostics on the listening RPC socket unix:/tmp/dist-test-task_x2zHM/test-tmp/rpc-test-25f941dee57c4c40a40e5eae439d1003.sock every 8 connection(s)
I20260924 12:47:00.807657 3153 acceptor_pool.cc:254] collecting diagnostics on the listening RPC socket unix:/tmp/dist-test-task_x2zHM/test-tmp/rpc-test-25f941dee57c4c40a40e5eae439d1003.sock every 8 connection(s)
[ OK ] Parameters/TestRpc.TestRpcContextClientDeadline/SSL_UnixSocket (70 ms)
[ RUN ] Parameters/TestRpc.TestApplicationFeatureFlagUnsupportedServer/SSL_UnixSocket
I20260924 12:47:00.862430 3177 acceptor_pool.cc:254] collecting diagnostics on the listening RPC socket unix:/tmp/dist-test-task_x2zHM/test-tmp/rpc-test-8536f57ed66949098b3946b72b38c453.sock every 8 connection(s)
I20260924 12:47:00.862649 3178 acceptor_pool.cc:254] collecting diagnostics on the listening RPC socket unix:/tmp/dist-test-task_x2zHM/test-tmp/rpc-test-8536f57ed66949098b3946b72b38c453.sock every 8 connection(s)
W20260924 12:47:00.890364 3174 connection.cc:196] Error closing socket: Network error: TlsSocket::Close: Broken pipe
[ OK ] Parameters/TestRpc.TestApplicationFeatureFlagUnsupportedServer/SSL_UnixSocket (40 ms)
[ RUN ] Parameters/TestRpc.TestCancellationAsync/SSL_UnixSocket
I20260924 12:47:00.908658 3202 acceptor_pool.cc:254] collecting diagnostics on the listening RPC socket unix:/tmp/dist-test-task_x2zHM/test-tmp/rpc-test-d179e4fbdfdf425ebd364c1aeb3643a8.sock every 8 connection(s)
I20260924 12:47:00.908886 3203 acceptor_pool.cc:254] collecting diagnostics on the listening RPC socket unix:/tmp/dist-test-task_x2zHM/test-tmp/rpc-test-d179e4fbdfdf425ebd364c1aeb3643a8.sock every 8 connection(s)
I20260924 12:47:00.909778 2770 rpc-test.cc:1716] Connecting to unix:/tmp/dist-test-task_x2zHM/test-tmp/rpc-test-d179e4fbdfdf425ebd364c1aeb3643a8.sock
I20260924 12:47:00.924705 2770 test_util.cc:268] Using random seed: -17197812
I20260924 12:47:00.960942 3206 rpc-test-base.h:240] got call: sleep_micros: 500 pattern: 4294967295 num_repetitions: 2097152 sidecar_idx: 0
I20260924 12:47:00.995477 3206 rpc-test-base.h:240] got call: sleep_micros: 500 pattern: 4294967295 num_repetitions: 2097152 sidecar_idx: 0
I20260924 12:47:01.027395 3206 rpc-test-base.h:240] got call: sleep_micros: 500 pattern: 4294967295 num_repetitions: 2097152 sidecar_idx: 0
I20260924 12:47:01.061148 3206 rpc-test-base.h:240] got call: sleep_micros: 500 pattern: 4294967295 num_repetitions: 2097152 sidecar_idx: 0
I20260924 12:47:01.087106 3205 rpc-test-base.h:240] got call: sleep_micros: 500 pattern: 4294967295 num_repetitions: 2097152 sidecar_idx: 0
I20260924 12:47:01.116946 3206 rpc-test-base.h:240] got call: sleep_micros: 500 pattern: 4294967295 num_repetitions: 2097152 sidecar_idx: 0
I20260924 12:47:01.145850 3205 rpc-test-base.h:240] got call: sleep_micros: 500 pattern: 4294967295 num_repetitions: 2097152 sidecar_idx: 0
W20260924 12:47:01.148356 3199 connection.cc:196] Error closing socket: Network error: TlsSocket::Close: Broken pipe
W20260924 12:47:01.163388 3199 connection.cc:441] server connection from unix:<unnamed> torn down before Call kudu.rpc.GenericCalculatorService.SleepWithSidecar from unix:<unnamed> (request call id 8) could send its response
W20260924 12:47:01.178524 3199 connection.cc:441] server connection from unix:<unnamed> torn down before Call kudu.rpc.GenericCalculatorService.SleepWithSidecar from unix:<unnamed> (request call id 9) could send its response
[ OK ] Parameters/TestRpc.TestCancellationAsync/SSL_UnixSocket (288 ms)
[ RUN ] Parameters/TestRpc.TestPerformanceBySocketType/SSL_UnixSocket
I20260924 12:47:01.203187 3227 acceptor_pool.cc:254] collecting diagnostics on the listening RPC socket unix:/tmp/dist-test-task_x2zHM/test-tmp/rpc-test-f9af51e8699546e3a48230d4a3761cce.sock every 8 connection(s)
I20260924 12:47:01.203398 3228 acceptor_pool.cc:254] collecting diagnostics on the listening RPC socket unix:/tmp/dist-test-task_x2zHM/test-tmp/rpc-test-f9af51e8699546e3a48230d4a3761cce.sock every 8 connection(s)
I20260924 12:47:01.204452 2770 rpc-test.cc:1846] Connecting to unix:/tmp/dist-test-task_x2zHM/test-tmp/rpc-test-f9af51e8699546e3a48230d4a3761cce.sock
I20260924 12:47:04.508642 2770 rpc-test.cc:1859] Sending 1024MB via ssl-enabled unix socket: real 3.242s user 3.209s sys 2.320s
I20260924 12:47:07.720638 2770 rpc-test.cc:1859] Sending 1024MB via ssl-enabled unix socket: real 3.212s user 3.248s sys 2.223s
I20260924 12:47:10.838317 2770 rpc-test.cc:1859] Sending 1024MB via ssl-enabled unix socket: real 3.118s user 3.019s sys 2.282s
I20260924 12:47:13.879230 2770 rpc-test.cc:1859] Sending 1024MB via ssl-enabled unix socket: real 3.041s user 2.949s sys 2.207s
I20260924 12:47:17.006435 2770 rpc-test.cc:1859] Sending 1024MB via ssl-enabled unix socket: real 3.127s user 3.119s sys 2.171s
W20260924 12:47:17.008225 3224 connection.cc:196] Error closing socket: Network error: TlsSocket::Close: Broken pipe
[ OK ] Parameters/TestRpc.TestPerformanceBySocketType/SSL_UnixSocket (15833 ms)
[----------] 20 tests from Parameters/TestRpc (51295 ms total)
[----------] 1 test from Parameters/TestRpcSocketTxRxQueue
[ RUN ] Parameters/TestRpcSocketTxRxQueue.AcceptorRxQueueSizeMetric/0
I20260924 12:47:17.019740 3252 acceptor_pool.cc:254] collecting diagnostics on the listening RPC socket 0.0.0.0:39487 every 1 connection(s)
I20260924 12:47:17.020036 3253 acceptor_pool.cc:254] collecting diagnostics on the listening RPC socket 0.0.0.0:39487 every 1 connection(s)
W20260924 12:47:17.021716 3248 negotiation.cc:337] Failed RPC negotiation. Trace:
0924 12:47:17.021309 (+ 0us) reactor.cc:625] Submitting negotiation task for server connection from 127.0.0.1:34812 (local address 127.0.0.1:39487)
0924 12:47:17.021473 (+ 164us) server_negotiation.cc:206] Beginning negotiation
0924 12:47:17.021476 (+ 3us) server_negotiation.cc:399] Waiting for connection header
0924 12:47:17.021609 (+ 133us) negotiation.cc:327] Negotiation complete: Network error: Server connection negotiation failed: server connection from 127.0.0.1:34812: BlockingRecv error: recv got EOF from 127.0.0.1:34812 (error 108)
Metrics: {"server-negotiator.queue_time_us":44}
[ OK ] Parameters/TestRpcSocketTxRxQueue.AcceptorRxQueueSizeMetric/0 (9 ms)
[----------] 1 test from Parameters/TestRpcSocketTxRxQueue (9 ms total)
[----------] Global test environment tear-down
[==========] 21 tests from 2 test suites ran. (51306 ms total)
[ PASSED ] 20 tests.
[ FAILED ] 1 test, listed below:
[ FAILED ] Parameters/TestRpc.TestCallWithChainCertAndChainCA/SSL_UnixSocket, where GetParam() = (true, true)
1 FAILED TEST