Diagnosed failure

Parameters/TestRpc.TestCallWithChainCertAndRootCA/SSL_UnixSocket: /data0/somelongdirectorytoavoidrpathissues/src/kudu/src/kudu/rpc/rpc-test.cc:303: Failure
Failed
Bad status: Runtime error: could not verify certificate chain (error with cert: subject=CN = localhost, ST = sadfjas, C = AS, emailAddress = sdflkdsajf, O = lskdfjlsad, OU = sldfkja, issuer=C = AS, ST = ASDfkjdhf, L = lskdjf, O = saldfja, OU = skdjf, CN = localhost, emailAddress = sadjflkadsj): : certificate has expired
Google Test trace:
/data0/somelongdirectorytoavoidrpathissues/src/kudu/src/kudu/rpc/rpc-test.cc:300: Connecting to unix:/tmp/dist-test-task6A3l99/test-tmp/rpc-test-83c28778966148caaf12b41fce5ecc38.sock
I20260927 19:38:13.674546  5827 test_util.cc:175] -----------------------------------------------
I20260927 19:38:13.674753  5827 test_util.cc:176] Had fatal failures, leaving test files at /tmp/dist-test-task6A3l99/test-tmp/rpc-test.2.Parameters_TestRpc.TestCallWithChainCertAndRootCA_SSL_UnixSocket.1790537890026778-5827-0

Full log

Note: This is test shard 3 of 8.
[==========] Running 21 tests from 2 test suites.
[----------] Global test environment set-up.
[----------] 1 test from TestRpc
[ RUN      ] TestRpc.TestNegotiationTimeout
WARNING: Logging before InitGoogleLogging() is written to STDERR
I20260927 19:38:10.223224  5827 rpc-test-base.h:595] status: Timed out: connection negotiation to 0.0.0.0:39707 for RPC Sleep timed out after 0.100s (ON_OUTBOUND_QUEUE), seconds elapsed: 0.101314
W20260927 19:38:13.375576  5837 negotiation.cc:337] Failed RPC negotiation. Trace:
0927 19:38:10.123027 (+     0us) reactor.cc:625] Submitting negotiation task for client connection to 0.0.0.0:39707 (local address 127.0.0.1:38910)
0927 19:38:10.123902 (+   875us) negotiation.cc:107] Waiting for socket to connect
0927 19:38:10.123959 (+    57us) client_negotiation.cc:174] Beginning negotiation
0927 19:38:10.138995 (+ 15036us) client_negotiation.cc:252] Sending NEGOTIATE NegotiatePB request
0927 19:38:13.374274 (+3235279us) negotiation.cc:327] Negotiation complete: Timed out: Client connection negotiation failed: client connection to 0.0.0.0:39707: received 0 of 4 requested bytes
Metrics: {"client-negotiator.queue_time_us":251}
[       OK ] TestRpc.TestNegotiationTimeout (3297 ms)
[----------] 1 test from TestRpc (3297 ms total)

[----------] 20 tests from Parameters/TestRpc
[ RUN      ] Parameters/TestRpc.TestAcceptorPoolStartStop/SSL_UnixSocket
I20260927 19:38:13.416257  5853 acceptor_pool.cc:254] collecting diagnostics on the listening RPC socket unix:/tmp/dist-test-task6A3l99/test-tmp/rpc-test-c1d097e3f87b4694bb7689cbbac90818.sock every 8 connection(s)
I20260927 19:38:13.417824  5854 acceptor_pool.cc:254] collecting diagnostics on the listening RPC socket unix:/tmp/dist-test-task6A3l99/test-tmp/rpc-test-c1d097e3f87b4694bb7689cbbac90818.sock every 8 connection(s)
I20260927 19:38:13.451476  5864 acceptor_pool.cc:254] collecting diagnostics on the listening RPC socket unix:/tmp/dist-test-task6A3l99/test-tmp/rpc-test-c1d097e3f87b4694bb7689cbbac90818.sock every 8 connection(s)
I20260927 19:38:13.452905  5865 acceptor_pool.cc:254] collecting diagnostics on the listening RPC socket unix:/tmp/dist-test-task6A3l99/test-tmp/rpc-test-c1d097e3f87b4694bb7689cbbac90818.sock every 8 connection(s)
I20260927 19:38:13.480425  5875 acceptor_pool.cc:254] collecting diagnostics on the listening RPC socket unix:/tmp/dist-test-task6A3l99/test-tmp/rpc-test-c1d097e3f87b4694bb7689cbbac90818.sock every 8 connection(s)
I20260927 19:38:13.481107  5876 acceptor_pool.cc:254] collecting diagnostics on the listening RPC socket unix:/tmp/dist-test-task6A3l99/test-tmp/rpc-test-c1d097e3f87b4694bb7689cbbac90818.sock every 8 connection(s)
I20260927 19:38:13.501843  5886 acceptor_pool.cc:254] collecting diagnostics on the listening RPC socket unix:/tmp/dist-test-task6A3l99/test-tmp/rpc-test-c1d097e3f87b4694bb7689cbbac90818.sock every 8 connection(s)
I20260927 19:38:13.502553  5887 acceptor_pool.cc:254] collecting diagnostics on the listening RPC socket unix:/tmp/dist-test-task6A3l99/test-tmp/rpc-test-c1d097e3f87b4694bb7689cbbac90818.sock every 8 connection(s)
I20260927 19:38:13.524928  5897 acceptor_pool.cc:254] collecting diagnostics on the listening RPC socket unix:/tmp/dist-test-task6A3l99/test-tmp/rpc-test-c1d097e3f87b4694bb7689cbbac90818.sock every 8 connection(s)
I20260927 19:38:13.525667  5898 acceptor_pool.cc:254] collecting diagnostics on the listening RPC socket unix:/tmp/dist-test-task6A3l99/test-tmp/rpc-test-c1d097e3f87b4694bb7689cbbac90818.sock every 8 connection(s)
[       OK ] Parameters/TestRpc.TestAcceptorPoolStartStop/SSL_UnixSocket (149 ms)
[ RUN      ] Parameters/TestRpc.TestCall/SSL_UnixSocket
I20260927 19:38:13.561411  5910 acceptor_pool.cc:254] collecting diagnostics on the listening RPC socket unix:/tmp/dist-test-task6A3l99/test-tmp/rpc-test-375b1409ddaf469db42f520c98b3a0f1.sock every 8 connection(s)
I20260927 19:38:13.563287  5911 acceptor_pool.cc:254] collecting diagnostics on the listening RPC socket unix:/tmp/dist-test-task6A3l99/test-tmp/rpc-test-375b1409ddaf469db42f520c98b3a0f1.sock every 8 connection(s)
I20260927 19:38:13.568738  5827 rpc-test.cc:234] Connecting to unix:/tmp/dist-test-task6A3l99/test-tmp/rpc-test-375b1409ddaf469db42f520c98b3a0f1.sock
W20260927 19:38:13.622915  5907 connection.cc:196] Error closing socket: Network error: TlsSocket::Close: Broken pipe
[       OK ] Parameters/TestRpc.TestCall/SSL_UnixSocket (98 ms)
[ RUN      ] Parameters/TestRpc.TestCallWithChainCertAndRootCA/SSL_UnixSocket
I20260927 19:38:13.650944  5935 acceptor_pool.cc:254] collecting diagnostics on the listening RPC socket unix:/tmp/dist-test-task6A3l99/test-tmp/rpc-test-83c28778966148caaf12b41fce5ecc38.sock every 8 connection(s)
I20260927 19:38:13.651737  5936 acceptor_pool.cc:254] collecting diagnostics on the listening RPC socket unix:/tmp/dist-test-task6A3l99/test-tmp/rpc-test-83c28778966148caaf12b41fce5ecc38.sock every 8 connection(s)
/data0/somelongdirectorytoavoidrpathissues/src/kudu/src/kudu/rpc/rpc-test.cc:303: Failure
Failed
Bad status: Runtime error: could not verify certificate chain (error with cert: subject=CN = localhost, ST = sadfjas, C = AS, emailAddress = sdflkdsajf, O = lskdfjlsad, OU = sldfkja, issuer=C = AS, ST = ASDfkjdhf, L = lskdjf, O = saldfja, OU = skdjf, CN = localhost, emailAddress = sadjflkadsj): : certificate has expired
Google Test trace:
/data0/somelongdirectorytoavoidrpathissues/src/kudu/src/kudu/rpc/rpc-test.cc:300: Connecting to unix:/tmp/dist-test-task6A3l99/test-tmp/rpc-test-83c28778966148caaf12b41fce5ecc38.sock
I20260927 19:38:13.674546  5827 test_util.cc:175] -----------------------------------------------
I20260927 19:38:13.674753  5827 test_util.cc:176] Had fatal failures, leaving test files at /tmp/dist-test-task6A3l99/test-tmp/rpc-test.2.Parameters_TestRpc.TestCallWithChainCertAndRootCA_SSL_UnixSocket.1790537890026778-5827-0
[  FAILED  ] Parameters/TestRpc.TestCallWithChainCertAndRootCA/SSL_UnixSocket, where GetParam() = (true, true) (46 ms)
[ RUN      ] Parameters/TestRpc.TestCallWithBadPasswordProtectedKey/SSL_UnixSocket
[       OK ] Parameters/TestRpc.TestCallWithBadPasswordProtectedKey/SSL_UnixSocket (34 ms)
[ RUN      ] Parameters/TestRpc.TestInvalidMethodCall/SSL_UnixSocket
I20260927 19:38:13.731523  5972 acceptor_pool.cc:254] collecting diagnostics on the listening RPC socket unix:/tmp/dist-test-task6A3l99/test-tmp/rpc-test-1b142ccbbca441b29454878242ab627e.sock every 8 connection(s)
I20260927 19:38:13.732328  5973 acceptor_pool.cc:254] collecting diagnostics on the listening RPC socket unix:/tmp/dist-test-task6A3l99/test-tmp/rpc-test-1b142ccbbca441b29454878242ab627e.sock every 8 connection(s)
I20260927 19:38:13.735916  5827 rpc-test.cc:406] Connecting to unix:/tmp/dist-test-task6A3l99/test-tmp/rpc-test-1b142ccbbca441b29454878242ab627e.sock
W20260927 19:38:13.767477  5969 connection.cc:196] Error closing socket: Network error: TlsSocket::Close: Broken pipe
[       OK ] Parameters/TestRpc.TestInvalidMethodCall/SSL_UnixSocket (65 ms)
[ RUN      ] Parameters/TestRpc.TestHighFDs/SSL_UnixSocket
I20260927 19:38:13.982411  5997 acceptor_pool.cc:254] collecting diagnostics on the listening RPC socket unix:/tmp/dist-test-task6A3l99/test-tmp/rpc-test-98fec4b7a36f4b6eaed07994a6b07d51.sock every 8 connection(s)
I20260927 19:38:13.983109  5998 acceptor_pool.cc:254] collecting diagnostics on the listening RPC socket unix:/tmp/dist-test-task6A3l99/test-tmp/rpc-test-98fec4b7a36f4b6eaed07994a6b07d51.sock every 8 connection(s)
[       OK ] Parameters/TestRpc.TestHighFDs/SSL_UnixSocket (271 ms)
[ RUN      ] Parameters/TestRpc.TestConnectionAlwaysKeepalive/SSL_UnixSocket
I20260927 19:38:14.079404  6020 acceptor_pool.cc:254] collecting diagnostics on the listening RPC socket unix:/tmp/dist-test-task6A3l99/test-tmp/rpc-test-f80dc8a1d00f4e70a2a47123112b6603.sock every 8 connection(s)
I20260927 19:38:14.080147  6021 acceptor_pool.cc:254] collecting diagnostics on the listening RPC socket unix:/tmp/dist-test-task6A3l99/test-tmp/rpc-test-f80dc8a1d00f4e70a2a47123112b6603.sock every 8 connection(s)
I20260927 19:38:14.083580  5827 rpc-test.cc:532] Connecting to unix:/tmp/dist-test-task6A3l99/test-tmp/rpc-test-f80dc8a1d00f4e70a2a47123112b6603.sock
[       OK ] Parameters/TestRpc.TestConnectionAlwaysKeepalive/SSL_UnixSocket (3078 ms)
[ RUN      ] Parameters/TestRpc.TestReopenOutboundConnections/SSL_UnixSocket
I20260927 19:38:17.151618  6043 acceptor_pool.cc:254] collecting diagnostics on the listening RPC socket unix:/tmp/dist-test-task6A3l99/test-tmp/rpc-test-b7832431e9244ebfb7cc0caaa947d9b6.sock every 8 connection(s)
I20260927 19:38:17.152374  6044 acceptor_pool.cc:254] collecting diagnostics on the listening RPC socket unix:/tmp/dist-test-task6A3l99/test-tmp/rpc-test-b7832431e9244ebfb7cc0caaa947d9b6.sock every 8 connection(s)
I20260927 19:38:17.155949  5827 rpc-test.cc:658] Connecting to unix:/tmp/dist-test-task6A3l99/test-tmp/rpc-test-b7832431e9244ebfb7cc0caaa947d9b6.sock
W20260927 19:38:17.206252  6042 connection.cc:196] Error closing socket: Network error: TlsSocket::Close: Broken pipe
W20260927 19:38:17.217453  6042 connection.cc:196] Error closing socket: Network error: TlsSocket::Close: Broken pipe
W20260927 19:38:17.227797  6042 connection.cc:196] Error closing socket: Network error: TlsSocket::Close: Broken pipe
W20260927 19:38:17.238337  6042 connection.cc:196] Error closing socket: Network error: TlsSocket::Close: Broken pipe
W20260927 19:38:17.249362  6042 connection.cc:196] Error closing socket: Network error: TlsSocket::Close: Broken pipe
W20260927 19:38:17.260389  6042 connection.cc:196] Error closing socket: Network error: TlsSocket::Close: Broken pipe
W20260927 19:38:17.271134  6042 connection.cc:196] Error closing socket: Network error: TlsSocket::Close: Broken pipe
W20260927 19:38:17.281898  6042 connection.cc:196] Error closing socket: Network error: TlsSocket::Close: Broken pipe
W20260927 19:38:17.292527  6042 connection.cc:196] Error closing socket: Network error: TlsSocket::Close: Broken pipe
W20260927 19:38:17.303040  6042 connection.cc:196] Error closing socket: Network error: TlsSocket::Close: Broken pipe
W20260927 19:38:17.313588  6042 connection.cc:196] Error closing socket: Network error: TlsSocket::Close: Broken pipe
W20260927 19:38:17.324257  6042 connection.cc:196] Error closing socket: Network error: TlsSocket::Close: Broken pipe
W20260927 19:38:17.334993  6042 connection.cc:196] Error closing socket: Network error: TlsSocket::Close: Broken pipe
W20260927 19:38:17.346014  6043 acceptor_pool.cc:285] unable to collect diagnostics on RPC socket unix:/tmp/dist-test-task6A3l99/test-tmp/rpc-test-b7832431e9244ebfb7cc0caaa947d9b6.sock: Not implemented: netlink diagnostics is currently supported only on IPv4 TCP sockets
W20260927 19:38:17.346105  6042 connection.cc:196] Error closing socket: Network error: TlsSocket::Close: Broken pipe
W20260927 19:38:17.357234  6042 connection.cc:196] Error closing socket: Network error: TlsSocket::Close: Broken pipe
W20260927 19:38:17.367498  6042 connection.cc:196] Error closing socket: Network error: TlsSocket::Close: Broken pipe
W20260927 19:38:17.378098  6042 connection.cc:196] Error closing socket: Network error: TlsSocket::Close: Broken pipe
W20260927 19:38:17.389323  6042 connection.cc:196] Error closing socket: Network error: TlsSocket::Close: Broken pipe
W20260927 19:38:17.400246  6042 connection.cc:196] Error closing socket: Network error: TlsSocket::Close: Broken pipe
W20260927 19:38:17.411783  6042 connection.cc:196] Error closing socket: Network error: TlsSocket::Close: Broken pipe
W20260927 19:38:17.423065  6042 connection.cc:196] Error closing socket: Network error: TlsSocket::Close: Broken pipe
W20260927 19:38:17.434649  6042 connection.cc:196] Error closing socket: Network error: TlsSocket::Close: Broken pipe
W20260927 19:38:17.446314  6042 connection.cc:196] Error closing socket: Network error: TlsSocket::Close: Broken pipe
W20260927 19:38:17.457207  6042 connection.cc:196] Error closing socket: Network error: TlsSocket::Close: Broken pipe
W20260927 19:38:17.468128  6042 connection.cc:196] Error closing socket: Network error: TlsSocket::Close: Broken pipe
W20260927 19:38:17.478667  6042 connection.cc:196] Error closing socket: Network error: TlsSocket::Close: Broken pipe
W20260927 19:38:17.492650  6042 connection.cc:196] Error closing socket: Network error: TlsSocket::Close: Broken pipe
W20260927 19:38:17.503057  6042 connection.cc:196] Error closing socket: Network error: TlsSocket::Close: Broken pipe
W20260927 19:38:17.513661  6042 connection.cc:196] Error closing socket: Network error: TlsSocket::Close: Broken pipe
W20260927 19:38:17.524117  6042 connection.cc:196] Error closing socket: Network error: TlsSocket::Close: Broken pipe
W20260927 19:38:17.534128  6042 connection.cc:196] Error closing socket: Network error: TlsSocket::Close: Broken pipe
W20260927 19:38:17.547513  6042 connection.cc:196] Error closing socket: Network error: TlsSocket::Close: Broken pipe
[       OK ] Parameters/TestRpc.TestReopenOutboundConnections/SSL_UnixSocket (428 ms)
[ RUN      ] Parameters/TestRpc.TestConnectionNetworkPlane/SSL_UnixSocket
I20260927 19:38:17.581399  6066 acceptor_pool.cc:254] collecting diagnostics on the listening RPC socket unix:/tmp/dist-test-task6A3l99/test-tmp/rpc-test-e80e72d169554461b9b10f7c222d0bc2.sock every 8 connection(s)
I20260927 19:38:17.582077  6067 acceptor_pool.cc:254] collecting diagnostics on the listening RPC socket unix:/tmp/dist-test-task6A3l99/test-tmp/rpc-test-e80e72d169554461b9b10f7c222d0bc2.sock every 8 connection(s)
I20260927 19:38:17.585253  5827 rpc-test.cc:772] Connecting to unix:/tmp/dist-test-task6A3l99/test-tmp/rpc-test-e80e72d169554461b9b10f7c222d0bc2.sock
W20260927 19:38:17.626801  6065 connection.cc:196] Error closing socket: Network error: TlsSocket::Close: Broken pipe
[       OK ] Parameters/TestRpc.TestConnectionNetworkPlane/SSL_UnixSocket (78 ms)
[ RUN      ] Parameters/TestRpc.TestTCPKeepalive/SSL_UnixSocket
I20260927 19:38:17.661720  6091 acceptor_pool.cc:254] collecting diagnostics on the listening RPC socket unix:/tmp/dist-test-task6A3l99/test-tmp/rpc-test-dd9e99c84f524bddb9c2da32e83cf602.sock every 8 connection(s)
I20260927 19:38:17.662446  6092 acceptor_pool.cc:254] collecting diagnostics on the listening RPC socket unix:/tmp/dist-test-task6A3l99/test-tmp/rpc-test-dd9e99c84f524bddb9c2da32e83cf602.sock every 8 connection(s)
I20260927 19:38:17.699076  6095 rpc-test-base.h:222] got call: sleep_micros: 8000000 deferred: true
I20260927 19:38:25.703426  6095 rpcz_store.cc:275] Call kudu.rpc.GenericCalculatorService.Sleep from unix:<unnamed> (request call id 0) took 8004 ms. Trace:
I20260927 19:38:25.703860  6095 rpcz_store.cc:276] 0927 19:38:17.698884 (+     0us) service_pool.cc:170] Inserting onto call queue
0927 19:38:17.699001 (+   117us) service_pool.cc:227] Handling call
0927 19:38:25.703251 (+8004250us) inbound_call.cc:173] Queueing success response
Metrics: {}
W20260927 19:38:25.712698  6088 connection.cc:196] Error closing socket: Network error: TlsSocket::Close: Broken pipe
[       OK ] Parameters/TestRpc.TestTCPKeepalive/SSL_UnixSocket (8088 ms)
[ RUN      ] Parameters/TestRpc.TestMaxSmallSidecars/SSL_UnixSocket
I20260927 19:38:25.764938  6117 acceptor_pool.cc:254] collecting diagnostics on the listening RPC socket unix:/tmp/dist-test-task6A3l99/test-tmp/rpc-test-40c39a82e5da4dfda68d7b6370fa8ac7.sock every 8 connection(s)
I20260927 19:38:25.765789  6118 acceptor_pool.cc:254] collecting diagnostics on the listening RPC socket unix:/tmp/dist-test-task6A3l99/test-tmp/rpc-test-40c39a82e5da4dfda68d7b6370fa8ac7.sock every 8 connection(s)
W20260927 19:38:25.961760  6114 connection.cc:196] Error closing socket: Network error: TlsSocket::Close: Broken pipe
[       OK ] Parameters/TestRpc.TestMaxSmallSidecars/SSL_UnixSocket (247 ms)
[ RUN      ] Parameters/TestRpc.TestCallTimeout/SSL_UnixSocket
I20260927 19:38:25.987965  6142 acceptor_pool.cc:254] collecting diagnostics on the listening RPC socket unix:/tmp/dist-test-task6A3l99/test-tmp/rpc-test-037e1c2b05904883b2d5121ee5bf9e38.sock every 8 connection(s)
I20260927 19:38:25.988694  6143 acceptor_pool.cc:254] collecting diagnostics on the listening RPC socket unix:/tmp/dist-test-task6A3l99/test-tmp/rpc-test-037e1c2b05904883b2d5121ee5bf9e38.sock every 8 connection(s)
I20260927 19:38:26.022812  5827 rpc-test-base.h:595] status: Timed out: connection negotiation to unix:/tmp/dist-test-task6A3l99/test-tmp/rpc-test-037e1c2b05904883b2d5121ee5bf9e38.sock for RPC Sleep timed out after 0.000s (ON_OUTBOUND_QUEUE), seconds elapsed: 0.00308571
I20260927 19:38:26.030629  6146 rpc-test-base.h:222] got call: sleep_micros: 700000
I20260927 19:38:26.224480  5827 rpc-test-base.h:595] status: Timed out: Sleep RPC to unix:/tmp/dist-test-task6A3l99/test-tmp/rpc-test-037e1c2b05904883b2d5121ee5bf9e38.sock timed out after 0.200s (SENT), seconds elapsed: 0.201178
I20260927 19:38:26.226204  6145 rpc-test-base.h:222] got call: sleep_micros: 2000000
W20260927 19:38:26.731315  6146 rpcz_store.cc:267] Call kudu.rpc.GenericCalculatorService.Sleep from unix:<unnamed> (request call id 1) took 701 ms (client timeout 200 ms). Trace:
W20260927 19:38:26.731669  6146 rpcz_store.cc:269] 0927 19:38:26.030390 (+     0us) service_pool.cc:170] Inserting onto call queue
0927 19:38:26.030548 (+   158us) service_pool.cc:227] Handling call
0927 19:38:26.731259 (+700711us) inbound_call.cc:173] Queueing success response
Metrics: {}
I20260927 19:38:27.727483  5827 rpc-test-base.h:595] status: Timed out: Sleep RPC to unix:/tmp/dist-test-task6A3l99/test-tmp/rpc-test-037e1c2b05904883b2d5121ee5bf9e38.sock timed out after 1.500s (SENT), seconds elapsed: 1.50257
W20260927 19:38:28.226833  6145 rpcz_store.cc:267] Call kudu.rpc.GenericCalculatorService.Sleep from unix:<unnamed> (request call id 2) took 2000 ms (client timeout 1500 ms). Trace:
W20260927 19:38:28.227195  6145 rpcz_store.cc:269] 0927 19:38:26.225953 (+     0us) service_pool.cc:170] Inserting onto call queue
0927 19:38:26.226139 (+   186us) service_pool.cc:227] Handling call
0927 19:38:28.226762 (+2000623us) inbound_call.cc:173] Queueing success response
Metrics: {}
W20260927 19:38:28.227761  6139 connection.cc:441] server connection from unix:<unnamed> torn down before Call kudu.rpc.GenericCalculatorService.Sleep from unix:<unnamed> (request call id 2) could send its response
[       OK ] Parameters/TestRpc.TestCallTimeout/SSL_UnixSocket (2265 ms)
[ RUN      ] Parameters/TestRpc.TestServerShutsDown/SSL_UnixSocket
I20260927 19:38:28.235594  5827 rpc-test.cc:1125] Connecting to 0.0.0.0:37039
W20260927 19:38:28.246151  6159 negotiation.cc:337] Failed RPC negotiation. Trace:
0927 19:38:28.244422 (+     0us) reactor.cc:625] Submitting negotiation task for client connection to 0.0.0.0:37039 (local address 127.0.0.1:52126)
0927 19:38:28.244983 (+   561us) negotiation.cc:107] Waiting for socket to connect
0927 19:38:28.245036 (+    53us) client_negotiation.cc:174] Beginning negotiation
0927 19:38:28.245293 (+   257us) client_negotiation.cc:252] Sending NEGOTIATE NegotiatePB request
0927 19:38:28.245611 (+   318us) negotiation.cc:327] Negotiation complete: Network error: Client connection negotiation failed: client connection to 0.0.0.0:37039: BlockingWrite error: write error: Broken pipe (error 32)
Metrics: {"client-negotiator.queue_time_us":171}
[       OK ] Parameters/TestRpc.TestServerShutsDown/SSL_UnixSocket (15 ms)
[ RUN      ] Parameters/TestRpc.TimedOutOnResponseMetric/SSL_UnixSocket
I20260927 19:38:28.279542  6176 acceptor_pool.cc:254] collecting diagnostics on the listening RPC socket unix:/tmp/dist-test-task6A3l99/test-tmp/rpc-test-46fa5d30941447b68c56b631e5a3bac3.sock every 8 connection(s)
I20260927 19:38:28.280332  6177 acceptor_pool.cc:254] collecting diagnostics on the listening RPC socket unix:/tmp/dist-test-task6A3l99/test-tmp/rpc-test-46fa5d30941447b68c56b631e5a3bac3.sock every 8 connection(s)
W20260927 19:38:28.524534  6180 rpcz_store.cc:267] Call kudu.rpc_test.CalculatorService.Sleep from unix:<unnamed> (request call id 3) took 50 ms (client timeout 25 ms). Trace:
W20260927 19:38:28.524893  6180 rpcz_store.cc:269] 0927 19:38:28.473859 (+     0us) service_pool.cc:170] Inserting onto call queue
0927 19:38:28.474002 (+   143us) service_pool.cc:227] Handling call
0927 19:38:28.524449 (+ 50447us) inbound_call.cc:173] Queueing success response
Related trace 'test_child':
Metrics: {"test_sleep_us":50000,"child_traces":[["test_child",{"related_trace_metric":1}]]}
W20260927 19:38:28.585127  6180 rpcz_store.cc:267] Call kudu.rpc_test.CalculatorService.Sleep from unix:<unnamed> (request call id 4) took 50 ms (client timeout 50 ms). Trace:
W20260927 19:38:28.585439  6180 rpcz_store.cc:269] 0927 19:38:28.534512 (+     0us) service_pool.cc:170] Inserting onto call queue
0927 19:38:28.534663 (+   151us) service_pool.cc:227] Handling call
0927 19:38:28.585054 (+ 50391us) inbound_call.cc:173] Queueing success response
Related trace 'test_child':
Metrics: {"test_sleep_us":50000,"child_traces":[["test_child",{"related_trace_metric":1}]]}
W20260927 19:38:28.589048  6173 connection.cc:196] Error closing socket: Network error: TlsSocket::Close: Broken pipe
[       OK ] Parameters/TestRpc.TimedOutOnResponseMetric/SSL_UnixSocket (345 ms)
[ RUN      ] Parameters/TestRpc.AcceptorDispatchingTimesMetric/SSL_UnixSocket
I20260927 19:38:28.605993  6201 acceptor_pool.cc:254] collecting diagnostics on the listening RPC socket 0.0.0.0:42501 every 8 connection(s)
I20260927 19:38:28.606788  6202 acceptor_pool.cc:254] collecting diagnostics on the listening RPC socket 0.0.0.0:42501 every 8 connection(s)
W20260927 19:38:28.612777  6197 negotiation.cc:337] Failed RPC negotiation. Trace:
0927 19:38:28.610807 (+     0us) reactor.cc:625] Submitting negotiation task for server connection from 127.0.0.1:45782 (local address 127.0.0.1:42501)
0927 19:38:28.611488 (+   681us) server_negotiation.cc:206] Beginning negotiation
0927 19:38:28.611521 (+    33us) server_negotiation.cc:399] Waiting for connection header
0927 19:38:28.611911 (+   390us) negotiation.cc:327] Negotiation complete: Network error: Server connection negotiation failed: server connection from 127.0.0.1:45782: BlockingRecv error: recv got EOF from 127.0.0.1:45782 (error 108)
Metrics: {"server-negotiator.queue_time_us":222}
[       OK ] Parameters/TestRpc.AcceptorDispatchingTimesMetric/SSL_UnixSocket (21 ms)
[ RUN      ] Parameters/TestRpc.TestRpcCallbackDestroysMessenger/SSL_UnixSocket
[       OK ] Parameters/TestRpc.TestRpcCallbackDestroysMessenger/SSL_UnixSocket (25 ms)
[ RUN      ] Parameters/TestRpc.TestApplicationFeatureFlag/SSL_UnixSocket
I20260927 19:38:28.660598  6226 acceptor_pool.cc:254] collecting diagnostics on the listening RPC socket unix:/tmp/dist-test-task6A3l99/test-tmp/rpc-test-f0b970010a66491cbb66062f21b8c7db.sock every 8 connection(s)
I20260927 19:38:28.661389  6227 acceptor_pool.cc:254] collecting diagnostics on the listening RPC socket unix:/tmp/dist-test-task6A3l99/test-tmp/rpc-test-f0b970010a66491cbb66062f21b8c7db.sock every 8 connection(s)
W20260927 19:38:28.694355  6223 messenger.cc:357] Unable to handle RPC call: Not implemented: call requires unsupported application feature flags: 99
W20260927 19:38:28.697690  6223 connection.cc:196] Error closing socket: Network error: TlsSocket::Close: Broken pipe
[       OK ] Parameters/TestRpc.TestApplicationFeatureFlag/SSL_UnixSocket (62 ms)
[ RUN      ] Parameters/TestRpc.TestCancellation/SSL_UnixSocket
I20260927 19:38:28.724210  6251 acceptor_pool.cc:254] collecting diagnostics on the listening RPC socket unix:/tmp/dist-test-task6A3l99/test-tmp/rpc-test-360997f17d64448cb9d5a508c498eebf.sock every 8 connection(s)
I20260927 19:38:28.724972  6252 acceptor_pool.cc:254] collecting diagnostics on the listening RPC socket unix:/tmp/dist-test-task6A3l99/test-tmp/rpc-test-360997f17d64448cb9d5a508c498eebf.sock every 8 connection(s)
I20260927 19:38:28.728361  5827 rpc-test.cc:1648] Connecting to unix:/tmp/dist-test-task6A3l99/test-tmp/rpc-test-360997f17d64448cb9d5a508c498eebf.sock
I20260927 19:38:28.838116  5827 rpc-test-base.h:595] status: Aborted: Sleep RPC to unix:/tmp/dist-test-task6A3l99/test-tmp/rpc-test-360997f17d64448cb9d5a508c498eebf.sock is cancelled in state READY, seconds elapsed: 0.000509421
I20260927 19:38:29.024789  5827 rpc-test-base.h:595] status: Aborted: Sleep RPC to unix:/tmp/dist-test-task6A3l99/test-tmp/rpc-test-360997f17d64448cb9d5a508c498eebf.sock is cancelled in state SENT, seconds elapsed: 0.00101206
I20260927 19:38:29.025111  6254 rpc-test-base.h:222] got call: sleep_micros: 510000
I20260927 19:38:29.213929  5827 rpc-test-base.h:595] status: Aborted: Sleep RPC to unix:/tmp/dist-test-task6A3l99/test-tmp/rpc-test-360997f17d64448cb9d5a508c498eebf.sock is cancelled in state SENT, seconds elapsed: 0.00102219
I20260927 19:38:29.214078  6253 rpc-test-base.h:222] got call: sleep_micros: 510000
I20260927 19:38:29.417955  5827 rpc-test-base.h:595] status: Aborted: Sleep RPC to unix:/tmp/dist-test-task6A3l99/test-tmp/rpc-test-360997f17d64448cb9d5a508c498eebf.sock is cancelled in state SENT, seconds elapsed: 0.00122474
W20260927 19:38:29.430034  6255 rpcz_store.cc:267] Call kudu.rpc.GenericCalculatorService.Sleep from unix:<unnamed> (request call id 11) took 11 ms (client timeout 10 ms). Trace:
W20260927 19:38:29.430398  6255 rpcz_store.cc:269] 0927 19:38:29.417949 (+     0us) service_pool.cc:170] Inserting onto call queue
0927 19:38:29.429636 (+ 11687us) service_pool.cc:214] Skipping call since client already timed out
0927 19:38:29.429749 (+   113us) inbound_call.cc:173] Queueing failure response
Metrics: {}
I20260927 19:38:29.430979  6255 rpc-test-base.h:222] got call: sleep_micros: 1500000
W20260927 19:38:29.535769  6254 rpcz_store.cc:267] Call kudu.rpc.GenericCalculatorService.Sleep from unix:<unnamed> (request call id 3) took 511 ms (client timeout 10 ms). Trace:
W20260927 19:38:29.536072  6254 rpcz_store.cc:269] 0927 19:38:29.024885 (+     0us) service_pool.cc:170] Inserting onto call queue
0927 19:38:29.025045 (+   160us) service_pool.cc:227] Handling call
0927 19:38:29.535711 (+510666us) inbound_call.cc:173] Queueing success response
Metrics: {}
W20260927 19:38:29.724743  6253 rpcz_store.cc:267] Call kudu.rpc.GenericCalculatorService.Sleep from unix:<unnamed> (request call id 7) took 510 ms (client timeout 10 ms). Trace:
W20260927 19:38:29.725111  6253 rpcz_store.cc:269] 0927 19:38:29.213914 (+     0us) service_pool.cc:170] Inserting onto call queue
0927 19:38:29.214027 (+   113us) service_pool.cc:227] Handling call
0927 19:38:29.724649 (+510622us) inbound_call.cc:173] Queueing success response
Metrics: {}
I20260927 19:38:30.420372  5827 rpc-test-base.h:595] status: Timed out: Sleep RPC to unix:/tmp/dist-test-task6A3l99/test-tmp/rpc-test-360997f17d64448cb9d5a508c498eebf.sock timed out after 1.000s (SENT), seconds elapsed: 1.00186
I20260927 19:38:30.422552  6253 rpc-test-base.h:222] got call: sleep_micros: 1500000
W20260927 19:38:30.931561  6255 rpcz_store.cc:267] Call kudu.rpc.GenericCalculatorService.Sleep from unix:<unnamed> (request call id 12) took 1512 ms (client timeout 1000 ms). Trace:
W20260927 19:38:30.931892  6255 rpcz_store.cc:269] 0927 19:38:29.419113 (+     0us) service_pool.cc:170] Inserting onto call queue
0927 19:38:29.430937 (+ 11824us) service_pool.cc:227] Handling call
0927 19:38:30.931430 (+1500493us) inbound_call.cc:173] Queueing success response
Metrics: {}
I20260927 19:38:31.422492  5827 rpc-test-base.h:595] status: Timed out: Sleep RPC to unix:/tmp/dist-test-task6A3l99/test-tmp/rpc-test-360997f17d64448cb9d5a508c498eebf.sock timed out after 1.000s (SENT), seconds elapsed: 1.00161
W20260927 19:38:31.424234  6248 messenger.cc:357] Unable to handle RPC call: Not implemented: call requires unsupported application feature flags: 99, 1
W20260927 19:38:31.425794  6248 messenger.cc:357] Unable to handle RPC call: Not implemented: call requires unsupported application feature flags: 99, 1
W20260927 19:38:31.663322  6248 connection.cc:196] Error closing socket: Network error: TlsSocket::Close: Broken pipe
W20260927 19:38:31.923214  6253 rpcz_store.cc:267] Call kudu.rpc.GenericCalculatorService.Sleep from unix:<unnamed> (request call id 13) took 1501 ms (client timeout 1000 ms). Trace:
W20260927 19:38:31.923521  6253 rpcz_store.cc:269] 0927 19:38:30.422150 (+     0us) service_pool.cc:170] Inserting onto call queue
0927 19:38:30.422368 (+   218us) service_pool.cc:227] Handling call
0927 19:38:31.923159 (+1500791us) inbound_call.cc:173] Queueing success response
Metrics: {}
W20260927 19:38:31.924153  6248 connection.cc:441] server connection from unix:<unnamed> torn down before Call kudu.rpc.GenericCalculatorService.Sleep from unix:<unnamed> (request call id 13) could send its response
[       OK ] Parameters/TestRpc.TestCancellation/SSL_UnixSocket (3228 ms)
[ RUN      ] Parameters/TestRpc.TestCancellationMultiThreads/SSL_UnixSocket
I20260927 19:38:31.976352  6277 acceptor_pool.cc:254] collecting diagnostics on the listening RPC socket unix:/tmp/dist-test-task6A3l99/test-tmp/rpc-test-04832a50b9ec4e199adcf43671fe08e0.sock every 8 connection(s)
I20260927 19:38:31.977144  6278 acceptor_pool.cc:254] collecting diagnostics on the listening RPC socket unix:/tmp/dist-test-task6A3l99/test-tmp/rpc-test-04832a50b9ec4e199adcf43671fe08e0.sock every 8 connection(s)
I20260927 19:38:31.980366  5827 rpc-test.cc:1808] Connecting to unix:/tmp/dist-test-task6A3l99/test-tmp/rpc-test-04832a50b9ec4e199adcf43671fe08e0.sock
I20260927 19:38:32.119433  6291 test_util.cc:268] Using random seed: 406155269
I20260927 19:38:32.120527  6292 test_util.cc:268] Using random seed: 406156468
I20260927 19:38:32.122117  6293 test_util.cc:268] Using random seed: 406157919
I20260927 19:38:32.123556  6294 test_util.cc:268] Using random seed: 406159476
I20260927 19:38:32.125118  6295 test_util.cc:268] Using random seed: 406160922
I20260927 19:38:32.126746  6296 test_util.cc:268] Using random seed: 406162542
I20260927 19:38:32.128299  6297 test_util.cc:268] Using random seed: 406164082
I20260927 19:38:32.130142  6298 test_util.cc:268] Using random seed: 406165941
I20260927 19:38:32.131582  6299 test_util.cc:268] Using random seed: 406167367
I20260927 19:38:32.132923  6300 test_util.cc:268] Using random seed: 406168742
I20260927 19:38:32.134802  6301 test_util.cc:268] Using random seed: 406170578
I20260927 19:38:32.136215  6302 test_util.cc:268] Using random seed: 406171997
I20260927 19:38:32.138320  6303 test_util.cc:268] Using random seed: 406174050
I20260927 19:38:32.140007  6304 test_util.cc:268] Using random seed: 406175768
I20260927 19:38:32.142078  6305 test_util.cc:268] Using random seed: 406177762
I20260927 19:38:32.143992  6306 test_util.cc:268] Using random seed: 406179713
I20260927 19:38:32.151201  6307 test_util.cc:268] Using random seed: 406186939
I20260927 19:38:32.152915  6308 test_util.cc:268] Using random seed: 406188688
I20260927 19:38:32.154785  6309 test_util.cc:268] Using random seed: 406190429
I20260927 19:38:32.156817  6310 test_util.cc:268] Using random seed: 406192509
I20260927 19:38:32.161346  6311 test_util.cc:268] Using random seed: 406197075
I20260927 19:38:32.163127  6312 test_util.cc:268] Using random seed: 406198771
I20260927 19:38:32.165246  6313 test_util.cc:268] Using random seed: 406200958
I20260927 19:38:32.167058  6314 test_util.cc:268] Using random seed: 406202686
I20260927 19:38:32.169085  6315 test_util.cc:268] Using random seed: 406204701
I20260927 19:38:32.170987  6316 test_util.cc:268] Using random seed: 406206736
I20260927 19:38:32.172722  6317 test_util.cc:268] Using random seed: 406208448
I20260927 19:38:32.174481  6318 test_util.cc:268] Using random seed: 406210225
I20260927 19:38:32.176203  6319 test_util.cc:268] Using random seed: 406211976
I20260927 19:38:32.177938  6320 test_util.cc:268] Using random seed: 406213729
W20260927 19:38:53.125726  6274 connection.cc:196] Error closing socket: Network error: TlsSocket::Close: Broken pipe
[       OK ] Parameters/TestRpc.TestCancellationMultiThreads/SSL_UnixSocket (21213 ms)
[ RUN      ] Parameters/TestRpc.TestCallId/SSL_UnixSocket
I20260927 19:38:53.175081  6334 acceptor_pool.cc:254] collecting diagnostics on the listening RPC socket unix:/tmp/dist-test-task6A3l99/test-tmp/rpc-test-b5ed62e7372e4472b57e42beff8684b1.sock every 8 connection(s)
I20260927 19:38:53.175998  6335 acceptor_pool.cc:254] collecting diagnostics on the listening RPC socket unix:/tmp/dist-test-task6A3l99/test-tmp/rpc-test-b5ed62e7372e4472b57e42beff8684b1.sock every 8 connection(s)
W20260927 19:38:53.239279  6331 connection.cc:196] Error closing socket: Network error: TlsSocket::Close: Broken pipe
[       OK ] Parameters/TestRpc.TestCallId/SSL_UnixSocket (102 ms)
[----------] 20 tests from Parameters/TestRpc (39868 ms total)

[----------] Global test environment tear-down
[==========] 21 tests from 2 test suites ran. (43166 ms total)
[  PASSED  ] 20 tests.
[  FAILED  ] 1 test, listed below:
[  FAILED  ] Parameters/TestRpc.TestCallWithChainCertAndRootCA/SSL_UnixSocket, where GetParam() = (true, true)

 1 FAILED TEST
I20260927 19:38:53.268493  5827 logging.cc:424] LogThrottler /data0/somelongdirectorytoavoidrpathissues/src/kudu/src/kudu/rpc/acceptor_pool.cc:285: suppressed but not reported on 3 messages since previous log ~35 seconds ago