Diagnosed failure

Parameters/TestRpc.TestCallWithChainCertAndChainCA/SSL_UnixSocket: /data0/somelongdirectorytoavoidrpathissues/src/kudu/src/kudu/rpc/rpc-test.cc:270: Failure
Failed
Bad status: Runtime error: could not verify certificate chain (error with cert: subject=CN = localhost, ST = sadfjas, C = AS, emailAddress = sdflkdsajf, O = lskdfjlsad, OU = sldfkja, issuer=C = AS, ST = ASDfkjdhf, L = lskdjf, O = saldfja, OU = skdjf, CN = localhost, emailAddress = sadjflkadsj): : certificate has expired
Google Test trace:
/data0/somelongdirectorytoavoidrpathissues/src/kudu/src/kudu/rpc/rpc-test.cc:267: Connecting to unix:/tmp/dist-test-taskl8jVOG/test-tmp/rpc-test-98072e284a9b4ff0a62e851a0e1d8af8.sock
I20260927 22:51:20.786345 24475 test_util.cc:175] -----------------------------------------------
I20260927 22:51:20.786422 24475 test_util.cc:176] Had fatal failures, leaving test files at /tmp/dist-test-taskl8jVOG/test-tmp/rpc-test.6.Parameters_TestRpc.TestCallWithChainCertAndChainCA_SSL_UnixSocket.1790549480667015-24475-0

Full log

Note: This is test shard 7 of 8.
[==========] Running 21 tests from 2 test suites.
[----------] Global test environment set-up.
[----------] 20 tests from Parameters/TestRpc
[ RUN      ] Parameters/TestRpc.TestMessengerCreateDestroy/SSL_UnixSocket
WARNING: Logging before InitGoogleLogging() is written to STDERR
I20260927 22:51:20.717670 24475 rpc-test.cc:169] started messenger TestCreateDestroy
[       OK ] Parameters/TestRpc.TestMessengerCreateDestroy/SSL_UnixSocket (34 ms)
[ RUN      ] Parameters/TestRpc.TestNegotiationDeadlock/SSL_UnixSocket
I20260927 22:51:20.735566 24495 acceptor_pool.cc:254] collecting diagnostics on the listening RPC socket unix:/tmp/dist-test-taskl8jVOG/test-tmp/rpc-test-c924a5377c6141a3ac3f24d02b7c9cb8.sock every 8 connection(s)
I20260927 22:51:20.735807 24496 acceptor_pool.cc:254] collecting diagnostics on the listening RPC socket unix:/tmp/dist-test-taskl8jVOG/test-tmp/rpc-test-c924a5377c6141a3ac3f24d02b7c9cb8.sock every 8 connection(s)
[       OK ] Parameters/TestRpc.TestNegotiationDeadlock/SSL_UnixSocket (32 ms)
[ RUN      ] Parameters/TestRpc.TestCallWithChainCertAndChainCA/SSL_UnixSocket
I20260927 22:51:20.774830 24511 acceptor_pool.cc:254] collecting diagnostics on the listening RPC socket unix:/tmp/dist-test-taskl8jVOG/test-tmp/rpc-test-98072e284a9b4ff0a62e851a0e1d8af8.sock every 8 connection(s)
I20260927 22:51:20.775161 24512 acceptor_pool.cc:254] collecting diagnostics on the listening RPC socket unix:/tmp/dist-test-taskl8jVOG/test-tmp/rpc-test-98072e284a9b4ff0a62e851a0e1d8af8.sock every 8 connection(s)
/data0/somelongdirectorytoavoidrpathissues/src/kudu/src/kudu/rpc/rpc-test.cc:270: Failure
Failed
Bad status: Runtime error: could not verify certificate chain (error with cert: subject=CN = localhost, ST = sadfjas, C = AS, emailAddress = sdflkdsajf, O = lskdfjlsad, OU = sldfkja, issuer=C = AS, ST = ASDfkjdhf, L = lskdjf, O = saldfja, OU = skdjf, CN = localhost, emailAddress = sadjflkadsj): : certificate has expired
Google Test trace:
/data0/somelongdirectorytoavoidrpathissues/src/kudu/src/kudu/rpc/rpc-test.cc:267: Connecting to unix:/tmp/dist-test-taskl8jVOG/test-tmp/rpc-test-98072e284a9b4ff0a62e851a0e1d8af8.sock
I20260927 22:51:20.786345 24475 test_util.cc:175] -----------------------------------------------
I20260927 22:51:20.786422 24475 test_util.cc:176] Had fatal failures, leaving test files at /tmp/dist-test-taskl8jVOG/test-tmp/rpc-test.6.Parameters_TestRpc.TestCallWithChainCertAndChainCA_SSL_UnixSocket.1790549480667015-24475-0
[  FAILED  ] Parameters/TestRpc.TestCallWithChainCertAndChainCA/SSL_UnixSocket, where GetParam() = (true, true) (32 ms)
[ RUN      ] Parameters/TestRpc.TestCallWithPasswordProtectedKey/SSL_UnixSocket
I20260927 22:51:20.799162 24536 acceptor_pool.cc:254] collecting diagnostics on the listening RPC socket unix:/tmp/dist-test-taskl8jVOG/test-tmp/rpc-test-127934ad4cfd487db4c01879dddeaccd.sock every 8 connection(s)
I20260927 22:51:20.799436 24537 acceptor_pool.cc:254] collecting diagnostics on the listening RPC socket unix:/tmp/dist-test-taskl8jVOG/test-tmp/rpc-test-127934ad4cfd487db4c01879dddeaccd.sock every 8 connection(s)
[       OK ] Parameters/TestRpc.TestCallWithPasswordProtectedKey/SSL_UnixSocket (45 ms)
[ RUN      ] Parameters/TestRpc.TestCallToBadServer/SSL_UnixSocket
I20260927 22:51:20.877655 24475 rpc-test.cc:394] Status: Network error: Client connection negotiation failed: client connection to 0.0.0.0:0: connect: Connection refused (error 111)
I20260927 22:51:20.878382 24475 rpc-test.cc:394] Status: Network error: Client connection negotiation failed: client connection to 0.0.0.0:0: connect: Connection refused (error 111)
I20260927 22:51:20.878988 24475 rpc-test.cc:394] Status: Network error: Client connection negotiation failed: client connection to 0.0.0.0:0: connect: Connection refused (error 111)
I20260927 22:51:20.879534 24475 rpc-test.cc:394] Status: Network error: Client connection negotiation failed: client connection to 0.0.0.0:0: connect: Connection refused (error 111)
I20260927 22:51:20.880060 24475 rpc-test.cc:394] Status: Network error: Client connection negotiation failed: client connection to 0.0.0.0:0: connect: Connection refused (error 111)
[       OK ] Parameters/TestRpc.TestCallToBadServer/SSL_UnixSocket (49 ms)
[ RUN      ] Parameters/TestRpc.TestWrongService/SSL_UnixSocket
I20260927 22:51:20.902482 24571 acceptor_pool.cc:254] collecting diagnostics on the listening RPC socket unix:/tmp/dist-test-taskl8jVOG/test-tmp/rpc-test-02519639d18641299ded01db7fa22ce4.sock every 8 connection(s)
I20260927 22:51:20.902721 24572 acceptor_pool.cc:254] collecting diagnostics on the listening RPC socket unix:/tmp/dist-test-taskl8jVOG/test-tmp/rpc-test-02519639d18641299ded01db7fa22ce4.sock every 8 connection(s)
I20260927 22:51:20.927531 24568 messenger.cc:345] service WrongServiceName not registered on TestServer
[       OK ] Parameters/TestRpc.TestWrongService/SSL_UnixSocket (50 ms)
[ RUN      ] Parameters/TestRpc.TestConnectionKeepalive/SSL_UnixSocket
I20260927 22:51:20.948520 24594 acceptor_pool.cc:254] collecting diagnostics on the listening RPC socket unix:/tmp/dist-test-taskl8jVOG/test-tmp/rpc-test-5c42c759394746eda47da58859e9daca.sock every 8 connection(s)
I20260927 22:51:20.948751 24595 acceptor_pool.cc:254] collecting diagnostics on the listening RPC socket unix:/tmp/dist-test-taskl8jVOG/test-tmp/rpc-test-5c42c759394746eda47da58859e9daca.sock every 8 connection(s)
I20260927 22:51:20.949638 24475 rpc-test.cc:488] Connecting to unix:/tmp/dist-test-taskl8jVOG/test-tmp/rpc-test-5c42c759394746eda47da58859e9daca.sock
W20260927 22:51:21.435431 24607 connection.cc:196] Error closing socket: Network error: TlsSocket::Close: Broken pipe
[       OK ] Parameters/TestRpc.TestConnectionKeepalive/SSL_UnixSocket (1042 ms)
[ RUN      ] Parameters/TestRpc.TestClientConnectionMetrics/SSL_UnixSocket
I20260927 22:51:22.011219 24619 acceptor_pool.cc:254] collecting diagnostics on the listening RPC socket unix:/tmp/dist-test-taskl8jVOG/test-tmp/rpc-test-a626c8f444be43c9806e77540bf84997.sock every 8 connection(s)
I20260927 22:51:22.011456 24620 acceptor_pool.cc:254] collecting diagnostics on the listening RPC socket unix:/tmp/dist-test-taskl8jVOG/test-tmp/rpc-test-a626c8f444be43c9806e77540bf84997.sock every 8 connection(s)
I20260927 22:51:22.012392 24475 rpc-test.cc:569] Connecting to unix:/tmp/dist-test-taskl8jVOG/test-tmp/rpc-test-a626c8f444be43c9806e77540bf84997.sock
[       OK ] Parameters/TestRpc.TestClientConnectionMetrics/SSL_UnixSocket (20931 ms)
[ RUN      ] Parameters/TestRpc.TestCredentialsPolicy/SSL_UnixSocket
I20260927 22:51:42.933126 24642 acceptor_pool.cc:254] collecting diagnostics on the listening RPC socket unix:/tmp/dist-test-taskl8jVOG/test-tmp/rpc-test-d3b3bdf05d3045bdbf96aed527a5a253.sock every 8 connection(s)
I20260927 22:51:42.933379 24643 acceptor_pool.cc:254] collecting diagnostics on the listening RPC socket unix:/tmp/dist-test-taskl8jVOG/test-tmp/rpc-test-d3b3bdf05d3045bdbf96aed527a5a253.sock every 8 connection(s)
I20260927 22:51:42.934482 24475 rpc-test.cc:700] Connecting to unix:/tmp/dist-test-taskl8jVOG/test-tmp/rpc-test-d3b3bdf05d3045bdbf96aed527a5a253.sock
W20260927 22:51:42.969974 24641 connection.cc:196] Error closing socket: Network error: TlsSocket::Close: Broken pipe
W20260927 22:51:42.978245 24641 connection.cc:196] Error closing socket: Network error: TlsSocket::Close: Broken pipe
[       OK ] Parameters/TestRpc.TestCredentialsPolicy/SSL_UnixSocket (73 ms)
[ RUN      ] Parameters/TestRpc.TestCallLongerThanKeepalive/SSL_UnixSocket
I20260927 22:51:42.993681 24667 acceptor_pool.cc:254] collecting diagnostics on the listening RPC socket unix:/tmp/dist-test-taskl8jVOG/test-tmp/rpc-test-9e669fa4a5ed41d89f754e9f8efaffd6.sock every 8 connection(s)
I20260927 22:51:42.994029 24668 acceptor_pool.cc:254] collecting diagnostics on the listening RPC socket unix:/tmp/dist-test-taskl8jVOG/test-tmp/rpc-test-9e669fa4a5ed41d89f754e9f8efaffd6.sock every 8 connection(s)
I20260927 22:51:43.012262 24671 rpc-test-base.h:222] got call: sleep_micros: 3000000 deferred: true
I20260927 22:51:46.013927 24671 rpcz_store.cc:275] Call kudu.rpc.GenericCalculatorService.Sleep from unix:<unnamed> (request call id 0) took 3001 ms. Trace:
I20260927 22:51:46.014269 24671 rpcz_store.cc:276] 0927 22:51:43.012164 (+     0us) service_pool.cc:170] Inserting onto call queue
0927 22:51:43.012222 (+    58us) service_pool.cc:227] Handling call
0927 22:51:46.013874 (+3001652us) inbound_call.cc:173] Queueing success response
Metrics: {}
W20260927 22:51:46.016983 24664 connection.cc:196] Error closing socket: Network error: TlsSocket::Close: Broken pipe
[       OK ] Parameters/TestRpc.TestCallLongerThanKeepalive/SSL_UnixSocket (3039 ms)
[ RUN      ] Parameters/TestRpc.TestRpcSidecar/SSL_UnixSocket
I20260927 22:51:46.044021 24692 acceptor_pool.cc:254] collecting diagnostics on the listening RPC socket unix:/tmp/dist-test-taskl8jVOG/test-tmp/rpc-test-4c70acf83c274f50b333170589801366.sock every 8 connection(s)
I20260927 22:51:46.044215 24693 acceptor_pool.cc:254] collecting diagnostics on the listening RPC socket unix:/tmp/dist-test-taskl8jVOG/test-tmp/rpc-test-4c70acf83c274f50b333170589801366.sock every 8 connection(s)
W20260927 22:51:46.132148 24689 connection.cc:196] Error closing socket: Network error: TlsSocket::Close: Broken pipe
[       OK ] Parameters/TestRpc.TestRpcSidecar/SSL_UnixSocket (114 ms)
[ RUN      ] Parameters/TestRpc.TestRpcSidecarLimits/SSL_UnixSocket
I20260927 22:51:48.144809 24717 acceptor_pool.cc:254] collecting diagnostics on the listening RPC socket unix:/tmp/dist-test-taskl8jVOG/test-tmp/rpc-test-a10f6f5b97c64aacaedef2b207c02558.sock every 8 connection(s)
I20260927 22:51:48.145164 24718 acceptor_pool.cc:254] collecting diagnostics on the listening RPC socket unix:/tmp/dist-test-taskl8jVOG/test-tmp/rpc-test-a10f6f5b97c64aacaedef2b207c02558.sock every 8 connection(s)
W20260927 22:51:48.166548 24475 serialization.cc:72] Serialized kudu.rpc_test.PushStringsRequestPB (2147483654 bytes) is larger than the maximum configured RPC message size (52428800 bytes). Sending anyway, but peer may reject the data.
W20260927 22:51:48.172571 24714 connection.cc:535] server connection from unix:<unnamed> recv error: Network error: RPC frame had a length of 2147483714, but we only support messages up to 52428800 bytes long.
W20260927 22:51:48.172708 24714 connection.cc:158] shutting down server connection from unix:<unnamed> with pending inbound data: 4/2147483714 bytes received; last active 0 ns ago: status Network error: RPC frame had a length of 2147483714, but we only support messages up to 52428800 bytes long.
W20260927 22:51:48.173156 24730 connection.cc:196] Error closing socket: Network error: TlsSocket::Close: Broken pipe
I20260927 22:51:48.189965 24742 acceptor_pool.cc:254] collecting diagnostics on the listening RPC socket unix:/tmp/dist-test-taskl8jVOG/test-tmp/rpc-test-a10f6f5b97c64aacaedef2b207c02558.sock every 8 connection(s)
I20260927 22:51:48.190131 24743 acceptor_pool.cc:254] collecting diagnostics on the listening RPC socket unix:/tmp/dist-test-taskl8jVOG/test-tmp/rpc-test-a10f6f5b97c64aacaedef2b207c02558.sock every 8 connection(s)
W20260927 22:51:53.639370 24739 connection.cc:577] server connection from unix:<unnamed>: received bad data: 'Corruption: Invalid packet: message had a length of 2147483710, but we only support messages up to 2147483647 bytes
'
W20260927 22:51:53.639977 24755 connection.cc:196] Error closing socket: Network error: TlsSocket::Close: Broken pipe
[       OK ] Parameters/TestRpc.TestRpcSidecarLimits/SSL_UnixSocket (7979 ms)
[ RUN      ] Parameters/TestRpc.TestCallTimeoutDoesntAffectNegotiation/SSL_UnixSocket
I20260927 22:51:54.139271 24767 acceptor_pool.cc:254] collecting diagnostics on the listening RPC socket unix:/tmp/dist-test-taskl8jVOG/test-tmp/rpc-test-e0fccd8d4fa347ab96465e292b35405b.sock every 8 connection(s)
I20260927 22:51:54.139536 24768 acceptor_pool.cc:254] collecting diagnostics on the listening RPC socket unix:/tmp/dist-test-taskl8jVOG/test-tmp/rpc-test-e0fccd8d4fa347ab96465e292b35405b.sock every 8 connection(s)
W20260927 22:51:54.153462 24763 negotiation.cc:266] Injecting 500ms delay in negotiation
I20260927 22:51:54.203922 24475 rpc-test-base.h:595] status: Timed out: connection negotiation to unix:/tmp/dist-test-taskl8jVOG/test-tmp/rpc-test-e0fccd8d4fa347ab96465e292b35405b.sock for RPC Sleep timed out after 0.050s (ON_OUTBOUND_QUEUE), seconds elapsed: 0.0510224
[       OK ] Parameters/TestRpc.TestCallTimeoutDoesntAffectNegotiation/SSL_UnixSocket (548 ms)
[ RUN      ] Parameters/TestRpc.TestRpcHandlerLatencyMetric/SSL_UnixSocket
I20260927 22:51:54.691334 24792 acceptor_pool.cc:254] collecting diagnostics on the listening RPC socket unix:/tmp/dist-test-taskl8jVOG/test-tmp/rpc-test-f20ae408d88847a482334489f4e868bf.sock every 8 connection(s)
I20260927 22:51:54.691540 24793 acceptor_pool.cc:254] collecting diagnostics on the listening RPC socket unix:/tmp/dist-test-taskl8jVOG/test-tmp/rpc-test-f20ae408d88847a482334489f4e868bf.sock every 8 connection(s)
I20260927 22:51:54.727576 24475 rpc-test.cc:1236] Sleep() min lat: 20622
I20260927 22:51:54.727679 24475 rpc-test.cc:1237] Sleep() mean lat: 20622
I20260927 22:51:54.727720 24475 rpc-test.cc:1238] Sleep() max lat: 20622
I20260927 22:51:54.727746 24475 rpc-test.cc:1239] Sleep() #calls: 1
[       OK ] Parameters/TestRpc.TestRpcHandlerLatencyMetric/SSL_UnixSocket (69 ms)
[ RUN      ] Parameters/TestRpc.TimedOutOnResponseMetricServiceQueue/SSL_UnixSocket
I20260927 22:51:54.749102 24818 acceptor_pool.cc:254] collecting diagnostics on the listening RPC socket unix:/tmp/dist-test-taskl8jVOG/test-tmp/rpc-test-dcac3f4f640743159980de9ce6b994c8.sock every 8 connection(s)
I20260927 22:51:54.749300 24819 acceptor_pool.cc:254] collecting diagnostics on the listening RPC socket unix:/tmp/dist-test-taskl8jVOG/test-tmp/rpc-test-dcac3f4f640743159980de9ce6b994c8.sock every 8 connection(s)
W20260927 22:51:54.807986 24820 rpcz_store.cc:267] Call kudu.rpc_test.CalculatorService.Sleep from unix:<unnamed> (request call id 2) took 20 ms (client timeout 20 ms). Trace:
W20260927 22:51:54.808161 24820 rpcz_store.cc:269] 0927 22:51:54.787548 (+     0us) service_pool.cc:170] Inserting onto call queue
0927 22:51:54.807914 (+ 20366us) service_pool.cc:214] Skipping call since client already timed out
0927 22:51:54.807967 (+    53us) inbound_call.cc:173] Queueing failure response
Metrics: {}
W20260927 22:51:54.809490 24815 connection.cc:196] Error closing socket: Network error: TlsSocket::Close: Broken pipe
[       OK ] Parameters/TestRpc.TimedOutOnResponseMetricServiceQueue/SSL_UnixSocket (79 ms)
[ RUN      ] Parameters/TestRpc.RpcPendingConnectionsMetric/SSL_UnixSocket
I20260927 22:51:54.817219 24841 acceptor_pool.cc:254] collecting diagnostics on the listening RPC socket 0.0.0.0:45651 every 8 connection(s)
I20260927 22:51:54.817401 24842 acceptor_pool.cc:254] collecting diagnostics on the listening RPC socket 0.0.0.0:45651 every 8 connection(s)
W20260927 22:51:54.819362 24837 negotiation.cc:337] Failed RPC negotiation. Trace:
0927 22:51:54.818768 (+     0us) reactor.cc:625] Submitting negotiation task for server connection from 127.0.0.1:52740 (local address 127.0.0.1:45651)
0927 22:51:54.818938 (+   170us) server_negotiation.cc:206] Beginning negotiation
0927 22:51:54.818942 (+     4us) server_negotiation.cc:399] Waiting for connection header
0927 22:51:54.819079 (+   137us) negotiation.cc:327] Negotiation complete: Network error: Server connection negotiation failed: server connection from 127.0.0.1:52740: BlockingRecv error: recv got EOF from 127.0.0.1:52740 (error 108)
Metrics: {"server-negotiator.queue_time_us":54}
[       OK ] Parameters/TestRpc.RpcPendingConnectionsMetric/SSL_UnixSocket (19 ms)
[ RUN      ] Parameters/TestRpc.TestRpcContextClientDeadline/SSL_UnixSocket
I20260927 22:51:54.850576 24857 acceptor_pool.cc:254] collecting diagnostics on the listening RPC socket unix:/tmp/dist-test-taskl8jVOG/test-tmp/rpc-test-5d857eb9c36040c6b3e7bc52fc62afdb.sock every 8 connection(s)
I20260927 22:51:54.850790 24858 acceptor_pool.cc:254] collecting diagnostics on the listening RPC socket unix:/tmp/dist-test-taskl8jVOG/test-tmp/rpc-test-5d857eb9c36040c6b3e7bc52fc62afdb.sock every 8 connection(s)
[       OK ] Parameters/TestRpc.TestRpcContextClientDeadline/SSL_UnixSocket (62 ms)
[ RUN      ] Parameters/TestRpc.TestApplicationFeatureFlagUnsupportedServer/SSL_UnixSocket
I20260927 22:51:54.912468 24882 acceptor_pool.cc:254] collecting diagnostics on the listening RPC socket unix:/tmp/dist-test-taskl8jVOG/test-tmp/rpc-test-398f9161b03e4bd79397b61acf023bd0.sock every 8 connection(s)
I20260927 22:51:54.912712 24883 acceptor_pool.cc:254] collecting diagnostics on the listening RPC socket unix:/tmp/dist-test-taskl8jVOG/test-tmp/rpc-test-398f9161b03e4bd79397b61acf023bd0.sock every 8 connection(s)
W20260927 22:51:54.941601 24879 connection.cc:196] Error closing socket: Network error: TlsSocket::Close: Broken pipe
[       OK ] Parameters/TestRpc.TestApplicationFeatureFlagUnsupportedServer/SSL_UnixSocket (49 ms)
[ RUN      ] Parameters/TestRpc.TestCancellationAsync/SSL_UnixSocket
I20260927 22:51:54.956229 24907 acceptor_pool.cc:254] collecting diagnostics on the listening RPC socket unix:/tmp/dist-test-taskl8jVOG/test-tmp/rpc-test-1186598997704b29abed827baadaa8e2.sock every 8 connection(s)
I20260927 22:51:54.956454 24908 acceptor_pool.cc:254] collecting diagnostics on the listening RPC socket unix:/tmp/dist-test-taskl8jVOG/test-tmp/rpc-test-1186598997704b29abed827baadaa8e2.sock every 8 connection(s)
I20260927 22:51:54.957298 24475 rpc-test.cc:1716] Connecting to unix:/tmp/dist-test-taskl8jVOG/test-tmp/rpc-test-1186598997704b29abed827baadaa8e2.sock
I20260927 22:51:54.990659 24475 test_util.cc:268] Using random seed: -875875282
I20260927 22:51:55.025347 24911 rpc-test-base.h:240] got call: sleep_micros: 500 pattern: 4294967295 num_repetitions: 2097152 sidecar_idx: 0
I20260927 22:51:55.052165 24910 rpc-test-base.h:240] got call: sleep_micros: 500 pattern: 4294967295 num_repetitions: 2097152 sidecar_idx: 0
I20260927 22:51:55.081398 24909 rpc-test-base.h:240] got call: sleep_micros: 500 pattern: 4294967295 num_repetitions: 2097152 sidecar_idx: 0
I20260927 22:51:55.110479 24910 rpc-test-base.h:240] got call: sleep_micros: 500 pattern: 4294967295 num_repetitions: 2097152 sidecar_idx: 0
I20260927 22:51:55.139721 24911 rpc-test-base.h:240] got call: sleep_micros: 500 pattern: 4294967295 num_repetitions: 2097152 sidecar_idx: 0
I20260927 22:51:55.171788 24910 rpc-test-base.h:240] got call: sleep_micros: 500 pattern: 4294967295 num_repetitions: 2097152 sidecar_idx: 0
I20260927 22:51:55.203003 24909 rpc-test-base.h:240] got call: sleep_micros: 500 pattern: 4294967295 num_repetitions: 2097152 sidecar_idx: 0
W20260927 22:51:55.210680 24904 connection.cc:196] Error closing socket: Network error: TlsSocket::Close: Broken pipe
W20260927 22:51:55.236547 24904 connection.cc:441] server connection from unix:<unnamed> torn down before Call kudu.rpc.GenericCalculatorService.SleepWithSidecar from unix:<unnamed> (request call id 8) could send its response
W20260927 22:51:55.263659 24904 connection.cc:441] server connection from unix:<unnamed> torn down before Call kudu.rpc.GenericCalculatorService.SleepWithSidecar from unix:<unnamed> (request call id 9) could send its response
[       OK ] Parameters/TestRpc.TestCancellationAsync/SSL_UnixSocket (322 ms)
[ RUN      ] Parameters/TestRpc.TestPerformanceBySocketType/SSL_UnixSocket
I20260927 22:51:55.281337 24932 acceptor_pool.cc:254] collecting diagnostics on the listening RPC socket unix:/tmp/dist-test-taskl8jVOG/test-tmp/rpc-test-0e707c1070364e2c9a27e72001889c13.sock every 8 connection(s)
I20260927 22:51:55.281565 24933 acceptor_pool.cc:254] collecting diagnostics on the listening RPC socket unix:/tmp/dist-test-taskl8jVOG/test-tmp/rpc-test-0e707c1070364e2c9a27e72001889c13.sock every 8 connection(s)
I20260927 22:51:55.282491 24475 rpc-test.cc:1846] Connecting to unix:/tmp/dist-test-taskl8jVOG/test-tmp/rpc-test-0e707c1070364e2c9a27e72001889c13.sock
I20260927 22:51:58.293665 24475 rpc-test.cc:1859] Sending 1024MB via ssl-enabled unix socket: real 3.004s	user 2.966s	sys 2.119s
I20260927 22:52:01.274675 24475 rpc-test.cc:1859] Sending 1024MB via ssl-enabled unix socket: real 2.981s	user 2.892s	sys 2.163s
I20260927 22:52:04.209594 24475 rpc-test.cc:1859] Sending 1024MB via ssl-enabled unix socket: real 2.935s	user 2.757s	sys 2.216s
I20260927 22:52:07.360885 24475 rpc-test.cc:1859] Sending 1024MB via ssl-enabled unix socket: real 3.151s	user 3.053s	sys 2.315s
I20260927 22:52:10.369958 24475 rpc-test.cc:1859] Sending 1024MB via ssl-enabled unix socket: real 3.009s	user 2.841s	sys 2.243s
[       OK ] Parameters/TestRpc.TestPerformanceBySocketType/SSL_UnixSocket (15110 ms)
[----------] 20 tests from Parameters/TestRpc (49691 ms total)

[----------] 1 test from Parameters/TestRpcSocketTxRxQueue
[ RUN      ] Parameters/TestRpcSocketTxRxQueue.AcceptorRxQueueSizeMetric/0
I20260927 22:52:10.387790 24957 acceptor_pool.cc:254] collecting diagnostics on the listening RPC socket 0.0.0.0:46027 every 1 connection(s)
I20260927 22:52:10.388024 24958 acceptor_pool.cc:254] collecting diagnostics on the listening RPC socket 0.0.0.0:46027 every 1 connection(s)
W20260927 22:52:10.389650 24953 negotiation.cc:337] Failed RPC negotiation. Trace:
0927 22:52:10.389268 (+     0us) reactor.cc:625] Submitting negotiation task for server connection from 127.0.0.1:59562 (local address 127.0.0.1:46027)
0927 22:52:10.389423 (+   155us) server_negotiation.cc:206] Beginning negotiation
0927 22:52:10.389427 (+     4us) server_negotiation.cc:399] Waiting for connection header
0927 22:52:10.389547 (+   120us) negotiation.cc:327] Negotiation complete: Network error: Server connection negotiation failed: server connection from 127.0.0.1:59562: BlockingRecv error: recv got EOF from 127.0.0.1:59562 (error 108)
Metrics: {"server-negotiator.queue_time_us":44}
[       OK ] Parameters/TestRpcSocketTxRxQueue.AcceptorRxQueueSizeMetric/0 (15 ms)
[----------] 1 test from Parameters/TestRpcSocketTxRxQueue (15 ms total)

[----------] Global test environment tear-down
[==========] 21 tests from 2 test suites ran. (49707 ms total)
[  PASSED  ] 20 tests.
[  FAILED  ] 1 test, listed below:
[  FAILED  ] Parameters/TestRpc.TestCallWithChainCertAndChainCA/SSL_UnixSocket, where GetParam() = (true, true)

 1 FAILED TEST