Parameters/TestRpc.TestCallWithChainCertAndRootCA/SSL_TCP: /data0/somelongdirectorytoavoidrpathissues/src/kudu/src/kudu/rpc/rpc-test.cc:303: Failure
Failed
Bad status: Runtime error: could not verify certificate chain (error with cert: subject=CN = localhost, ST = sadfjas, C = AS, emailAddress = sdflkdsajf, O = lskdfjlsad, OU = sldfkja, issuer=C = AS, ST = ASDfkjdhf, L = lskdjf, O = saldfja, OU = skdjf, CN = localhost, emailAddress = sadjflkadsj): : certificate has expired
Google Test trace:
/data0/somelongdirectorytoavoidrpathissues/src/kudu/src/kudu/rpc/rpc-test.cc:300: Connecting to 0.0.0.0:40833
I20260928 03:45:01.953732 10582 test_util.cc:175] -----------------------------------------------
I20260928 03:45:01.953902 10582 test_util.cc:176] Had fatal failures, leaving test files at /tmp/dist-test-taskFnlX_v/test-tmp/rpc-test.1.Parameters_TestRpc.TestCallWithChainCertAndRootCA_SSL_TCP.1790567100575187-10582-0
Note: This is test shard 2 of 8.
[==========] Running 21 tests from 2 test suites.
[----------] Global test environment set-up.
[----------] 1 test from TestRpc
[ RUN ] TestRpc.TestMethodsByName
[ OK ] TestRpc.TestMethodsByName (6 ms)
[----------] 1 test from TestRpc (7 ms total)
[----------] 20 tests from Parameters/TestRpc
[ RUN ] Parameters/TestRpc.TestAcceptorPoolStartStop/SSL_TCP
WARNING: Logging before InitGoogleLogging() is written to STDERR
I20260928 03:45:00.685490 10597 acceptor_pool.cc:254] collecting diagnostics on the listening RPC socket 0.0.0.0:36157 every 8 connection(s)
I20260928 03:45:00.686815 10598 acceptor_pool.cc:254] collecting diagnostics on the listening RPC socket 0.0.0.0:36157 every 8 connection(s)
I20260928 03:45:01.740887 10609 acceptor_pool.cc:254] collecting diagnostics on the listening RPC socket 0.0.0.0:39685 every 8 connection(s)
I20260928 03:45:01.742167 10610 acceptor_pool.cc:254] collecting diagnostics on the listening RPC socket 0.0.0.0:39685 every 8 connection(s)
I20260928 03:45:01.766500 10620 acceptor_pool.cc:254] collecting diagnostics on the listening RPC socket 0.0.0.0:36375 every 8 connection(s)
I20260928 03:45:01.767727 10621 acceptor_pool.cc:254] collecting diagnostics on the listening RPC socket 0.0.0.0:36375 every 8 connection(s)
I20260928 03:45:01.787147 10631 acceptor_pool.cc:254] collecting diagnostics on the listening RPC socket 0.0.0.0:40959 every 8 connection(s)
I20260928 03:45:01.787860 10632 acceptor_pool.cc:254] collecting diagnostics on the listening RPC socket 0.0.0.0:40959 every 8 connection(s)
I20260928 03:45:01.818859 10642 acceptor_pool.cc:254] collecting diagnostics on the listening RPC socket 0.0.0.0:45911 every 8 connection(s)
I20260928 03:45:01.819551 10643 acceptor_pool.cc:254] collecting diagnostics on the listening RPC socket 0.0.0.0:45911 every 8 connection(s)
[ OK ] Parameters/TestRpc.TestAcceptorPoolStartStop/SSL_TCP (1190 ms)
[ RUN ] Parameters/TestRpc.TestCall/SSL_TCP
I20260928 03:45:01.841156 10655 acceptor_pool.cc:254] collecting diagnostics on the listening RPC socket 0.0.0.0:44029 every 8 connection(s)
I20260928 03:45:01.843048 10656 acceptor_pool.cc:254] collecting diagnostics on the listening RPC socket 0.0.0.0:44029 every 8 connection(s)
I20260928 03:45:01.847818 10582 rpc-test.cc:234] Connecting to 0.0.0.0:44029
[ OK ] Parameters/TestRpc.TestCall/SSL_TCP (88 ms)
[ RUN ] Parameters/TestRpc.TestCallWithChainCertAndRootCA/SSL_TCP
I20260928 03:45:01.934427 10680 acceptor_pool.cc:254] collecting diagnostics on the listening RPC socket 0.0.0.0:40833 every 8 connection(s)
I20260928 03:45:01.935130 10681 acceptor_pool.cc:254] collecting diagnostics on the listening RPC socket 0.0.0.0:40833 every 8 connection(s)
/data0/somelongdirectorytoavoidrpathissues/src/kudu/src/kudu/rpc/rpc-test.cc:303: Failure
Failed
Bad status: Runtime error: could not verify certificate chain (error with cert: subject=CN = localhost, ST = sadfjas, C = AS, emailAddress = sdflkdsajf, O = lskdfjlsad, OU = sldfkja, issuer=C = AS, ST = ASDfkjdhf, L = lskdjf, O = saldfja, OU = skdjf, CN = localhost, emailAddress = sadjflkadsj): : certificate has expired
Google Test trace:
/data0/somelongdirectorytoavoidrpathissues/src/kudu/src/kudu/rpc/rpc-test.cc:300: Connecting to 0.0.0.0:40833
I20260928 03:45:01.953732 10582 test_util.cc:175] -----------------------------------------------
I20260928 03:45:01.953902 10582 test_util.cc:176] Had fatal failures, leaving test files at /tmp/dist-test-taskFnlX_v/test-tmp/rpc-test.1.Parameters_TestRpc.TestCallWithChainCertAndRootCA_SSL_TCP.1790567100575187-10582-0
[ FAILED ] Parameters/TestRpc.TestCallWithChainCertAndRootCA/SSL_TCP, where GetParam() = (true, false) (41 ms)
[ RUN ] Parameters/TestRpc.TestCallWithBadPasswordProtectedKey/SSL_TCP
[ OK ] Parameters/TestRpc.TestCallWithBadPasswordProtectedKey/SSL_TCP (28 ms)
[ RUN ] Parameters/TestRpc.TestInvalidMethodCall/SSL_TCP
I20260928 03:45:02.004037 10717 acceptor_pool.cc:254] collecting diagnostics on the listening RPC socket 0.0.0.0:38579 every 8 connection(s)
I20260928 03:45:02.004824 10718 acceptor_pool.cc:254] collecting diagnostics on the listening RPC socket 0.0.0.0:38579 every 8 connection(s)
I20260928 03:45:02.008224 10582 rpc-test.cc:406] Connecting to 0.0.0.0:38579
[ OK ] Parameters/TestRpc.TestInvalidMethodCall/SSL_TCP (71 ms)
[ RUN ] Parameters/TestRpc.TestHighFDs/SSL_TCP
I20260928 03:45:02.267904 10742 acceptor_pool.cc:254] collecting diagnostics on the listening RPC socket 0.0.0.0:42039 every 8 connection(s)
I20260928 03:45:02.268548 10743 acceptor_pool.cc:254] collecting diagnostics on the listening RPC socket 0.0.0.0:42039 every 8 connection(s)
[ OK ] Parameters/TestRpc.TestHighFDs/SSL_TCP (258 ms)
[ RUN ] Parameters/TestRpc.TestConnectionAlwaysKeepalive/SSL_TCP
I20260928 03:45:02.339100 10765 acceptor_pool.cc:254] collecting diagnostics on the listening RPC socket 0.0.0.0:35811 every 8 connection(s)
I20260928 03:45:02.339661 10766 acceptor_pool.cc:254] collecting diagnostics on the listening RPC socket 0.0.0.0:35811 every 8 connection(s)
I20260928 03:45:02.342540 10582 rpc-test.cc:532] Connecting to 0.0.0.0:35811
[ OK ] Parameters/TestRpc.TestConnectionAlwaysKeepalive/SSL_TCP (3064 ms)
[ RUN ] Parameters/TestRpc.TestReopenOutboundConnections/SSL_TCP
I20260928 03:45:05.413622 10788 acceptor_pool.cc:254] collecting diagnostics on the listening RPC socket 0.0.0.0:33183 every 8 connection(s)
I20260928 03:45:05.414283 10789 acceptor_pool.cc:254] collecting diagnostics on the listening RPC socket 0.0.0.0:33183 every 8 connection(s)
I20260928 03:45:05.417212 10582 rpc-test.cc:658] Connecting to 0.0.0.0:33183
[ OK ] Parameters/TestRpc.TestReopenOutboundConnections/SSL_TCP (359 ms)
[ RUN ] Parameters/TestRpc.TestConnectionNetworkPlane/SSL_TCP
I20260928 03:45:05.754971 10811 acceptor_pool.cc:254] collecting diagnostics on the listening RPC socket 0.0.0.0:36917 every 8 connection(s)
I20260928 03:45:05.755613 10812 acceptor_pool.cc:254] collecting diagnostics on the listening RPC socket 0.0.0.0:36917 every 8 connection(s)
I20260928 03:45:05.758510 10582 rpc-test.cc:772] Connecting to 0.0.0.0:36917
[ OK ] Parameters/TestRpc.TestConnectionNetworkPlane/SSL_TCP (108 ms)
[ RUN ] Parameters/TestRpc.TestTCPKeepalive/SSL_TCP
I20260928 03:45:05.874537 10836 acceptor_pool.cc:254] collecting diagnostics on the listening RPC socket 0.0.0.0:37561 every 8 connection(s)
I20260928 03:45:05.875216 10837 acceptor_pool.cc:254] collecting diagnostics on the listening RPC socket 0.0.0.0:37561 every 8 connection(s)
I20260928 03:45:05.907698 10840 rpc-test-base.h:222] got call: sleep_micros: 8000000 deferred: true
I20260928 03:45:13.911585 10840 rpcz_store.cc:275] Call kudu.rpc.GenericCalculatorService.Sleep from 127.0.0.1:57810 (request call id 0) took 8004 ms. Trace:
I20260928 03:45:13.911991 10840 rpcz_store.cc:276] 0928 03:45:05.907451 (+ 0us) service_pool.cc:170] Inserting onto call queue
0928 03:45:05.907545 (+ 94us) service_pool.cc:227] Handling call
0928 03:45:13.911421 (+8003876us) inbound_call.cc:173] Queueing success response
Metrics: {}
[ OK ] Parameters/TestRpc.TestTCPKeepalive/SSL_TCP (8080 ms)
[ RUN ] Parameters/TestRpc.TestMaxSmallSidecars/SSL_TCP
I20260928 03:45:13.950905 10862 acceptor_pool.cc:254] collecting diagnostics on the listening RPC socket 0.0.0.0:33515 every 8 connection(s)
I20260928 03:45:13.951664 10863 acceptor_pool.cc:254] collecting diagnostics on the listening RPC socket 0.0.0.0:33515 every 8 connection(s)
[ OK ] Parameters/TestRpc.TestMaxSmallSidecars/SSL_TCP (201 ms)
[ RUN ] Parameters/TestRpc.TestCallTimeout/SSL_TCP
I20260928 03:45:14.171293 10887 acceptor_pool.cc:254] collecting diagnostics on the listening RPC socket 0.0.0.0:35473 every 8 connection(s)
I20260928 03:45:14.172003 10888 acceptor_pool.cc:254] collecting diagnostics on the listening RPC socket 0.0.0.0:35473 every 8 connection(s)
I20260928 03:45:14.192584 10582 rpc-test-base.h:595] status: Timed out: connection negotiation to 0.0.0.0:35473 for RPC Sleep timed out after 0.000s (ON_OUTBOUND_QUEUE), seconds elapsed: 0.00231308
I20260928 03:45:14.199324 10891 rpc-test-base.h:222] got call: sleep_micros: 700000
I20260928 03:45:14.394060 10582 rpc-test-base.h:595] status: Timed out: Sleep RPC to 0.0.0.0:35473 timed out after 0.200s (SENT), seconds elapsed: 0.201112
I20260928 03:45:14.395542 10890 rpc-test-base.h:222] got call: sleep_micros: 2000000
W20260928 03:45:14.899925 10891 rpcz_store.cc:267] Call kudu.rpc.GenericCalculatorService.Sleep from 127.0.0.1:37100 (request call id 1) took 700 ms (client timeout 200 ms). Trace:
W20260928 03:45:14.900261 10891 rpcz_store.cc:269] 0928 03:45:14.199166 (+ 0us) service_pool.cc:170] Inserting onto call queue
0928 03:45:14.199269 (+ 103us) service_pool.cc:227] Handling call
0928 03:45:14.899860 (+700591us) inbound_call.cc:173] Queueing success response
Metrics: {}
I20260928 03:45:15.896127 10582 rpc-test-base.h:595] status: Timed out: Sleep RPC to 0.0.0.0:35473 timed out after 1.500s (SENT), seconds elapsed: 1.5017
W20260928 03:45:16.396080 10890 rpcz_store.cc:267] Call kudu.rpc.GenericCalculatorService.Sleep from 127.0.0.1:37100 (request call id 2) took 2000 ms (client timeout 1500 ms). Trace:
W20260928 03:45:16.396392 10890 rpcz_store.cc:269] 0928 03:45:14.395278 (+ 0us) service_pool.cc:170] Inserting onto call queue
0928 03:45:14.395397 (+ 119us) service_pool.cc:227] Handling call
0928 03:45:16.396025 (+2000628us) inbound_call.cc:173] Queueing success response
Metrics: {}
W20260928 03:45:16.396931 10884 connection.cc:441] server connection from 127.0.0.1:37100 torn down before Call kudu.rpc.GenericCalculatorService.Sleep from 127.0.0.1:37100 (request call id 2) could send its response
[ OK ] Parameters/TestRpc.TestCallTimeout/SSL_TCP (2276 ms)
[ RUN ] Parameters/TestRpc.TestServerShutsDown/SSL_TCP
I20260928 03:45:16.403440 10582 rpc-test.cc:1125] Connecting to 0.0.0.0:38085
W20260928 03:45:16.411607 10904 negotiation.cc:337] Failed RPC negotiation. Trace:
0928 03:45:16.410189 (+ 0us) reactor.cc:625] Submitting negotiation task for client connection to 0.0.0.0:38085 (local address 127.0.0.1:53742)
0928 03:45:16.410620 (+ 431us) negotiation.cc:107] Waiting for socket to connect
0928 03:45:16.410649 (+ 29us) client_negotiation.cc:174] Beginning negotiation
0928 03:45:16.410839 (+ 190us) client_negotiation.cc:252] Sending NEGOTIATE NegotiatePB request
0928 03:45:16.411054 (+ 215us) negotiation.cc:327] Negotiation complete: Network error: Client connection negotiation failed: client connection to 0.0.0.0:38085: BlockingWrite error: write error: Broken pipe (error 32)
Metrics: {"client-negotiator.queue_time_us":98}
[ OK ] Parameters/TestRpc.TestServerShutsDown/SSL_TCP (11 ms)
[ RUN ] Parameters/TestRpc.TimedOutOnResponseMetric/SSL_TCP
I20260928 03:45:16.445407 10921 acceptor_pool.cc:254] collecting diagnostics on the listening RPC socket 0.0.0.0:37601 every 8 connection(s)
I20260928 03:45:16.446112 10922 acceptor_pool.cc:254] collecting diagnostics on the listening RPC socket 0.0.0.0:37601 every 8 connection(s)
W20260928 03:45:16.700017 10925 rpcz_store.cc:267] Call kudu.rpc_test.CalculatorService.Sleep from 127.0.0.1:35702 (request call id 3) took 50 ms (client timeout 25 ms). Trace:
W20260928 03:45:16.700311 10925 rpcz_store.cc:269] 0928 03:45:16.649518 (+ 0us) service_pool.cc:170] Inserting onto call queue
0928 03:45:16.649606 (+ 88us) service_pool.cc:227] Handling call
0928 03:45:16.699951 (+ 50345us) inbound_call.cc:173] Queueing success response
Related trace 'test_child':
Metrics: {"test_sleep_us":50000,"child_traces":[["test_child",{"related_trace_metric":1}]]}
W20260928 03:45:16.759078 10925 rpcz_store.cc:267] Call kudu.rpc_test.CalculatorService.Sleep from 127.0.0.1:35702 (request call id 4) took 50 ms (client timeout 50 ms). Trace:
W20260928 03:45:16.759400 10925 rpcz_store.cc:269] 0928 03:45:16.708545 (+ 0us) service_pool.cc:170] Inserting onto call queue
0928 03:45:16.708634 (+ 89us) service_pool.cc:227] Handling call
0928 03:45:16.759010 (+ 50376us) inbound_call.cc:173] Queueing success response
Related trace 'test_child':
Metrics: {"test_sleep_us":50000,"child_traces":[["test_child",{"related_trace_metric":1}]]}
W20260928 03:45:16.761711 10920 connection.cc:441] server connection from 127.0.0.1:35702 torn down before Call kudu.rpc_test.CalculatorService.Sleep from 127.0.0.1:35702 (request call id 4) could send its response
[ OK ] Parameters/TestRpc.TimedOutOnResponseMetric/SSL_TCP (352 ms)
[ RUN ] Parameters/TestRpc.AcceptorDispatchingTimesMetric/SSL_TCP
I20260928 03:45:16.776880 10946 acceptor_pool.cc:254] collecting diagnostics on the listening RPC socket 0.0.0.0:45241 every 8 connection(s)
I20260928 03:45:16.777462 10947 acceptor_pool.cc:254] collecting diagnostics on the listening RPC socket 0.0.0.0:45241 every 8 connection(s)
W20260928 03:45:16.783211 10942 negotiation.cc:337] Failed RPC negotiation. Trace:
0928 03:45:16.781248 (+ 0us) reactor.cc:625] Submitting negotiation task for server connection from 127.0.0.1:42808 (local address 127.0.0.1:45241)
0928 03:45:16.781827 (+ 579us) server_negotiation.cc:206] Beginning negotiation
0928 03:45:16.781848 (+ 21us) server_negotiation.cc:399] Waiting for connection header
0928 03:45:16.782203 (+ 355us) negotiation.cc:327] Negotiation complete: Network error: Server connection negotiation failed: server connection from 127.0.0.1:42808: BlockingRecv error: recv got EOF from 127.0.0.1:42808 (error 108)
Metrics: {"server-negotiator.queue_time_us":186}
[ OK ] Parameters/TestRpc.AcceptorDispatchingTimesMetric/SSL_TCP (19 ms)
[ RUN ] Parameters/TestRpc.TestRpcCallbackDestroysMessenger/SSL_TCP
[ OK ] Parameters/TestRpc.TestRpcCallbackDestroysMessenger/SSL_TCP (17 ms)
[ RUN ] Parameters/TestRpc.TestApplicationFeatureFlag/SSL_TCP
I20260928 03:45:16.826164 10971 acceptor_pool.cc:254] collecting diagnostics on the listening RPC socket 0.0.0.0:43723 every 8 connection(s)
I20260928 03:45:16.826778 10972 acceptor_pool.cc:254] collecting diagnostics on the listening RPC socket 0.0.0.0:43723 every 8 connection(s)
W20260928 03:45:16.865366 10969 messenger.cc:357] Unable to handle RPC call: Not implemented: call requires unsupported application feature flags: 99
[ OK ] Parameters/TestRpc.TestApplicationFeatureFlag/SSL_TCP (69 ms)
[ RUN ] Parameters/TestRpc.TestCancellation/SSL_TCP
I20260928 03:45:16.893721 10996 acceptor_pool.cc:254] collecting diagnostics on the listening RPC socket 0.0.0.0:45679 every 8 connection(s)
I20260928 03:45:16.894428 10997 acceptor_pool.cc:254] collecting diagnostics on the listening RPC socket 0.0.0.0:45679 every 8 connection(s)
I20260928 03:45:16.897492 10582 rpc-test.cc:1648] Connecting to 0.0.0.0:45679
I20260928 03:45:17.017482 10582 rpc-test-base.h:595] status: Aborted: Sleep RPC to 0.0.0.0:45679 is cancelled in state READY, seconds elapsed: 0.000318532
I20260928 03:45:17.152334 10582 rpc-test-base.h:595] status: Aborted: Sleep RPC to 0.0.0.0:45679 is cancelled in state SENT, seconds elapsed: 0.000842153
I20260928 03:45:17.188577 10999 rpc-test-base.h:222] got call: sleep_micros: 510000
I20260928 03:45:17.306841 10582 rpc-test-base.h:595] status: Aborted: Sleep RPC to 0.0.0.0:45679 is cancelled in state SENT, seconds elapsed: 0.000973682
I20260928 03:45:17.351230 10998 rpc-test-base.h:222] got call: sleep_micros: 510000
I20260928 03:45:17.479116 10582 rpc-test-base.h:595] status: Aborted: Sleep RPC to 0.0.0.0:45679 is cancelled in state SENT, seconds elapsed: 0.000745096
W20260928 03:45:17.514233 11000 rpcz_store.cc:267] Call kudu.rpc.GenericCalculatorService.Sleep from 127.0.0.1:57034 (request call id 11) took 14 ms (client timeout 10 ms). Trace:
W20260928 03:45:17.514544 11000 rpcz_store.cc:269] 0928 03:45:17.500046 (+ 0us) service_pool.cc:170] Inserting onto call queue
0928 03:45:17.514005 (+ 13959us) service_pool.cc:214] Skipping call since client already timed out
0928 03:45:17.514079 (+ 74us) inbound_call.cc:173] Queueing failure response
Metrics: {}
I20260928 03:45:17.515007 11000 rpc-test-base.h:222] got call: sleep_micros: 1500000
W20260928 03:45:17.699177 10999 rpcz_store.cc:267] Call kudu.rpc.GenericCalculatorService.Sleep from 127.0.0.1:57034 (request call id 3) took 510 ms (client timeout 10 ms). Trace:
W20260928 03:45:17.699497 10999 rpcz_store.cc:269] 0928 03:45:17.188367 (+ 0us) service_pool.cc:170] Inserting onto call queue
0928 03:45:17.188509 (+ 142us) service_pool.cc:227] Handling call
0928 03:45:17.699122 (+510613us) inbound_call.cc:173] Queueing success response
Metrics: {}
W20260928 03:45:17.861860 10998 rpcz_store.cc:267] Call kudu.rpc.GenericCalculatorService.Sleep from 127.0.0.1:57034 (request call id 7) took 510 ms (client timeout 10 ms). Trace:
W20260928 03:45:17.862166 10998 rpcz_store.cc:269] 0928 03:45:17.351025 (+ 0us) service_pool.cc:170] Inserting onto call queue
0928 03:45:17.351154 (+ 129us) service_pool.cc:227] Handling call
0928 03:45:17.861807 (+510653us) inbound_call.cc:173] Queueing success response
Metrics: {}
I20260928 03:45:18.480778 10582 rpc-test-base.h:595] status: Timed out: Sleep RPC to 0.0.0.0:45679 timed out after 1.000s (SENT), seconds elapsed: 1.00134
I20260928 03:45:18.482015 10998 rpc-test-base.h:222] got call: sleep_micros: 1500000
W20260928 03:45:19.015472 11000 rpcz_store.cc:267] Call kudu.rpc.GenericCalculatorService.Sleep from 127.0.0.1:57034 (request call id 12) took 1515 ms (client timeout 1000 ms). Trace:
W20260928 03:45:19.015817 11000 rpcz_store.cc:269] 0928 03:45:17.500265 (+ 0us) service_pool.cc:170] Inserting onto call queue
0928 03:45:17.514979 (+ 14714us) service_pool.cc:227] Handling call
0928 03:45:19.015423 (+1500444us) inbound_call.cc:173] Queueing success response
Metrics: {}
I20260928 03:45:19.482658 10582 rpc-test-base.h:595] status: Timed out: Sleep RPC to 0.0.0.0:45679 timed out after 1.000s (SENT), seconds elapsed: 1.00156
W20260928 03:45:19.484107 10993 messenger.cc:357] Unable to handle RPC call: Not implemented: call requires unsupported application feature flags: 99, 1
W20260928 03:45:19.485585 10993 messenger.cc:357] Unable to handle RPC call: Not implemented: call requires unsupported application feature flags: 99, 1
W20260928 03:45:19.982518 10998 rpcz_store.cc:267] Call kudu.rpc.GenericCalculatorService.Sleep from 127.0.0.1:57034 (request call id 13) took 1500 ms (client timeout 1000 ms). Trace:
W20260928 03:45:19.982806 10998 rpcz_store.cc:269] 0928 03:45:18.481843 (+ 0us) service_pool.cc:170] Inserting onto call queue
0928 03:45:18.481971 (+ 128us) service_pool.cc:227] Handling call
0928 03:45:19.982465 (+1500494us) inbound_call.cc:173] Queueing success response
Metrics: {}
W20260928 03:45:19.983341 10993 connection.cc:441] server connection from 127.0.0.1:57034 torn down before Call kudu.rpc.GenericCalculatorService.Sleep from 127.0.0.1:57034 (request call id 13) could send its response
[ OK ] Parameters/TestRpc.TestCancellation/SSL_TCP (3116 ms)
[ RUN ] Parameters/TestRpc.TestCancellationMultiThreads/SSL_TCP
I20260928 03:45:20.024143 11021 acceptor_pool.cc:254] collecting diagnostics on the listening RPC socket 0.0.0.0:42455 every 8 connection(s)
I20260928 03:45:20.024897 11022 acceptor_pool.cc:254] collecting diagnostics on the listening RPC socket 0.0.0.0:42455 every 8 connection(s)
I20260928 03:45:20.028024 10582 rpc-test.cc:1808] Connecting to 0.0.0.0:42455
I20260928 03:45:20.167434 11035 test_util.cc:268] Using random seed: -450567704
I20260928 03:45:20.168484 11036 test_util.cc:268] Using random seed: -450566645
I20260928 03:45:20.169797 11037 test_util.cc:268] Using random seed: -450565338
I20260928 03:45:20.171228 11038 test_util.cc:268] Using random seed: -450563925
I20260928 03:45:20.172768 11039 test_util.cc:268] Using random seed: -450562527
I20260928 03:45:20.174130 11040 test_util.cc:268] Using random seed: -450561129
I20260928 03:45:20.175335 11041 test_util.cc:268] Using random seed: -450559901
I20260928 03:45:20.176831 11042 test_util.cc:268] Using random seed: -450558445
I20260928 03:45:20.178126 11043 test_util.cc:268] Using random seed: -450557120
I20260928 03:45:20.179585 11044 test_util.cc:268] Using random seed: -450555679
I20260928 03:45:20.180899 11045 test_util.cc:268] Using random seed: -450554331
I20260928 03:45:20.182258 11046 test_util.cc:268] Using random seed: -450553000
I20260928 03:45:20.183857 11047 test_util.cc:268] Using random seed: -450551465
I20260928 03:45:20.186580 11048 test_util.cc:268] Using random seed: -450548693
I20260928 03:45:20.188841 11049 test_util.cc:268] Using random seed: -450546463
I20260928 03:45:20.192504 11050 test_util.cc:268] Using random seed: -450542826
I20260928 03:45:20.194180 11051 test_util.cc:268] Using random seed: -450541122
I20260928 03:45:20.196451 11052 test_util.cc:268] Using random seed: -450538859
I20260928 03:45:20.200626 11053 test_util.cc:268] Using random seed: -450534651
I20260928 03:45:20.202776 11054 test_util.cc:268] Using random seed: -450532482
I20260928 03:45:20.204517 11055 test_util.cc:268] Using random seed: -450530838
I20260928 03:45:20.206130 11056 test_util.cc:268] Using random seed: -450529172
I20260928 03:45:20.207844 11057 test_util.cc:268] Using random seed: -450527454
I20260928 03:45:20.209830 11058 test_util.cc:268] Using random seed: -450525471
I20260928 03:45:20.211364 11059 test_util.cc:268] Using random seed: -450523921
I20260928 03:45:20.216652 11060 test_util.cc:268] Using random seed: -450518614
I20260928 03:45:20.220340 11061 test_util.cc:268] Using random seed: -450514905
I20260928 03:45:20.221853 11062 test_util.cc:268] Using random seed: -450513435
I20260928 03:45:20.223268 11063 test_util.cc:268] Using random seed: -450511976
I20260928 03:45:20.224509 11064 test_util.cc:268] Using random seed: -450510741
[ OK ] Parameters/TestRpc.TestCancellationMultiThreads/SSL_TCP (16853 ms)
[ RUN ] Parameters/TestRpc.TestCallId/SSL_TCP
I20260928 03:45:36.868562 11078 acceptor_pool.cc:254] collecting diagnostics on the listening RPC socket 0.0.0.0:35231 every 8 connection(s)
I20260928 03:45:36.869295 11079 acceptor_pool.cc:254] collecting diagnostics on the listening RPC socket 0.0.0.0:35231 every 8 connection(s)
[ OK ] Parameters/TestRpc.TestCallId/SSL_TCP (79 ms)
[----------] 20 tests from Parameters/TestRpc (36289 ms total)
[----------] Global test environment tear-down
[==========] 21 tests from 2 test suites ran. (36297 ms total)
[ PASSED ] 20 tests.
[ FAILED ] 1 test, listed below:
[ FAILED ] Parameters/TestRpc.TestCallWithChainCertAndRootCA/SSL_TCP, where GetParam() = (true, false)
1 FAILED TEST