Diagnosed failure
Parameters/TestRpc.TestCallWithChainCertAndChainCA/SSL_UnixSocket: /data0/somelongdirectorytoavoidrpathissues/src/kudu/src/kudu/rpc/rpc-test.cc:270: Failure
Failed
Bad status: Runtime error: could not verify certificate chain (error with cert: subject=CN = localhost, ST = sadfjas, C = AS, emailAddress = sdflkdsajf, O = lskdfjlsad, OU = sldfkja, issuer=C = AS, ST = ASDfkjdhf, L = lskdjf, O = saldfja, OU = skdjf, CN = localhost, emailAddress = sadjflkadsj): : certificate has expired
Google Test trace:
/data0/somelongdirectorytoavoidrpathissues/src/kudu/src/kudu/rpc/rpc-test.cc:267: Connecting to unix:/tmp/dist-test-taskICLlUC/test-tmp/rpc-test-2f7029873beb4879bbc7d60366d24cb3.sock
I20260925 02:00:58.342127 21332 test_util.cc:175] -----------------------------------------------
I20260925 02:00:58.342212 21332 test_util.cc:176] Had fatal failures, leaving test files at /tmp/dist-test-taskICLlUC/test-tmp/rpc-test.6.Parameters_TestRpc.TestCallWithChainCertAndChainCA_SSL_UnixSocket.1790301658202897-21332-0
Full log
Note: This is test shard 7 of 8.
[==========] Running 21 tests from 2 test suites.
[----------] Global test environment set-up.
[----------] 20 tests from Parameters/TestRpc
[ RUN ] Parameters/TestRpc.TestMessengerCreateDestroy/SSL_UnixSocket
WARNING: Logging before InitGoogleLogging() is written to STDERR
I20260925 02:00:58.272539 21332 rpc-test.cc:169] started messenger TestCreateDestroy
[ OK ] Parameters/TestRpc.TestMessengerCreateDestroy/SSL_UnixSocket (30 ms)
[ RUN ] Parameters/TestRpc.TestNegotiationDeadlock/SSL_UnixSocket
I20260925 02:00:58.289947 21352 acceptor_pool.cc:254] collecting diagnostics on the listening RPC socket unix:/tmp/dist-test-taskICLlUC/test-tmp/rpc-test-b0dcaa4798034b6b932b90edf011019a.sock every 8 connection(s)
I20260925 02:00:58.290318 21353 acceptor_pool.cc:254] collecting diagnostics on the listening RPC socket unix:/tmp/dist-test-taskICLlUC/test-tmp/rpc-test-b0dcaa4798034b6b932b90edf011019a.sock every 8 connection(s)
[ OK ] Parameters/TestRpc.TestNegotiationDeadlock/SSL_UnixSocket (36 ms)
[ RUN ] Parameters/TestRpc.TestCallWithChainCertAndChainCA/SSL_UnixSocket
I20260925 02:00:58.328315 21368 acceptor_pool.cc:254] collecting diagnostics on the listening RPC socket unix:/tmp/dist-test-taskICLlUC/test-tmp/rpc-test-2f7029873beb4879bbc7d60366d24cb3.sock every 8 connection(s)
I20260925 02:00:58.328678 21369 acceptor_pool.cc:254] collecting diagnostics on the listening RPC socket unix:/tmp/dist-test-taskICLlUC/test-tmp/rpc-test-2f7029873beb4879bbc7d60366d24cb3.sock every 8 connection(s)
/data0/somelongdirectorytoavoidrpathissues/src/kudu/src/kudu/rpc/rpc-test.cc:270: Failure
Failed
Bad status: Runtime error: could not verify certificate chain (error with cert: subject=CN = localhost, ST = sadfjas, C = AS, emailAddress = sdflkdsajf, O = lskdfjlsad, OU = sldfkja, issuer=C = AS, ST = ASDfkjdhf, L = lskdjf, O = saldfja, OU = skdjf, CN = localhost, emailAddress = sadjflkadsj): : certificate has expired
Google Test trace:
/data0/somelongdirectorytoavoidrpathissues/src/kudu/src/kudu/rpc/rpc-test.cc:267: Connecting to unix:/tmp/dist-test-taskICLlUC/test-tmp/rpc-test-2f7029873beb4879bbc7d60366d24cb3.sock
I20260925 02:00:58.342127 21332 test_util.cc:175] -----------------------------------------------
I20260925 02:00:58.342212 21332 test_util.cc:176] Had fatal failures, leaving test files at /tmp/dist-test-taskICLlUC/test-tmp/rpc-test.6.Parameters_TestRpc.TestCallWithChainCertAndChainCA_SSL_UnixSocket.1790301658202897-21332-0
[ FAILED ] Parameters/TestRpc.TestCallWithChainCertAndChainCA/SSL_UnixSocket, where GetParam() = (true, true) (29 ms)
[ RUN ] Parameters/TestRpc.TestCallWithPasswordProtectedKey/SSL_UnixSocket
I20260925 02:00:58.366510 21393 acceptor_pool.cc:254] collecting diagnostics on the listening RPC socket unix:/tmp/dist-test-taskICLlUC/test-tmp/rpc-test-0529dc9c44a14641a39fc6ce0b1bf85b.sock every 8 connection(s)
I20260925 02:00:58.366740 21394 acceptor_pool.cc:254] collecting diagnostics on the listening RPC socket unix:/tmp/dist-test-taskICLlUC/test-tmp/rpc-test-0529dc9c44a14641a39fc6ce0b1bf85b.sock every 8 connection(s)
W20260925 02:00:58.399616 21390 connection.cc:196] Error closing socket: Network error: TlsSocket::Close: Broken pipe
[ OK ] Parameters/TestRpc.TestCallWithPasswordProtectedKey/SSL_UnixSocket (61 ms)
[ RUN ] Parameters/TestRpc.TestCallToBadServer/SSL_UnixSocket
I20260925 02:00:58.417415 21332 rpc-test.cc:394] Status: Network error: Client connection negotiation failed: client connection to 0.0.0.0:0: connect: Connection refused (error 111)
I20260925 02:00:58.417963 21332 rpc-test.cc:394] Status: Network error: Client connection negotiation failed: client connection to 0.0.0.0:0: connect: Connection refused (error 111)
I20260925 02:00:58.418495 21332 rpc-test.cc:394] Status: Network error: Client connection negotiation failed: client connection to 0.0.0.0:0: connect: Connection refused (error 111)
I20260925 02:00:58.418978 21332 rpc-test.cc:394] Status: Network error: Client connection negotiation failed: client connection to 0.0.0.0:0: connect: Connection refused (error 111)
I20260925 02:00:58.419469 21332 rpc-test.cc:394] Status: Network error: Client connection negotiation failed: client connection to 0.0.0.0:0: connect: Connection refused (error 111)
[ OK ] Parameters/TestRpc.TestCallToBadServer/SSL_UnixSocket (17 ms)
[ RUN ] Parameters/TestRpc.TestWrongService/SSL_UnixSocket
I20260925 02:00:58.431072 21428 acceptor_pool.cc:254] collecting diagnostics on the listening RPC socket unix:/tmp/dist-test-taskICLlUC/test-tmp/rpc-test-4437a57265d24578b5943f41ea9582e2.sock every 8 connection(s)
I20260925 02:00:58.431334 21429 acceptor_pool.cc:254] collecting diagnostics on the listening RPC socket unix:/tmp/dist-test-taskICLlUC/test-tmp/rpc-test-4437a57265d24578b5943f41ea9582e2.sock every 8 connection(s)
I20260925 02:00:58.460755 21425 messenger.cc:345] service WrongServiceName not registered on TestServer
W20260925 02:00:58.463382 21425 connection.cc:196] Error closing socket: Network error: TlsSocket::Close: Broken pipe
[ OK ] Parameters/TestRpc.TestWrongService/SSL_UnixSocket (44 ms)
[ RUN ] Parameters/TestRpc.TestConnectionKeepalive/SSL_UnixSocket
I20260925 02:00:58.492545 21451 acceptor_pool.cc:254] collecting diagnostics on the listening RPC socket unix:/tmp/dist-test-taskICLlUC/test-tmp/rpc-test-32c9d06231ac4663a49fb5398685e5de.sock every 8 connection(s)
I20260925 02:00:58.492861 21452 acceptor_pool.cc:254] collecting diagnostics on the listening RPC socket unix:/tmp/dist-test-taskICLlUC/test-tmp/rpc-test-32c9d06231ac4663a49fb5398685e5de.sock every 8 connection(s)
I20260925 02:00:58.494174 21332 rpc-test.cc:488] Connecting to unix:/tmp/dist-test-taskICLlUC/test-tmp/rpc-test-32c9d06231ac4663a49fb5398685e5de.sock
W20260925 02:00:58.967753 21464 connection.cc:196] Error closing socket: Network error: TlsSocket::Close: Broken pipe
[ OK ] Parameters/TestRpc.TestConnectionKeepalive/SSL_UnixSocket (1061 ms)
[ RUN ] Parameters/TestRpc.TestClientConnectionMetrics/SSL_UnixSocket
I20260925 02:00:59.537505 21476 acceptor_pool.cc:254] collecting diagnostics on the listening RPC socket unix:/tmp/dist-test-taskICLlUC/test-tmp/rpc-test-15ed9d1922864a919493d5f662de976c.sock every 8 connection(s)
I20260925 02:00:59.537729 21477 acceptor_pool.cc:254] collecting diagnostics on the listening RPC socket unix:/tmp/dist-test-taskICLlUC/test-tmp/rpc-test-15ed9d1922864a919493d5f662de976c.sock every 8 connection(s)
I20260925 02:00:59.538870 21332 rpc-test.cc:569] Connecting to unix:/tmp/dist-test-taskICLlUC/test-tmp/rpc-test-15ed9d1922864a919493d5f662de976c.sock
[ OK ] Parameters/TestRpc.TestClientConnectionMetrics/SSL_UnixSocket (19808 ms)
[ RUN ] Parameters/TestRpc.TestCredentialsPolicy/SSL_UnixSocket
I20260925 02:01:19.353109 21499 acceptor_pool.cc:254] collecting diagnostics on the listening RPC socket unix:/tmp/dist-test-taskICLlUC/test-tmp/rpc-test-56ff7efa16274042a2cde5f89e560893.sock every 8 connection(s)
I20260925 02:01:19.353293 21500 acceptor_pool.cc:254] collecting diagnostics on the listening RPC socket unix:/tmp/dist-test-taskICLlUC/test-tmp/rpc-test-56ff7efa16274042a2cde5f89e560893.sock every 8 connection(s)
I20260925 02:01:19.354172 21332 rpc-test.cc:700] Connecting to unix:/tmp/dist-test-taskICLlUC/test-tmp/rpc-test-56ff7efa16274042a2cde5f89e560893.sock
W20260925 02:01:19.385704 21498 connection.cc:196] Error closing socket: Network error: TlsSocket::Close: Broken pipe
[ OK ] Parameters/TestRpc.TestCredentialsPolicy/SSL_UnixSocket (59 ms)
[ RUN ] Parameters/TestRpc.TestCallLongerThanKeepalive/SSL_UnixSocket
I20260925 02:01:19.410655 21524 acceptor_pool.cc:254] collecting diagnostics on the listening RPC socket unix:/tmp/dist-test-taskICLlUC/test-tmp/rpc-test-8392da9963d643859ac247faceab9edc.sock every 8 connection(s)
I20260925 02:01:19.410825 21525 acceptor_pool.cc:254] collecting diagnostics on the listening RPC socket unix:/tmp/dist-test-taskICLlUC/test-tmp/rpc-test-8392da9963d643859ac247faceab9edc.sock every 8 connection(s)
I20260925 02:01:19.439466 21528 rpc-test-base.h:222] got call: sleep_micros: 3000000 deferred: true
I20260925 02:01:22.441149 21528 rpcz_store.cc:275] Call kudu.rpc.GenericCalculatorService.Sleep from unix:<unnamed> (request call id 0) took 3001 ms. Trace:
I20260925 02:01:22.441318 21528 rpcz_store.cc:276] 0925 02:01:19.439367 (+ 0us) service_pool.cc:170] Inserting onto call queue
0925 02:01:19.439423 (+ 56us) service_pool.cc:227] Handling call
0925 02:01:22.441099 (+3001676us) inbound_call.cc:173] Queueing success response
Metrics: {}
[ OK ] Parameters/TestRpc.TestCallLongerThanKeepalive/SSL_UnixSocket (3051 ms)
[ RUN ] Parameters/TestRpc.TestRpcSidecar/SSL_UnixSocket
I20260925 02:01:22.471509 21549 acceptor_pool.cc:254] collecting diagnostics on the listening RPC socket unix:/tmp/dist-test-taskICLlUC/test-tmp/rpc-test-1ee60161cbae4304909c02270d36a5a7.sock every 8 connection(s)
I20260925 02:01:22.471710 21550 acceptor_pool.cc:254] collecting diagnostics on the listening RPC socket unix:/tmp/dist-test-taskICLlUC/test-tmp/rpc-test-1ee60161cbae4304909c02270d36a5a7.sock every 8 connection(s)
W20260925 02:01:22.563020 21546 connection.cc:196] Error closing socket: Network error: TlsSocket::Close: Broken pipe
[ OK ] Parameters/TestRpc.TestRpcSidecar/SSL_UnixSocket (118 ms)
[ RUN ] Parameters/TestRpc.TestRpcSidecarLimits/SSL_UnixSocket
I20260925 02:01:24.713824 21574 acceptor_pool.cc:254] collecting diagnostics on the listening RPC socket unix:/tmp/dist-test-taskICLlUC/test-tmp/rpc-test-a7bc8c4aacf64144ad0f0ae7ce9ec06b.sock every 8 connection(s)
I20260925 02:01:24.714111 21575 acceptor_pool.cc:254] collecting diagnostics on the listening RPC socket unix:/tmp/dist-test-taskICLlUC/test-tmp/rpc-test-a7bc8c4aacf64144ad0f0ae7ce9ec06b.sock every 8 connection(s)
W20260925 02:01:24.733946 21332 serialization.cc:72] Serialized kudu.rpc_test.PushStringsRequestPB (2147483654 bytes) is larger than the maximum configured RPC message size (52428800 bytes). Sending anyway, but peer may reject the data.
W20260925 02:01:24.739684 21571 connection.cc:535] server connection from unix:<unnamed> recv error: Network error: RPC frame had a length of 2147483714, but we only support messages up to 52428800 bytes long.
W20260925 02:01:24.739825 21571 connection.cc:158] shutting down server connection from unix:<unnamed> with pending inbound data: 4/2147483714 bytes received; last active 0 ns ago: status Network error: RPC frame had a length of 2147483714, but we only support messages up to 52428800 bytes long.
W20260925 02:01:24.740295 21587 connection.cc:196] Error closing socket: Network error: TlsSocket::Close: Broken pipe
I20260925 02:01:24.756772 21599 acceptor_pool.cc:254] collecting diagnostics on the listening RPC socket unix:/tmp/dist-test-taskICLlUC/test-tmp/rpc-test-a7bc8c4aacf64144ad0f0ae7ce9ec06b.sock every 8 connection(s)
I20260925 02:01:24.757571 21600 acceptor_pool.cc:254] collecting diagnostics on the listening RPC socket unix:/tmp/dist-test-taskICLlUC/test-tmp/rpc-test-a7bc8c4aacf64144ad0f0ae7ce9ec06b.sock every 8 connection(s)
W20260925 02:01:32.225558 21596 connection.cc:577] server connection from unix:<unnamed>: received bad data: 'Corruption: Invalid packet: message had a length of 2147483710, but we only support messages up to 2147483647 bytes
'
W20260925 02:01:32.226221 21612 connection.cc:196] Error closing socket: Network error: TlsSocket::Close: Broken pipe
[ OK ] Parameters/TestRpc.TestRpcSidecarLimits/SSL_UnixSocket (10091 ms)
[ RUN ] Parameters/TestRpc.TestCallTimeoutDoesntAffectNegotiation/SSL_UnixSocket
I20260925 02:01:32.685985 21624 acceptor_pool.cc:254] collecting diagnostics on the listening RPC socket unix:/tmp/dist-test-taskICLlUC/test-tmp/rpc-test-e3bfc3fe24d74a449a60ffbcbdf5efc9.sock every 8 connection(s)
I20260925 02:01:32.686237 21625 acceptor_pool.cc:254] collecting diagnostics on the listening RPC socket unix:/tmp/dist-test-taskICLlUC/test-tmp/rpc-test-e3bfc3fe24d74a449a60ffbcbdf5efc9.sock every 8 connection(s)
W20260925 02:01:32.718729 21620 negotiation.cc:266] Injecting 500ms delay in negotiation
I20260925 02:01:32.769094 21332 rpc-test-base.h:595] status: Timed out: connection negotiation to unix:/tmp/dist-test-taskICLlUC/test-tmp/rpc-test-e3bfc3fe24d74a449a60ffbcbdf5efc9.sock for RPC Sleep timed out after 0.050s (ON_OUTBOUND_QUEUE), seconds elapsed: 0.0509991
[ OK ] Parameters/TestRpc.TestCallTimeoutDoesntAffectNegotiation/SSL_UnixSocket (570 ms)
[ RUN ] Parameters/TestRpc.TestRpcHandlerLatencyMetric/SSL_UnixSocket
I20260925 02:01:33.244302 21649 acceptor_pool.cc:254] collecting diagnostics on the listening RPC socket unix:/tmp/dist-test-taskICLlUC/test-tmp/rpc-test-4680e68e4f594cd59ac74e1030a6c484.sock every 8 connection(s)
I20260925 02:01:33.244480 21650 acceptor_pool.cc:254] collecting diagnostics on the listening RPC socket unix:/tmp/dist-test-taskICLlUC/test-tmp/rpc-test-4680e68e4f594cd59ac74e1030a6c484.sock every 8 connection(s)
I20260925 02:01:33.280735 21332 rpc-test.cc:1236] Sleep() min lat: 20571
I20260925 02:01:33.280848 21332 rpc-test.cc:1237] Sleep() mean lat: 20571
I20260925 02:01:33.280897 21332 rpc-test.cc:1238] Sleep() max lat: 20571
I20260925 02:01:33.280920 21332 rpc-test.cc:1239] Sleep() #calls: 1
W20260925 02:01:33.281780 21646 connection.cc:196] Error closing socket: Network error: TlsSocket::Close: Broken pipe
[ OK ] Parameters/TestRpc.TestRpcHandlerLatencyMetric/SSL_UnixSocket (56 ms)
[ RUN ] Parameters/TestRpc.TimedOutOnResponseMetricServiceQueue/SSL_UnixSocket
I20260925 02:01:33.299815 21675 acceptor_pool.cc:254] collecting diagnostics on the listening RPC socket unix:/tmp/dist-test-taskICLlUC/test-tmp/rpc-test-4fba17bb77aa4a79994fbc4ddf447cf8.sock every 8 connection(s)
I20260925 02:01:33.300036 21676 acceptor_pool.cc:254] collecting diagnostics on the listening RPC socket unix:/tmp/dist-test-taskICLlUC/test-tmp/rpc-test-4fba17bb77aa4a79994fbc4ddf447cf8.sock every 8 connection(s)
W20260925 02:01:33.370393 21677 rpcz_store.cc:267] Call kudu.rpc_test.CalculatorService.Sleep from unix:<unnamed> (request call id 2) took 20 ms (client timeout 20 ms). Trace:
W20260925 02:01:33.370519 21677 rpcz_store.cc:269] 0925 02:01:33.349922 (+ 0us) service_pool.cc:170] Inserting onto call queue
0925 02:01:33.370319 (+ 20397us) service_pool.cc:214] Skipping call since client already timed out
0925 02:01:33.370374 (+ 55us) inbound_call.cc:173] Queueing failure response
Metrics: {}
W20260925 02:01:33.371618 21672 connection.cc:196] Error closing socket: Network error: TlsSocket::Close: Broken pipe
[ OK ] Parameters/TestRpc.TimedOutOnResponseMetricServiceQueue/SSL_UnixSocket (88 ms)
[ RUN ] Parameters/TestRpc.RpcPendingConnectionsMetric/SSL_UnixSocket
I20260925 02:01:33.378737 21698 acceptor_pool.cc:254] collecting diagnostics on the listening RPC socket 0.0.0.0:42333 every 8 connection(s)
I20260925 02:01:33.378916 21699 acceptor_pool.cc:254] collecting diagnostics on the listening RPC socket 0.0.0.0:42333 every 8 connection(s)
W20260925 02:01:33.380868 21694 negotiation.cc:337] Failed RPC negotiation. Trace:
0925 02:01:33.380258 (+ 0us) reactor.cc:625] Submitting negotiation task for server connection from 127.0.0.1:34224 (local address 127.0.0.1:42333)
0925 02:01:33.380396 (+ 138us) server_negotiation.cc:206] Beginning negotiation
0925 02:01:33.380400 (+ 4us) server_negotiation.cc:399] Waiting for connection header
0925 02:01:33.380548 (+ 148us) negotiation.cc:327] Negotiation complete: Network error: Server connection negotiation failed: server connection from 127.0.0.1:34224: BlockingRecv error: recv got EOF from 127.0.0.1:34224 (error 108)
Metrics: {"server-negotiator.queue_time_us":40}
[ OK ] Parameters/TestRpc.RpcPendingConnectionsMetric/SSL_UnixSocket (18 ms)
[ RUN ] Parameters/TestRpc.TestRpcContextClientDeadline/SSL_UnixSocket
I20260925 02:01:33.406430 21714 acceptor_pool.cc:254] collecting diagnostics on the listening RPC socket unix:/tmp/dist-test-taskICLlUC/test-tmp/rpc-test-51005fb6ddd04cc197264f99e6895f38.sock every 8 connection(s)
I20260925 02:01:33.406592 21715 acceptor_pool.cc:254] collecting diagnostics on the listening RPC socket unix:/tmp/dist-test-taskICLlUC/test-tmp/rpc-test-51005fb6ddd04cc197264f99e6895f38.sock every 8 connection(s)
[ OK ] Parameters/TestRpc.TestRpcContextClientDeadline/SSL_UnixSocket (58 ms)
[ RUN ] Parameters/TestRpc.TestApplicationFeatureFlagUnsupportedServer/SSL_UnixSocket
I20260925 02:01:33.472178 21739 acceptor_pool.cc:254] collecting diagnostics on the listening RPC socket unix:/tmp/dist-test-taskICLlUC/test-tmp/rpc-test-74a4a2ee30204cb4a95f51d1afa0fa58.sock every 8 connection(s)
I20260925 02:01:33.472397 21740 acceptor_pool.cc:254] collecting diagnostics on the listening RPC socket unix:/tmp/dist-test-taskICLlUC/test-tmp/rpc-test-74a4a2ee30204cb4a95f51d1afa0fa58.sock every 8 connection(s)
[ OK ] Parameters/TestRpc.TestApplicationFeatureFlagUnsupportedServer/SSL_UnixSocket (51 ms)
[ RUN ] Parameters/TestRpc.TestCancellationAsync/SSL_UnixSocket
I20260925 02:01:33.532847 21764 acceptor_pool.cc:254] collecting diagnostics on the listening RPC socket unix:/tmp/dist-test-taskICLlUC/test-tmp/rpc-test-b27b9c2afd5f442ca09de51af5072a47.sock every 8 connection(s)
I20260925 02:01:33.533070 21765 acceptor_pool.cc:254] collecting diagnostics on the listening RPC socket unix:/tmp/dist-test-taskICLlUC/test-tmp/rpc-test-b27b9c2afd5f442ca09de51af5072a47.sock every 8 connection(s)
I20260925 02:01:33.533943 21332 rpc-test.cc:1716] Connecting to unix:/tmp/dist-test-taskICLlUC/test-tmp/rpc-test-b27b9c2afd5f442ca09de51af5072a47.sock
I20260925 02:01:33.547259 21332 test_util.cc:268] Using random seed: 410784491
I20260925 02:01:33.582047 21768 rpc-test-base.h:240] got call: sleep_micros: 500 pattern: 4294967295 num_repetitions: 2097152 sidecar_idx: 0
I20260925 02:01:33.609584 21767 rpc-test-base.h:240] got call: sleep_micros: 500 pattern: 4294967295 num_repetitions: 2097152 sidecar_idx: 0
I20260925 02:01:33.636675 21768 rpc-test-base.h:240] got call: sleep_micros: 500 pattern: 4294967295 num_repetitions: 2097152 sidecar_idx: 0
I20260925 02:01:33.665174 21767 rpc-test-base.h:240] got call: sleep_micros: 500 pattern: 4294967295 num_repetitions: 2097152 sidecar_idx: 0
I20260925 02:01:33.691924 21768 rpc-test-base.h:240] got call: sleep_micros: 500 pattern: 4294967295 num_repetitions: 2097152 sidecar_idx: 0
I20260925 02:01:33.720455 21767 rpc-test-base.h:240] got call: sleep_micros: 500 pattern: 4294967295 num_repetitions: 2097152 sidecar_idx: 0
I20260925 02:01:33.748577 21768 rpc-test-base.h:240] got call: sleep_micros: 500 pattern: 4294967295 num_repetitions: 2097152 sidecar_idx: 0
W20260925 02:01:33.750689 21761 connection.cc:196] Error closing socket: Network error: TlsSocket::Close: Broken pipe
W20260925 02:01:33.764818 21761 connection.cc:441] server connection from unix:<unnamed> torn down before Call kudu.rpc.GenericCalculatorService.SleepWithSidecar from unix:<unnamed> (request call id 8) could send its response
W20260925 02:01:33.780714 21761 connection.cc:441] server connection from unix:<unnamed> torn down before Call kudu.rpc.GenericCalculatorService.SleepWithSidecar from unix:<unnamed> (request call id 9) could send its response
[ OK ] Parameters/TestRpc.TestCancellationAsync/SSL_UnixSocket (280 ms)
[ RUN ] Parameters/TestRpc.TestPerformanceBySocketType/SSL_UnixSocket
I20260925 02:01:33.802567 21789 acceptor_pool.cc:254] collecting diagnostics on the listening RPC socket unix:/tmp/dist-test-taskICLlUC/test-tmp/rpc-test-9b27b2b24f4a49e796e2f0fbef88140b.sock every 8 connection(s)
I20260925 02:01:33.802796 21790 acceptor_pool.cc:254] collecting diagnostics on the listening RPC socket unix:/tmp/dist-test-taskICLlUC/test-tmp/rpc-test-9b27b2b24f4a49e796e2f0fbef88140b.sock every 8 connection(s)
I20260925 02:01:33.803622 21332 rpc-test.cc:1846] Connecting to unix:/tmp/dist-test-taskICLlUC/test-tmp/rpc-test-9b27b2b24f4a49e796e2f0fbef88140b.sock
I20260925 02:01:36.747879 21332 rpc-test.cc:1859] Sending 1024MB via ssl-enabled unix socket: real 2.920s user 2.727s sys 2.194s
I20260925 02:01:39.699357 21332 rpc-test.cc:1859] Sending 1024MB via ssl-enabled unix socket: real 2.951s user 2.726s sys 2.236s
I20260925 02:01:42.642208 21332 rpc-test.cc:1859] Sending 1024MB via ssl-enabled unix socket: real 2.943s user 2.811s sys 2.139s
I20260925 02:01:45.674607 21332 rpc-test.cc:1859] Sending 1024MB via ssl-enabled unix socket: real 3.032s user 2.957s sys 2.158s
I20260925 02:01:48.620998 21332 rpc-test.cc:1859] Sending 1024MB via ssl-enabled unix socket: real 2.946s user 2.847s sys 2.109s
W20260925 02:01:48.622571 21786 connection.cc:196] Error closing socket: Network error: TlsSocket::Close: Broken pipe
[ OK ] Parameters/TestRpc.TestPerformanceBySocketType/SSL_UnixSocket (14843 ms)
[----------] 20 tests from Parameters/TestRpc (50381 ms total)
[----------] 1 test from Parameters/TestRpcSocketTxRxQueue
[ RUN ] Parameters/TestRpcSocketTxRxQueue.AcceptorRxQueueSizeMetric/0
I20260925 02:01:48.631604 21814 acceptor_pool.cc:254] collecting diagnostics on the listening RPC socket 0.0.0.0:41943 every 1 connection(s)
I20260925 02:01:48.631816 21815 acceptor_pool.cc:254] collecting diagnostics on the listening RPC socket 0.0.0.0:41943 every 1 connection(s)
W20260925 02:01:48.633371 21810 negotiation.cc:337] Failed RPC negotiation. Trace:
0925 02:01:48.633001 (+ 0us) reactor.cc:625] Submitting negotiation task for server connection from 127.0.0.1:57488 (local address 127.0.0.1:41943)
0925 02:01:48.633146 (+ 145us) server_negotiation.cc:206] Beginning negotiation
0925 02:01:48.633150 (+ 4us) server_negotiation.cc:399] Waiting for connection header
0925 02:01:48.633264 (+ 114us) negotiation.cc:327] Negotiation complete: Network error: Server connection negotiation failed: server connection from 127.0.0.1:57488: BlockingRecv error: recv got EOF from 127.0.0.1:57488 (error 108)
Metrics: {"server-negotiator.queue_time_us":40}
[ OK ] Parameters/TestRpcSocketTxRxQueue.AcceptorRxQueueSizeMetric/0 (9 ms)
[----------] 1 test from Parameters/TestRpcSocketTxRxQueue (9 ms total)
[----------] Global test environment tear-down
[==========] 21 tests from 2 test suites ran. (50391 ms total)
[ PASSED ] 20 tests.
[ FAILED ] 1 test, listed below:
[ FAILED ] Parameters/TestRpc.TestCallWithChainCertAndChainCA/SSL_UnixSocket, where GetParam() = (true, true)
1 FAILED TEST