Diagnosed failure

Parameters/TestRpc.TestCallWithChainCertAndRootCA/SSL_UnixSocket: /data0/somelongdirectorytoavoidrpathissues/src/kudu/src/kudu/rpc/rpc-test.cc:303: Failure
Failed
Bad status: Runtime error: could not verify certificate chain (error with cert: subject=CN = localhost, ST = sadfjas, C = AS, emailAddress = sdflkdsajf, O = lskdfjlsad, OU = sldfkja, issuer=C = AS, ST = ASDfkjdhf, L = lskdjf, O = saldfja, OU = skdjf, CN = localhost, emailAddress = sadjflkadsj): : certificate has expired
Google Test trace:
/data0/somelongdirectorytoavoidrpathissues/src/kudu/src/kudu/rpc/rpc-test.cc:300: Connecting to unix:/tmp/dist-test-taskeDnGty/test-tmp/rpc-test-2b5a3c3e9f134e55935553e263f37f0c.sock
I20260928 11:44:34.504880  2729 test_util.cc:175] -----------------------------------------------
I20260928 11:44:34.505040  2729 test_util.cc:176] Had fatal failures, leaving test files at /tmp/dist-test-taskeDnGty/test-tmp/rpc-test.2.Parameters_TestRpc.TestCallWithChainCertAndRootCA_SSL_UnixSocket.1790595870914764-2729-0

Full log

Note: This is test shard 3 of 8.
[==========] Running 21 tests from 2 test suites.
[----------] Global test environment set-up.
[----------] 1 test from TestRpc
[ RUN      ] TestRpc.TestNegotiationTimeout
WARNING: Logging before InitGoogleLogging() is written to STDERR
I20260928 11:44:31.100970  2729 rpc-test-base.h:595] status: Timed out: connection negotiation to 0.0.0.0:42633 for RPC Sleep timed out after 0.100s (ON_OUTBOUND_QUEUE), seconds elapsed: 0.101754
W20260928 11:44:34.256181  2739 negotiation.cc:337] Failed RPC negotiation. Trace:
0928 11:44:31.000094 (+     0us) reactor.cc:625] Submitting negotiation task for client connection to 0.0.0.0:42633 (local address 127.0.0.1:39412)
0928 11:44:31.000824 (+   730us) negotiation.cc:107] Waiting for socket to connect
0928 11:44:31.000871 (+    47us) client_negotiation.cc:174] Beginning negotiation
0928 11:44:31.012550 (+ 11679us) client_negotiation.cc:252] Sending NEGOTIATE NegotiatePB request
0928 11:44:34.255101 (+3242551us) negotiation.cc:327] Negotiation complete: Timed out: Client connection negotiation failed: client connection to 0.0.0.0:42633: received 0 of 4 requested bytes
Metrics: {"client-negotiator.queue_time_us":198}
[       OK ] TestRpc.TestNegotiationTimeout (3298 ms)
[----------] 1 test from TestRpc (3298 ms total)

[----------] 20 tests from Parameters/TestRpc
[ RUN      ] Parameters/TestRpc.TestAcceptorPoolStartStop/SSL_UnixSocket
I20260928 11:44:34.299609  2755 acceptor_pool.cc:254] collecting diagnostics on the listening RPC socket unix:/tmp/dist-test-taskeDnGty/test-tmp/rpc-test-9dc658f3e19944029a38095678c914e3.sock every 8 connection(s)
I20260928 11:44:34.301066  2756 acceptor_pool.cc:254] collecting diagnostics on the listening RPC socket unix:/tmp/dist-test-taskeDnGty/test-tmp/rpc-test-9dc658f3e19944029a38095678c914e3.sock every 8 connection(s)
I20260928 11:44:34.336169  2766 acceptor_pool.cc:254] collecting diagnostics on the listening RPC socket unix:/tmp/dist-test-taskeDnGty/test-tmp/rpc-test-9dc658f3e19944029a38095678c914e3.sock every 8 connection(s)
I20260928 11:44:34.337366  2767 acceptor_pool.cc:254] collecting diagnostics on the listening RPC socket unix:/tmp/dist-test-taskeDnGty/test-tmp/rpc-test-9dc658f3e19944029a38095678c914e3.sock every 8 connection(s)
I20260928 11:44:34.354061  2777 acceptor_pool.cc:254] collecting diagnostics on the listening RPC socket unix:/tmp/dist-test-taskeDnGty/test-tmp/rpc-test-9dc658f3e19944029a38095678c914e3.sock every 8 connection(s)
I20260928 11:44:34.354759  2778 acceptor_pool.cc:254] collecting diagnostics on the listening RPC socket unix:/tmp/dist-test-taskeDnGty/test-tmp/rpc-test-9dc658f3e19944029a38095678c914e3.sock every 8 connection(s)
I20260928 11:44:34.371106  2788 acceptor_pool.cc:254] collecting diagnostics on the listening RPC socket unix:/tmp/dist-test-taskeDnGty/test-tmp/rpc-test-9dc658f3e19944029a38095678c914e3.sock every 8 connection(s)
I20260928 11:44:34.371767  2789 acceptor_pool.cc:254] collecting diagnostics on the listening RPC socket unix:/tmp/dist-test-taskeDnGty/test-tmp/rpc-test-9dc658f3e19944029a38095678c914e3.sock every 8 connection(s)
I20260928 11:44:34.389726  2799 acceptor_pool.cc:254] collecting diagnostics on the listening RPC socket unix:/tmp/dist-test-taskeDnGty/test-tmp/rpc-test-9dc658f3e19944029a38095678c914e3.sock every 8 connection(s)
I20260928 11:44:34.390390  2800 acceptor_pool.cc:254] collecting diagnostics on the listening RPC socket unix:/tmp/dist-test-taskeDnGty/test-tmp/rpc-test-9dc658f3e19944029a38095678c914e3.sock every 8 connection(s)
[       OK ] Parameters/TestRpc.TestAcceptorPoolStartStop/SSL_UnixSocket (130 ms)
[ RUN      ] Parameters/TestRpc.TestCall/SSL_UnixSocket
I20260928 11:44:34.411773  2812 acceptor_pool.cc:254] collecting diagnostics on the listening RPC socket unix:/tmp/dist-test-taskeDnGty/test-tmp/rpc-test-ad090970d8f641a5a650b817a9c5b4b3.sock every 8 connection(s)
I20260928 11:44:34.413556  2813 acceptor_pool.cc:254] collecting diagnostics on the listening RPC socket unix:/tmp/dist-test-taskeDnGty/test-tmp/rpc-test-ad090970d8f641a5a650b817a9c5b4b3.sock every 8 connection(s)
I20260928 11:44:34.418047  2729 rpc-test.cc:234] Connecting to unix:/tmp/dist-test-taskeDnGty/test-tmp/rpc-test-ad090970d8f641a5a650b817a9c5b4b3.sock
W20260928 11:44:34.459620  2809 connection.cc:196] Error closing socket: Network error: TlsSocket::Close: Broken pipe
[       OK ] Parameters/TestRpc.TestCall/SSL_UnixSocket (70 ms)
[ RUN      ] Parameters/TestRpc.TestCallWithChainCertAndRootCA/SSL_UnixSocket
I20260928 11:44:34.485956  2837 acceptor_pool.cc:254] collecting diagnostics on the listening RPC socket unix:/tmp/dist-test-taskeDnGty/test-tmp/rpc-test-2b5a3c3e9f134e55935553e263f37f0c.sock every 8 connection(s)
I20260928 11:44:34.486665  2838 acceptor_pool.cc:254] collecting diagnostics on the listening RPC socket unix:/tmp/dist-test-taskeDnGty/test-tmp/rpc-test-2b5a3c3e9f134e55935553e263f37f0c.sock every 8 connection(s)
/data0/somelongdirectorytoavoidrpathissues/src/kudu/src/kudu/rpc/rpc-test.cc:303: Failure
Failed
Bad status: Runtime error: could not verify certificate chain (error with cert: subject=CN = localhost, ST = sadfjas, C = AS, emailAddress = sdflkdsajf, O = lskdfjlsad, OU = sldfkja, issuer=C = AS, ST = ASDfkjdhf, L = lskdjf, O = saldfja, OU = skdjf, CN = localhost, emailAddress = sadjflkadsj): : certificate has expired
Google Test trace:
/data0/somelongdirectorytoavoidrpathissues/src/kudu/src/kudu/rpc/rpc-test.cc:300: Connecting to unix:/tmp/dist-test-taskeDnGty/test-tmp/rpc-test-2b5a3c3e9f134e55935553e263f37f0c.sock
I20260928 11:44:34.504880  2729 test_util.cc:175] -----------------------------------------------
I20260928 11:44:34.505040  2729 test_util.cc:176] Had fatal failures, leaving test files at /tmp/dist-test-taskeDnGty/test-tmp/rpc-test.2.Parameters_TestRpc.TestCallWithChainCertAndRootCA_SSL_UnixSocket.1790595870914764-2729-0
[  FAILED  ] Parameters/TestRpc.TestCallWithChainCertAndRootCA/SSL_UnixSocket, where GetParam() = (true, true) (40 ms)
[ RUN      ] Parameters/TestRpc.TestCallWithBadPasswordProtectedKey/SSL_UnixSocket
[       OK ] Parameters/TestRpc.TestCallWithBadPasswordProtectedKey/SSL_UnixSocket (28 ms)
[ RUN      ] Parameters/TestRpc.TestInvalidMethodCall/SSL_UnixSocket
I20260928 11:44:34.566856  2874 acceptor_pool.cc:254] collecting diagnostics on the listening RPC socket unix:/tmp/dist-test-taskeDnGty/test-tmp/rpc-test-bfc6cebc95814282adf5b97057f0ce71.sock every 8 connection(s)
I20260928 11:44:34.567644  2875 acceptor_pool.cc:254] collecting diagnostics on the listening RPC socket unix:/tmp/dist-test-taskeDnGty/test-tmp/rpc-test-bfc6cebc95814282adf5b97057f0ce71.sock every 8 connection(s)
I20260928 11:44:34.570844  2729 rpc-test.cc:406] Connecting to unix:/tmp/dist-test-taskeDnGty/test-tmp/rpc-test-bfc6cebc95814282adf5b97057f0ce71.sock
[       OK ] Parameters/TestRpc.TestInvalidMethodCall/SSL_UnixSocket (99 ms)
[ RUN      ] Parameters/TestRpc.TestHighFDs/SSL_UnixSocket
I20260928 11:44:34.829751  2899 acceptor_pool.cc:254] collecting diagnostics on the listening RPC socket unix:/tmp/dist-test-taskeDnGty/test-tmp/rpc-test-29a8975899be4b3ca2e352728172ebd7.sock every 8 connection(s)
I20260928 11:44:34.830399  2900 acceptor_pool.cc:254] collecting diagnostics on the listening RPC socket unix:/tmp/dist-test-taskeDnGty/test-tmp/rpc-test-29a8975899be4b3ca2e352728172ebd7.sock every 8 connection(s)
[       OK ] Parameters/TestRpc.TestHighFDs/SSL_UnixSocket (249 ms)
[ RUN      ] Parameters/TestRpc.TestConnectionAlwaysKeepalive/SSL_UnixSocket
I20260928 11:44:34.902992  2922 acceptor_pool.cc:254] collecting diagnostics on the listening RPC socket unix:/tmp/dist-test-taskeDnGty/test-tmp/rpc-test-6aa0fa4c85394f58b5ace14ba72e3956.sock every 8 connection(s)
I20260928 11:44:34.903645  2923 acceptor_pool.cc:254] collecting diagnostics on the listening RPC socket unix:/tmp/dist-test-taskeDnGty/test-tmp/rpc-test-6aa0fa4c85394f58b5ace14ba72e3956.sock every 8 connection(s)
I20260928 11:44:34.906478  2729 rpc-test.cc:532] Connecting to unix:/tmp/dist-test-taskeDnGty/test-tmp/rpc-test-6aa0fa4c85394f58b5ace14ba72e3956.sock
W20260928 11:44:37.930930  2921 connection.cc:196] Error closing socket: Network error: TlsSocket::Close: Broken pipe
[       OK ] Parameters/TestRpc.TestConnectionAlwaysKeepalive/SSL_UnixSocket (3053 ms)
[ RUN      ] Parameters/TestRpc.TestReopenOutboundConnections/SSL_UnixSocket
I20260928 11:44:37.971155  2945 acceptor_pool.cc:254] collecting diagnostics on the listening RPC socket unix:/tmp/dist-test-taskeDnGty/test-tmp/rpc-test-bd8f5a78e1ae4603adcf7ed89abe69de.sock every 8 connection(s)
I20260928 11:44:37.971797  2946 acceptor_pool.cc:254] collecting diagnostics on the listening RPC socket unix:/tmp/dist-test-taskeDnGty/test-tmp/rpc-test-bd8f5a78e1ae4603adcf7ed89abe69de.sock every 8 connection(s)
I20260928 11:44:37.974778  2729 rpc-test.cc:658] Connecting to unix:/tmp/dist-test-taskeDnGty/test-tmp/rpc-test-bd8f5a78e1ae4603adcf7ed89abe69de.sock
W20260928 11:44:38.008638  2944 connection.cc:196] Error closing socket: Network error: TlsSocket::Close: Broken pipe
W20260928 11:44:38.018098  2944 connection.cc:196] Error closing socket: Network error: TlsSocket::Close: Broken pipe
W20260928 11:44:38.027084  2944 connection.cc:196] Error closing socket: Network error: TlsSocket::Close: Broken pipe
W20260928 11:44:38.035753  2944 connection.cc:196] Error closing socket: Network error: TlsSocket::Close: Broken pipe
W20260928 11:44:38.044692  2944 connection.cc:196] Error closing socket: Network error: TlsSocket::Close: Broken pipe
W20260928 11:44:38.053378  2944 connection.cc:196] Error closing socket: Network error: TlsSocket::Close: Broken pipe
W20260928 11:44:38.062701  2944 connection.cc:196] Error closing socket: Network error: TlsSocket::Close: Broken pipe
W20260928 11:44:38.071800  2944 connection.cc:196] Error closing socket: Network error: TlsSocket::Close: Broken pipe
W20260928 11:44:38.080858  2944 connection.cc:196] Error closing socket: Network error: TlsSocket::Close: Broken pipe
W20260928 11:44:38.089376  2944 connection.cc:196] Error closing socket: Network error: TlsSocket::Close: Broken pipe
W20260928 11:44:38.097718  2944 connection.cc:196] Error closing socket: Network error: TlsSocket::Close: Broken pipe
W20260928 11:44:38.105851  2944 connection.cc:196] Error closing socket: Network error: TlsSocket::Close: Broken pipe
W20260928 11:44:38.114471  2944 connection.cc:196] Error closing socket: Network error: TlsSocket::Close: Broken pipe
W20260928 11:44:38.122973  2944 connection.cc:196] Error closing socket: Network error: TlsSocket::Close: Broken pipe
W20260928 11:44:38.123063  2945 acceptor_pool.cc:285] unable to collect diagnostics on RPC socket unix:/tmp/dist-test-taskeDnGty/test-tmp/rpc-test-bd8f5a78e1ae4603adcf7ed89abe69de.sock: Not implemented: netlink diagnostics is currently supported only on IPv4 TCP sockets
W20260928 11:44:38.132968  2944 connection.cc:196] Error closing socket: Network error: TlsSocket::Close: Broken pipe
W20260928 11:44:38.142293  2944 connection.cc:196] Error closing socket: Network error: TlsSocket::Close: Broken pipe
W20260928 11:44:38.151379  2944 connection.cc:196] Error closing socket: Network error: TlsSocket::Close: Broken pipe
W20260928 11:44:38.160271  2944 connection.cc:196] Error closing socket: Network error: TlsSocket::Close: Broken pipe
W20260928 11:44:38.169250  2944 connection.cc:196] Error closing socket: Network error: TlsSocket::Close: Broken pipe
W20260928 11:44:38.178119  2944 connection.cc:196] Error closing socket: Network error: TlsSocket::Close: Broken pipe
W20260928 11:44:38.186823  2944 connection.cc:196] Error closing socket: Network error: TlsSocket::Close: Broken pipe
W20260928 11:44:38.195748  2944 connection.cc:196] Error closing socket: Network error: TlsSocket::Close: Broken pipe
W20260928 11:44:38.204545  2944 connection.cc:196] Error closing socket: Network error: TlsSocket::Close: Broken pipe
W20260928 11:44:38.213034  2944 connection.cc:196] Error closing socket: Network error: TlsSocket::Close: Broken pipe
W20260928 11:44:38.222978  2944 connection.cc:196] Error closing socket: Network error: TlsSocket::Close: Broken pipe
W20260928 11:44:38.231364  2944 connection.cc:196] Error closing socket: Network error: TlsSocket::Close: Broken pipe
W20260928 11:44:38.239877  2944 connection.cc:196] Error closing socket: Network error: TlsSocket::Close: Broken pipe
W20260928 11:44:38.247779  2944 connection.cc:196] Error closing socket: Network error: TlsSocket::Close: Broken pipe
W20260928 11:44:38.255869  2944 connection.cc:196] Error closing socket: Network error: TlsSocket::Close: Broken pipe
W20260928 11:44:38.264176  2944 connection.cc:196] Error closing socket: Network error: TlsSocket::Close: Broken pipe
W20260928 11:44:38.272153  2944 connection.cc:196] Error closing socket: Network error: TlsSocket::Close: Broken pipe
W20260928 11:44:38.281508  2944 connection.cc:196] Error closing socket: Network error: TlsSocket::Close: Broken pipe
[       OK ] Parameters/TestRpc.TestReopenOutboundConnections/SSL_UnixSocket (350 ms)
[ RUN      ] Parameters/TestRpc.TestConnectionNetworkPlane/SSL_UnixSocket
I20260928 11:44:38.314805  2968 acceptor_pool.cc:254] collecting diagnostics on the listening RPC socket unix:/tmp/dist-test-taskeDnGty/test-tmp/rpc-test-2b7fa186710d4ad785ad183ae42f1d7b.sock every 8 connection(s)
I20260928 11:44:38.315500  2969 acceptor_pool.cc:254] collecting diagnostics on the listening RPC socket unix:/tmp/dist-test-taskeDnGty/test-tmp/rpc-test-2b7fa186710d4ad785ad183ae42f1d7b.sock every 8 connection(s)
I20260928 11:44:38.318397  2729 rpc-test.cc:772] Connecting to unix:/tmp/dist-test-taskeDnGty/test-tmp/rpc-test-2b7fa186710d4ad785ad183ae42f1d7b.sock
W20260928 11:44:38.358279  2967 connection.cc:196] Error closing socket: Network error: TlsSocket::Close: Broken pipe
[       OK ] Parameters/TestRpc.TestConnectionNetworkPlane/SSL_UnixSocket (77 ms)
[ RUN      ] Parameters/TestRpc.TestTCPKeepalive/SSL_UnixSocket
I20260928 11:44:38.389604  2993 acceptor_pool.cc:254] collecting diagnostics on the listening RPC socket unix:/tmp/dist-test-taskeDnGty/test-tmp/rpc-test-ea7d5a7c983340489c3ff0c0c36f0a3d.sock every 8 connection(s)
I20260928 11:44:38.390323  2994 acceptor_pool.cc:254] collecting diagnostics on the listening RPC socket unix:/tmp/dist-test-taskeDnGty/test-tmp/rpc-test-ea7d5a7c983340489c3ff0c0c36f0a3d.sock every 8 connection(s)
I20260928 11:44:38.427174  2997 rpc-test-base.h:222] got call: sleep_micros: 8000000 deferred: true
I20260928 11:44:46.431293  2997 rpcz_store.cc:275] Call kudu.rpc.GenericCalculatorService.Sleep from unix:<unnamed> (request call id 0) took 8004 ms. Trace:
I20260928 11:44:46.431731  2997 rpcz_store.cc:276] 0928 11:44:38.427012 (+     0us) service_pool.cc:170] Inserting onto call queue
0928 11:44:38.427117 (+   105us) service_pool.cc:227] Handling call
0928 11:44:46.431137 (+8004020us) inbound_call.cc:173] Queueing success response
Metrics: {}
W20260928 11:44:46.437050  2990 connection.cc:196] Error closing socket: Network error: TlsSocket::Close: Broken pipe
[       OK ] Parameters/TestRpc.TestTCPKeepalive/SSL_UnixSocket (8081 ms)
[ RUN      ] Parameters/TestRpc.TestMaxSmallSidecars/SSL_UnixSocket
I20260928 11:44:46.464845  3019 acceptor_pool.cc:254] collecting diagnostics on the listening RPC socket unix:/tmp/dist-test-taskeDnGty/test-tmp/rpc-test-786c81cffaa042a381d7620ec4468fa4.sock every 8 connection(s)
I20260928 11:44:46.465696  3020 acceptor_pool.cc:254] collecting diagnostics on the listening RPC socket unix:/tmp/dist-test-taskeDnGty/test-tmp/rpc-test-786c81cffaa042a381d7620ec4468fa4.sock every 8 connection(s)
W20260928 11:44:46.627694  3016 connection.cc:196] Error closing socket: Network error: TlsSocket::Close: Broken pipe
[       OK ] Parameters/TestRpc.TestMaxSmallSidecars/SSL_UnixSocket (188 ms)
[ RUN      ] Parameters/TestRpc.TestCallTimeout/SSL_UnixSocket
I20260928 11:44:46.651571  3044 acceptor_pool.cc:254] collecting diagnostics on the listening RPC socket unix:/tmp/dist-test-taskeDnGty/test-tmp/rpc-test-09f1db857bea4893997e0b9392a213d2.sock every 8 connection(s)
I20260928 11:44:46.652154  3045 acceptor_pool.cc:254] collecting diagnostics on the listening RPC socket unix:/tmp/dist-test-taskeDnGty/test-tmp/rpc-test-09f1db857bea4893997e0b9392a213d2.sock every 8 connection(s)
I20260928 11:44:46.683374  2729 rpc-test-base.h:595] status: Timed out: connection negotiation to unix:/tmp/dist-test-taskeDnGty/test-tmp/rpc-test-09f1db857bea4893997e0b9392a213d2.sock for RPC Sleep timed out after 0.000s (ON_OUTBOUND_QUEUE), seconds elapsed: 0.0022637
I20260928 11:44:46.690557  3048 rpc-test-base.h:222] got call: sleep_micros: 700000
I20260928 11:44:46.884130  2729 rpc-test-base.h:595] status: Timed out: Sleep RPC to unix:/tmp/dist-test-taskeDnGty/test-tmp/rpc-test-09f1db857bea4893997e0b9392a213d2.sock timed out after 0.200s (SENT), seconds elapsed: 0.200407
I20260928 11:44:46.885437  3047 rpc-test-base.h:222] got call: sleep_micros: 2000000
W20260928 11:44:47.391224  3048 rpcz_store.cc:267] Call kudu.rpc.GenericCalculatorService.Sleep from unix:<unnamed> (request call id 1) took 700 ms (client timeout 200 ms). Trace:
W20260928 11:44:47.391537  3048 rpcz_store.cc:269] 0928 11:44:46.690398 (+     0us) service_pool.cc:170] Inserting onto call queue
0928 11:44:46.690511 (+   113us) service_pool.cc:227] Handling call
0928 11:44:47.391170 (+700659us) inbound_call.cc:173] Queueing success response
Metrics: {}
I20260928 11:44:48.386189  2729 rpc-test-base.h:595] status: Timed out: Sleep RPC to unix:/tmp/dist-test-taskeDnGty/test-tmp/rpc-test-09f1db857bea4893997e0b9392a213d2.sock timed out after 1.500s (SENT), seconds elapsed: 1.50174
W20260928 11:44:48.885980  3047 rpcz_store.cc:267] Call kudu.rpc.GenericCalculatorService.Sleep from unix:<unnamed> (request call id 2) took 2000 ms (client timeout 1500 ms). Trace:
W20260928 11:44:48.886281  3047 rpcz_store.cc:269] 0928 11:44:46.885272 (+     0us) service_pool.cc:170] Inserting onto call queue
0928 11:44:46.885378 (+   106us) service_pool.cc:227] Handling call
0928 11:44:48.885925 (+2000547us) inbound_call.cc:173] Queueing success response
Metrics: {}
W20260928 11:44:48.886804  3041 connection.cc:441] server connection from unix:<unnamed> torn down before Call kudu.rpc.GenericCalculatorService.Sleep from unix:<unnamed> (request call id 2) could send its response
[       OK ] Parameters/TestRpc.TestCallTimeout/SSL_UnixSocket (2259 ms)
[ RUN      ] Parameters/TestRpc.TestServerShutsDown/SSL_UnixSocket
I20260928 11:44:48.893529  2729 rpc-test.cc:1125] Connecting to 0.0.0.0:33239
W20260928 11:44:48.901962  3061 negotiation.cc:337] Failed RPC negotiation. Trace:
0928 11:44:48.900598 (+     0us) reactor.cc:625] Submitting negotiation task for client connection to 0.0.0.0:33239 (local address 127.0.0.1:36152)
0928 11:44:48.901017 (+   419us) negotiation.cc:107] Waiting for socket to connect
0928 11:44:48.901048 (+    31us) client_negotiation.cc:174] Beginning negotiation
0928 11:44:48.901267 (+   219us) client_negotiation.cc:252] Sending NEGOTIATE NegotiatePB request
0928 11:44:48.901478 (+   211us) negotiation.cc:327] Negotiation complete: Network error: Client connection negotiation failed: client connection to 0.0.0.0:33239: BlockingWrite error: write error: Broken pipe (error 32)
Metrics: {"client-negotiator.queue_time_us":104}
[       OK ] Parameters/TestRpc.TestServerShutsDown/SSL_UnixSocket (12 ms)
[ RUN      ] Parameters/TestRpc.TimedOutOnResponseMetric/SSL_UnixSocket
I20260928 11:44:48.941892  3078 acceptor_pool.cc:254] collecting diagnostics on the listening RPC socket unix:/tmp/dist-test-taskeDnGty/test-tmp/rpc-test-7d76c3618de8453cb0c1b80c0d42ef3d.sock every 8 connection(s)
I20260928 11:44:48.942556  3079 acceptor_pool.cc:254] collecting diagnostics on the listening RPC socket unix:/tmp/dist-test-taskeDnGty/test-tmp/rpc-test-7d76c3618de8453cb0c1b80c0d42ef3d.sock every 8 connection(s)
W20260928 11:44:49.173604  3082 rpcz_store.cc:267] Call kudu.rpc_test.CalculatorService.Sleep from unix:<unnamed> (request call id 3) took 50 ms (client timeout 25 ms). Trace:
W20260928 11:44:49.173906  3082 rpcz_store.cc:269] 0928 11:44:49.122992 (+     0us) service_pool.cc:170] Inserting onto call queue
0928 11:44:49.123111 (+   119us) service_pool.cc:227] Handling call
0928 11:44:49.173518 (+ 50407us) inbound_call.cc:173] Queueing success response
Related trace 'test_child':
Metrics: {"test_sleep_us":50000,"child_traces":[["test_child",{"related_trace_metric":1}]]}
W20260928 11:44:49.232558  3082 rpcz_store.cc:267] Call kudu.rpc_test.CalculatorService.Sleep from unix:<unnamed> (request call id 4) took 50 ms (client timeout 50 ms). Trace:
W20260928 11:44:49.232858  3082 rpcz_store.cc:269] 0928 11:44:49.182017 (+     0us) service_pool.cc:170] Inserting onto call queue
0928 11:44:49.182142 (+   125us) service_pool.cc:227] Handling call
0928 11:44:49.232498 (+ 50356us) inbound_call.cc:173] Queueing success response
Related trace 'test_child':
Metrics: {"test_sleep_us":50000,"child_traces":[["test_child",{"related_trace_metric":1}]]}
[       OK ] Parameters/TestRpc.TimedOutOnResponseMetric/SSL_UnixSocket (335 ms)
[ RUN      ] Parameters/TestRpc.AcceptorDispatchingTimesMetric/SSL_UnixSocket
I20260928 11:44:49.250675  3103 acceptor_pool.cc:254] collecting diagnostics on the listening RPC socket 0.0.0.0:40245 every 8 connection(s)
I20260928 11:44:49.251271  3104 acceptor_pool.cc:254] collecting diagnostics on the listening RPC socket 0.0.0.0:40245 every 8 connection(s)
W20260928 11:44:49.257423  3099 negotiation.cc:337] Failed RPC negotiation. Trace:
0928 11:44:49.255402 (+     0us) reactor.cc:625] Submitting negotiation task for server connection from 127.0.0.1:55790 (local address 127.0.0.1:40245)
0928 11:44:49.255997 (+   595us) server_negotiation.cc:206] Beginning negotiation
0928 11:44:49.256019 (+    22us) server_negotiation.cc:399] Waiting for connection header
0928 11:44:49.256342 (+   323us) negotiation.cc:327] Negotiation complete: Network error: Server connection negotiation failed: server connection from 127.0.0.1:55790: BlockingRecv error: recv got EOF from 127.0.0.1:55790 (error 108)
Metrics: {"server-negotiator.queue_time_us":106}
[       OK ] Parameters/TestRpc.AcceptorDispatchingTimesMetric/SSL_UnixSocket (19 ms)
[ RUN      ] Parameters/TestRpc.TestRpcCallbackDestroysMessenger/SSL_UnixSocket
[       OK ] Parameters/TestRpc.TestRpcCallbackDestroysMessenger/SSL_UnixSocket (17 ms)
[ RUN      ] Parameters/TestRpc.TestApplicationFeatureFlag/SSL_UnixSocket
I20260928 11:44:49.292541  3128 acceptor_pool.cc:254] collecting diagnostics on the listening RPC socket unix:/tmp/dist-test-taskeDnGty/test-tmp/rpc-test-61f274d9d88645ffafa5916d774aa7f7.sock every 8 connection(s)
I20260928 11:44:49.293229  3129 acceptor_pool.cc:254] collecting diagnostics on the listening RPC socket unix:/tmp/dist-test-taskeDnGty/test-tmp/rpc-test-61f274d9d88645ffafa5916d774aa7f7.sock every 8 connection(s)
W20260928 11:44:49.335872  3125 messenger.cc:357] Unable to handle RPC call: Not implemented: call requires unsupported application feature flags: 99
W20260928 11:44:49.338637  3125 connection.cc:196] Error closing socket: Network error: TlsSocket::Close: Broken pipe
[       OK ] Parameters/TestRpc.TestApplicationFeatureFlag/SSL_UnixSocket (64 ms)
[ RUN      ] Parameters/TestRpc.TestCancellation/SSL_UnixSocket
I20260928 11:44:49.358538  3153 acceptor_pool.cc:254] collecting diagnostics on the listening RPC socket unix:/tmp/dist-test-taskeDnGty/test-tmp/rpc-test-72b385581cb144a49efecdab475b4035.sock every 8 connection(s)
I20260928 11:44:49.359180  3154 acceptor_pool.cc:254] collecting diagnostics on the listening RPC socket unix:/tmp/dist-test-taskeDnGty/test-tmp/rpc-test-72b385581cb144a49efecdab475b4035.sock every 8 connection(s)
I20260928 11:44:49.362079  2729 rpc-test.cc:1648] Connecting to unix:/tmp/dist-test-taskeDnGty/test-tmp/rpc-test-72b385581cb144a49efecdab475b4035.sock
I20260928 11:44:49.458422  2729 rpc-test-base.h:595] status: Aborted: Sleep RPC to unix:/tmp/dist-test-taskeDnGty/test-tmp/rpc-test-72b385581cb144a49efecdab475b4035.sock is cancelled in state READY, seconds elapsed: 0.000329492
I20260928 11:44:49.627805  2729 rpc-test-base.h:595] status: Aborted: Sleep RPC to unix:/tmp/dist-test-taskeDnGty/test-tmp/rpc-test-72b385581cb144a49efecdab475b4035.sock is cancelled in state SENT, seconds elapsed: 0.000865649
I20260928 11:44:49.628005  3156 rpc-test-base.h:222] got call: sleep_micros: 510000
I20260928 11:44:49.789335  2729 rpc-test-base.h:595] status: Aborted: Sleep RPC to unix:/tmp/dist-test-taskeDnGty/test-tmp/rpc-test-72b385581cb144a49efecdab475b4035.sock is cancelled in state SENT, seconds elapsed: 0.000619319
I20260928 11:44:49.789647  3155 rpc-test-base.h:222] got call: sleep_micros: 510000
I20260928 11:44:49.952875  2729 rpc-test-base.h:595] status: Aborted: Sleep RPC to unix:/tmp/dist-test-taskeDnGty/test-tmp/rpc-test-72b385581cb144a49efecdab475b4035.sock is cancelled in state SENT, seconds elapsed: 0.000820521
W20260928 11:44:49.963470  3157 rpcz_store.cc:267] Call kudu.rpc.GenericCalculatorService.Sleep from unix:<unnamed> (request call id 11) took 10 ms (client timeout 10 ms). Trace:
W20260928 11:44:49.963804  3157 rpcz_store.cc:269] 0928 11:44:49.952850 (+     0us) service_pool.cc:170] Inserting onto call queue
0928 11:44:49.963229 (+ 10379us) service_pool.cc:214] Skipping call since client already timed out
0928 11:44:49.963308 (+    79us) inbound_call.cc:173] Queueing failure response
Metrics: {}
I20260928 11:44:49.964320  3157 rpc-test-base.h:222] got call: sleep_micros: 1500000
W20260928 11:44:50.138624  3156 rpcz_store.cc:267] Call kudu.rpc.GenericCalculatorService.Sleep from unix:<unnamed> (request call id 3) took 510 ms (client timeout 10 ms). Trace:
W20260928 11:44:50.138931  3156 rpcz_store.cc:269] 0928 11:44:49.627828 (+     0us) service_pool.cc:170] Inserting onto call queue
0928 11:44:49.627951 (+   123us) service_pool.cc:227] Handling call
0928 11:44:50.138559 (+510608us) inbound_call.cc:173] Queueing success response
Metrics: {}
W20260928 11:44:50.300194  3155 rpcz_store.cc:267] Call kudu.rpc.GenericCalculatorService.Sleep from unix:<unnamed> (request call id 7) took 510 ms (client timeout 10 ms). Trace:
W20260928 11:44:50.300535  3155 rpcz_store.cc:269] 0928 11:44:49.789471 (+     0us) service_pool.cc:170] Inserting onto call queue
0928 11:44:49.789597 (+   126us) service_pool.cc:227] Handling call
0928 11:44:50.300139 (+510542us) inbound_call.cc:173] Queueing success response
Metrics: {}
I20260928 11:44:50.955119  2729 rpc-test-base.h:595] status: Timed out: Sleep RPC to unix:/tmp/dist-test-taskeDnGty/test-tmp/rpc-test-72b385581cb144a49efecdab475b4035.sock timed out after 1.000s (SENT), seconds elapsed: 1.00191
I20260928 11:44:50.956336  3155 rpc-test-base.h:222] got call: sleep_micros: 1500000
W20260928 11:44:51.464985  3157 rpcz_store.cc:267] Call kudu.rpc.GenericCalculatorService.Sleep from unix:<unnamed> (request call id 12) took 1511 ms (client timeout 1000 ms). Trace:
W20260928 11:44:51.465397  3157 rpcz_store.cc:269] 0928 11:44:49.953848 (+     0us) service_pool.cc:170] Inserting onto call queue
0928 11:44:49.964290 (+ 10442us) service_pool.cc:227] Handling call
0928 11:44:51.464828 (+1500538us) inbound_call.cc:173] Queueing success response
Metrics: {}
I20260928 11:44:51.956681  2729 rpc-test-base.h:595] status: Timed out: Sleep RPC to unix:/tmp/dist-test-taskeDnGty/test-tmp/rpc-test-72b385581cb144a49efecdab475b4035.sock timed out after 1.000s (SENT), seconds elapsed: 1.00113
W20260928 11:44:51.958277  3150 messenger.cc:357] Unable to handle RPC call: Not implemented: call requires unsupported application feature flags: 99, 1
W20260928 11:44:51.959599  3150 messenger.cc:357] Unable to handle RPC call: Not implemented: call requires unsupported application feature flags: 99, 1
W20260928 11:44:52.168231  3150 connection.cc:196] Error closing socket: Network error: TlsSocket::Close: Broken pipe
W20260928 11:44:52.456933  3155 rpcz_store.cc:267] Call kudu.rpc.GenericCalculatorService.Sleep from unix:<unnamed> (request call id 13) took 1500 ms (client timeout 1000 ms). Trace:
W20260928 11:44:52.457235  3155 rpcz_store.cc:269] 0928 11:44:50.956197 (+     0us) service_pool.cc:170] Inserting onto call queue
0928 11:44:50.956292 (+    95us) service_pool.cc:227] Handling call
0928 11:44:52.456798 (+1500506us) inbound_call.cc:173] Queueing success response
Metrics: {}
W20260928 11:44:52.457706  3150 connection.cc:441] server connection from unix:<unnamed> torn down before Call kudu.rpc.GenericCalculatorService.Sleep from unix:<unnamed> (request call id 13) could send its response
[       OK ] Parameters/TestRpc.TestCancellation/SSL_UnixSocket (3121 ms)
[ RUN      ] Parameters/TestRpc.TestCancellationMultiThreads/SSL_UnixSocket
I20260928 11:44:52.492216  3179 acceptor_pool.cc:254] collecting diagnostics on the listening RPC socket unix:/tmp/dist-test-taskeDnGty/test-tmp/rpc-test-31f1d6e7ebb744e497a26868146c520b.sock every 8 connection(s)
I20260928 11:44:52.492997  3180 acceptor_pool.cc:254] collecting diagnostics on the listening RPC socket unix:/tmp/dist-test-taskeDnGty/test-tmp/rpc-test-31f1d6e7ebb744e497a26868146c520b.sock every 8 connection(s)
I20260928 11:44:52.496026  2729 rpc-test.cc:1808] Connecting to unix:/tmp/dist-test-taskeDnGty/test-tmp/rpc-test-31f1d6e7ebb744e497a26868146c520b.sock
I20260928 11:44:52.631774  3193 test_util.cc:268] Using random seed: -1742874503
I20260928 11:44:52.632722  3194 test_util.cc:268] Using random seed: -1742873477
I20260928 11:44:52.634127  3195 test_util.cc:268] Using random seed: -1742872169
I20260928 11:44:52.635493  3196 test_util.cc:268] Using random seed: -1742870741
I20260928 11:44:52.636798  3197 test_util.cc:268] Using random seed: -1742869509
I20260928 11:44:52.638252  3198 test_util.cc:268] Using random seed: -1742868088
I20260928 11:44:52.639636  3199 test_util.cc:268] Using random seed: -1742866683
I20260928 11:44:52.641196  3200 test_util.cc:268] Using random seed: -1742865146
I20260928 11:44:52.642501  3201 test_util.cc:268] Using random seed: -1742863843
I20260928 11:44:52.644081  3202 test_util.cc:268] Using random seed: -1742862241
I20260928 11:44:52.645035  3203 test_util.cc:268] Using random seed: -1742861267
I20260928 11:44:52.646337  3204 test_util.cc:268] Using random seed: -1742859987
I20260928 11:44:52.647992  3205 test_util.cc:268] Using random seed: -1742858398
I20260928 11:44:52.649770  3206 test_util.cc:268] Using random seed: -1742856562
I20260928 11:44:52.651069  3207 test_util.cc:268] Using random seed: -1742855250
I20260928 11:44:52.652637  3208 test_util.cc:268] Using random seed: -1742853700
I20260928 11:44:52.653944  3209 test_util.cc:268] Using random seed: -1742852371
I20260928 11:44:52.655500  3210 test_util.cc:268] Using random seed: -1742850823
I20260928 11:44:52.656785  3211 test_util.cc:268] Using random seed: -1742849537
I20260928 11:44:52.658413  3212 test_util.cc:268] Using random seed: -1742847930
I20260928 11:44:52.663290  3213 test_util.cc:268] Using random seed: -1742843073
I20260928 11:44:52.664532  3214 test_util.cc:268] Using random seed: -1742841774
I20260928 11:44:52.666386  3215 test_util.cc:268] Using random seed: -1742839976
I20260928 11:44:52.667610  3216 test_util.cc:268] Using random seed: -1742838704
I20260928 11:44:52.669157  3217 test_util.cc:268] Using random seed: -1742837215
I20260928 11:44:52.670724  3218 test_util.cc:268] Using random seed: -1742835656
I20260928 11:44:52.672112  3219 test_util.cc:268] Using random seed: -1742834254
I20260928 11:44:52.675244  3220 test_util.cc:268] Using random seed: -1742831106
I20260928 11:44:52.676759  3221 test_util.cc:268] Using random seed: -1742829603
I20260928 11:44:52.678328  3222 test_util.cc:268] Using random seed: -1742828035
W20260928 11:45:11.421696  3176 connection.cc:196] Error closing socket: Network error: TlsSocket::Close: Broken pipe
[       OK ] Parameters/TestRpc.TestCancellationMultiThreads/SSL_UnixSocket (18972 ms)
[ RUN      ] Parameters/TestRpc.TestCallId/SSL_UnixSocket
I20260928 11:45:11.476683  3236 acceptor_pool.cc:254] collecting diagnostics on the listening RPC socket unix:/tmp/dist-test-taskeDnGty/test-tmp/rpc-test-1bff753e1c36429c9b398077cda5063d.sock every 8 connection(s)
I20260928 11:45:11.477509  3237 acceptor_pool.cc:254] collecting diagnostics on the listening RPC socket unix:/tmp/dist-test-taskeDnGty/test-tmp/rpc-test-1bff753e1c36429c9b398077cda5063d.sock every 8 connection(s)
W20260928 11:45:11.527344  3233 connection.cc:196] Error closing socket: Network error: TlsSocket::Close: Broken pipe
[       OK ] Parameters/TestRpc.TestCallId/SSL_UnixSocket (96 ms)
[----------] 20 tests from Parameters/TestRpc (37270 ms total)

[----------] Global test environment tear-down
[==========] 21 tests from 2 test suites ran. (40570 ms total)
[  PASSED  ] 20 tests.
[  FAILED  ] 1 test, listed below:
[  FAILED  ] Parameters/TestRpc.TestCallWithChainCertAndRootCA/SSL_UnixSocket, where GetParam() = (true, true)

 1 FAILED TEST
I20260928 11:45:11.550791  2729 logging.cc:424] LogThrottler /data0/somelongdirectorytoavoidrpathissues/src/kudu/src/kudu/rpc/acceptor_pool.cc:285: suppressed but not reported on 3 messages since previous log ~33 seconds ago