Diagnosed failure

Parameters/TestRpc.TestCallWithChainCertAndChainCA/SSL_TCP: /data0/somelongdirectorytoavoidrpathissues/src/kudu/src/kudu/rpc/rpc-test.cc:270: Failure
Failed
Bad status: Runtime error: could not verify certificate chain (error with cert: subject=CN = localhost, ST = sadfjas, C = AS, emailAddress = sdflkdsajf, O = lskdfjlsad, OU = sldfkja, issuer=C = AS, ST = ASDfkjdhf, L = lskdjf, O = saldfja, OU = skdjf, CN = localhost, emailAddress = sadjflkadsj): : certificate has expired
Google Test trace:
/data0/somelongdirectorytoavoidrpathissues/src/kudu/src/kudu/rpc/rpc-test.cc:267: Connecting to 0.0.0.0:39063
I20260925 02:00:53.908784  6781 test_util.cc:175] -----------------------------------------------
I20260925 02:00:53.908895  6781 test_util.cc:176] Had fatal failures, leaving test files at /tmp/dist-test-taskr5UAbK/test-tmp/rpc-test.5.Parameters_TestRpc.TestCallWithChainCertAndChainCA_SSL_TCP.1790301653740869-6781-0

Full log

Note: This is test shard 6 of 8.
[==========] Running 21 tests from 2 test suites.
[----------] Global test environment set-up.
[----------] 20 tests from Parameters/TestRpc
[ RUN      ] Parameters/TestRpc.TestMessengerCreateDestroy/SSL_TCP
WARNING: Logging before InitGoogleLogging() is written to STDERR
I20260925 02:00:53.823256  6781 rpc-test.cc:169] started messenger TestCreateDestroy
[       OK ] Parameters/TestRpc.TestMessengerCreateDestroy/SSL_TCP (57 ms)
[ RUN      ] Parameters/TestRpc.TestNegotiationDeadlock/SSL_TCP
I20260925 02:00:53.849540  6801 acceptor_pool.cc:254] collecting diagnostics on the listening RPC socket 0.0.0.0:46011 every 8 connection(s)
I20260925 02:00:53.849875  6802 acceptor_pool.cc:254] collecting diagnostics on the listening RPC socket 0.0.0.0:46011 every 8 connection(s)
[       OK ] Parameters/TestRpc.TestNegotiationDeadlock/SSL_TCP (47 ms)
[ RUN      ] Parameters/TestRpc.TestCallWithChainCertAndChainCA/SSL_TCP
I20260925 02:00:53.892985  6818 acceptor_pool.cc:254] collecting diagnostics on the listening RPC socket 0.0.0.0:39063 every 8 connection(s)
I20260925 02:00:53.893637  6819 acceptor_pool.cc:254] collecting diagnostics on the listening RPC socket 0.0.0.0:39063 every 8 connection(s)
/data0/somelongdirectorytoavoidrpathissues/src/kudu/src/kudu/rpc/rpc-test.cc:270: Failure
Failed
Bad status: Runtime error: could not verify certificate chain (error with cert: subject=CN = localhost, ST = sadfjas, C = AS, emailAddress = sdflkdsajf, O = lskdfjlsad, OU = sldfkja, issuer=C = AS, ST = ASDfkjdhf, L = lskdjf, O = saldfja, OU = skdjf, CN = localhost, emailAddress = sadjflkadsj): : certificate has expired
Google Test trace:
/data0/somelongdirectorytoavoidrpathissues/src/kudu/src/kudu/rpc/rpc-test.cc:267: Connecting to 0.0.0.0:39063
I20260925 02:00:53.908784  6781 test_util.cc:175] -----------------------------------------------
I20260925 02:00:53.908895  6781 test_util.cc:176] Had fatal failures, leaving test files at /tmp/dist-test-taskr5UAbK/test-tmp/rpc-test.5.Parameters_TestRpc.TestCallWithChainCertAndChainCA_SSL_TCP.1790301653740869-6781-0
[  FAILED  ] Parameters/TestRpc.TestCallWithChainCertAndChainCA/SSL_TCP, where GetParam() = (true, false) (34 ms)
[ RUN      ] Parameters/TestRpc.TestCallWithPasswordProtectedKey/SSL_TCP
I20260925 02:00:53.926167  6843 acceptor_pool.cc:254] collecting diagnostics on the listening RPC socket 0.0.0.0:33881 every 8 connection(s)
I20260925 02:00:53.926445  6844 acceptor_pool.cc:254] collecting diagnostics on the listening RPC socket 0.0.0.0:33881 every 8 connection(s)
[       OK ] Parameters/TestRpc.TestCallWithPasswordProtectedKey/SSL_TCP (61 ms)
[ RUN      ] Parameters/TestRpc.TestCallToBadServer/SSL_TCP
I20260925 02:00:53.994803  6781 rpc-test.cc:394] Status: Network error: Client connection negotiation failed: client connection to 0.0.0.0:0: connect: Connection refused (error 111)
I20260925 02:00:53.995599  6781 rpc-test.cc:394] Status: Network error: Client connection negotiation failed: client connection to 0.0.0.0:0: connect: Connection refused (error 111)
I20260925 02:00:53.996373  6781 rpc-test.cc:394] Status: Network error: Client connection negotiation failed: client connection to 0.0.0.0:0: connect: Connection refused (error 111)
I20260925 02:00:53.997217  6781 rpc-test.cc:394] Status: Network error: Client connection negotiation failed: client connection to 0.0.0.0:0: connect: Connection refused (error 111)
I20260925 02:00:53.998019  6781 rpc-test.cc:394] Status: Network error: Client connection negotiation failed: client connection to 0.0.0.0:0: connect: Connection refused (error 111)
[       OK ] Parameters/TestRpc.TestCallToBadServer/SSL_TCP (29 ms)
[ RUN      ] Parameters/TestRpc.TestWrongService/SSL_TCP
I20260925 02:00:54.014106  6878 acceptor_pool.cc:254] collecting diagnostics on the listening RPC socket 0.0.0.0:44131 every 8 connection(s)
I20260925 02:00:54.014364  6879 acceptor_pool.cc:254] collecting diagnostics on the listening RPC socket 0.0.0.0:44131 every 8 connection(s)
I20260925 02:00:54.041756  6876 messenger.cc:345] service WrongServiceName not registered on TestServer
[       OK ] Parameters/TestRpc.TestWrongService/SSL_TCP (47 ms)
[ RUN      ] Parameters/TestRpc.TestConnectionKeepalive/SSL_TCP
I20260925 02:00:54.065483  6901 acceptor_pool.cc:254] collecting diagnostics on the listening RPC socket 0.0.0.0:44611 every 8 connection(s)
I20260925 02:00:54.065889  6902 acceptor_pool.cc:254] collecting diagnostics on the listening RPC socket 0.0.0.0:44611 every 8 connection(s)
I20260925 02:00:54.067155  6781 rpc-test.cc:488] Connecting to 0.0.0.0:44611
[       OK ] Parameters/TestRpc.TestConnectionKeepalive/SSL_TCP (1075 ms)
[ RUN      ] Parameters/TestRpc.TestClientConnectionMetrics/SSL_TCP
I20260925 02:00:55.136834  6926 acceptor_pool.cc:254] collecting diagnostics on the listening RPC socket 0.0.0.0:36527 every 8 connection(s)
I20260925 02:00:55.137061  6927 acceptor_pool.cc:254] collecting diagnostics on the listening RPC socket 0.0.0.0:36527 every 8 connection(s)
I20260925 02:00:55.138513  6781 rpc-test.cc:569] Connecting to 0.0.0.0:36527
[       OK ] Parameters/TestRpc.TestClientConnectionMetrics/SSL_TCP (20010 ms)
[ RUN      ] Parameters/TestRpc.TestCredentialsPolicy/SSL_TCP
I20260925 02:01:15.155364  6949 acceptor_pool.cc:254] collecting diagnostics on the listening RPC socket 0.0.0.0:41539 every 8 connection(s)
I20260925 02:01:15.155627  6950 acceptor_pool.cc:254] collecting diagnostics on the listening RPC socket 0.0.0.0:41539 every 8 connection(s)
I20260925 02:01:15.156692  6781 rpc-test.cc:700] Connecting to 0.0.0.0:41539
[       OK ] Parameters/TestRpc.TestCredentialsPolicy/SSL_TCP (61 ms)
[ RUN      ] Parameters/TestRpc.TestCallLongerThanKeepalive/SSL_TCP
I20260925 02:01:15.239104  6974 acceptor_pool.cc:254] collecting diagnostics on the listening RPC socket 0.0.0.0:34815 every 8 connection(s)
I20260925 02:01:15.239445  6975 acceptor_pool.cc:254] collecting diagnostics on the listening RPC socket 0.0.0.0:34815 every 8 connection(s)
I20260925 02:01:15.261271  6978 rpc-test-base.h:222] got call: sleep_micros: 3000000 deferred: true
I20260925 02:01:18.263131  6978 rpcz_store.cc:275] Call kudu.rpc.GenericCalculatorService.Sleep from 127.0.0.1:44384 (request call id 0) took 3002 ms. Trace:
I20260925 02:01:18.263332  6978 rpcz_store.cc:276] 0925 02:01:15.261142 (+     0us) service_pool.cc:170] Inserting onto call queue
0925 02:01:15.261218 (+    76us) service_pool.cc:227] Handling call
0925 02:01:18.263080 (+3001862us) inbound_call.cc:173] Queueing success response
Metrics: {}
[       OK ] Parameters/TestRpc.TestCallLongerThanKeepalive/SSL_TCP (3074 ms)
[ RUN      ] Parameters/TestRpc.TestRpcSidecar/SSL_TCP
I20260925 02:01:18.304606  6999 acceptor_pool.cc:254] collecting diagnostics on the listening RPC socket 0.0.0.0:38677 every 8 connection(s)
I20260925 02:01:18.304837  7000 acceptor_pool.cc:254] collecting diagnostics on the listening RPC socket 0.0.0.0:38677 every 8 connection(s)
[       OK ] Parameters/TestRpc.TestRpcSidecar/SSL_TCP (143 ms)
[ RUN      ] Parameters/TestRpc.TestRpcSidecarLimits/SSL_TCP
I20260925 02:01:21.712710  7024 acceptor_pool.cc:254] collecting diagnostics on the listening RPC socket 0.0.0.0:41051 every 8 connection(s)
I20260925 02:01:21.713074  7025 acceptor_pool.cc:254] collecting diagnostics on the listening RPC socket 0.0.0.0:41051 every 8 connection(s)
W20260925 02:01:21.738116  6781 serialization.cc:72] Serialized kudu.rpc_test.PushStringsRequestPB (2147483654 bytes) is larger than the maximum configured RPC message size (52428800 bytes). Sending anyway, but peer may reject the data.
W20260925 02:01:21.744813  7022 connection.cc:535] server connection from 127.0.0.1:48588 recv error: Network error: RPC frame had a length of 2147483714, but we only support messages up to 52428800 bytes long.
W20260925 02:01:21.744997  7022 connection.cc:158] shutting down server connection from 127.0.0.1:48588 with pending inbound data: 4/2147483714 bytes received; last active 0 ns ago: status Network error: RPC frame had a length of 2147483714, but we only support messages up to 52428800 bytes long.
W20260925 02:01:21.745851  7037 connection.cc:196] Error closing socket: Network error: TlsSocket::Close: Connection reset by peer
I20260925 02:01:21.770901  7049 acceptor_pool.cc:254] collecting diagnostics on the listening RPC socket 0.0.0.0:42711 every 8 connection(s)
I20260925 02:01:21.771076  7050 acceptor_pool.cc:254] collecting diagnostics on the listening RPC socket 0.0.0.0:42711 every 8 connection(s)
W20260925 02:01:28.282482  7047 connection.cc:577] server connection from 127.0.0.1:59826: received bad data: 'Corruption: Invalid packet: message had a length of 2147483710, but we only support messages up to 2147483647 bytes
'
[       OK ] Parameters/TestRpc.TestRpcSidecarLimits/SSL_TCP (10315 ms)
[ RUN      ] Parameters/TestRpc.TestCallTimeoutDoesntAffectNegotiation/SSL_TCP
I20260925 02:01:28.741765  7074 acceptor_pool.cc:254] collecting diagnostics on the listening RPC socket 0.0.0.0:40259 every 8 connection(s)
I20260925 02:01:28.742039  7075 acceptor_pool.cc:254] collecting diagnostics on the listening RPC socket 0.0.0.0:40259 every 8 connection(s)
W20260925 02:01:28.755914  7070 negotiation.cc:266] Injecting 500ms delay in negotiation
I20260925 02:01:28.806387  6781 rpc-test-base.h:595] status: Timed out: connection negotiation to 0.0.0.0:40259 for RPC Sleep timed out after 0.050s (ON_OUTBOUND_QUEUE), seconds elapsed: 0.0511492
[       OK ] Parameters/TestRpc.TestCallTimeoutDoesntAffectNegotiation/SSL_TCP (538 ms)
[ RUN      ] Parameters/TestRpc.TestRpcHandlerLatencyMetric/SSL_TCP
I20260925 02:01:29.285758  7099 acceptor_pool.cc:254] collecting diagnostics on the listening RPC socket 0.0.0.0:43213 every 8 connection(s)
I20260925 02:01:29.285941  7100 acceptor_pool.cc:254] collecting diagnostics on the listening RPC socket 0.0.0.0:43213 every 8 connection(s)
I20260925 02:01:29.324669  6781 rpc-test.cc:1236] Sleep() min lat: 20821
I20260925 02:01:29.324759  6781 rpc-test.cc:1237] Sleep() mean lat: 20821
I20260925 02:01:29.324798  6781 rpc-test.cc:1238] Sleep() max lat: 20821
I20260925 02:01:29.324815  6781 rpc-test.cc:1239] Sleep() #calls: 1
[       OK ] Parameters/TestRpc.TestRpcHandlerLatencyMetric/SSL_TCP (63 ms)
[ RUN      ] Parameters/TestRpc.TimedOutOnResponseMetricServiceQueue/SSL_TCP
I20260925 02:01:29.349884  7125 acceptor_pool.cc:254] collecting diagnostics on the listening RPC socket 0.0.0.0:34779 every 8 connection(s)
I20260925 02:01:29.350093  7126 acceptor_pool.cc:254] collecting diagnostics on the listening RPC socket 0.0.0.0:34779 every 8 connection(s)
W20260925 02:01:29.408538  7127 rpcz_store.cc:267] Call kudu.rpc_test.CalculatorService.Sleep from 127.0.0.1:48228 (request call id 2) took 20 ms (client timeout 20 ms). Trace:
W20260925 02:01:29.408756  7127 rpcz_store.cc:269] 0925 02:01:29.388051 (+     0us) service_pool.cc:170] Inserting onto call queue
0925 02:01:29.408469 (+ 20418us) service_pool.cc:214] Skipping call since client already timed out
0925 02:01:29.408519 (+    50us) inbound_call.cc:173] Queueing failure response
Metrics: {}
[       OK ] Parameters/TestRpc.TimedOutOnResponseMetricServiceQueue/SSL_TCP (83 ms)
[ RUN      ] Parameters/TestRpc.RpcPendingConnectionsMetric/SSL_TCP
I20260925 02:01:29.417984  7148 acceptor_pool.cc:254] collecting diagnostics on the listening RPC socket 0.0.0.0:37749 every 8 connection(s)
I20260925 02:01:29.418154  7149 acceptor_pool.cc:254] collecting diagnostics on the listening RPC socket 0.0.0.0:37749 every 8 connection(s)
W20260925 02:01:29.420118  7144 negotiation.cc:337] Failed RPC negotiation. Trace:
0925 02:01:29.419489 (+     0us) reactor.cc:625] Submitting negotiation task for server connection from 127.0.0.1:33624 (local address 127.0.0.1:37749)
0925 02:01:29.419637 (+   148us) server_negotiation.cc:206] Beginning negotiation
0925 02:01:29.419641 (+     4us) server_negotiation.cc:399] Waiting for connection header
0925 02:01:29.419786 (+   145us) negotiation.cc:327] Negotiation complete: Network error: Server connection negotiation failed: server connection from 127.0.0.1:33624: BlockingRecv error: recv got EOF from 127.0.0.1:33624 (error 108)
Metrics: {"server-negotiator.queue_time_us":44}
[       OK ] Parameters/TestRpc.RpcPendingConnectionsMetric/SSL_TCP (19 ms)
[ RUN      ] Parameters/TestRpc.TestRpcContextClientDeadline/SSL_TCP
I20260925 02:01:29.449087  7164 acceptor_pool.cc:254] collecting diagnostics on the listening RPC socket 0.0.0.0:40027 every 8 connection(s)
I20260925 02:01:29.449252  7165 acceptor_pool.cc:254] collecting diagnostics on the listening RPC socket 0.0.0.0:40027 every 8 connection(s)
[       OK ] Parameters/TestRpc.TestRpcContextClientDeadline/SSL_TCP (60 ms)
[ RUN      ] Parameters/TestRpc.TestApplicationFeatureFlagUnsupportedServer/SSL_TCP
I20260925 02:01:29.506763  7189 acceptor_pool.cc:254] collecting diagnostics on the listening RPC socket 0.0.0.0:40699 every 8 connection(s)
I20260925 02:01:29.506951  7190 acceptor_pool.cc:254] collecting diagnostics on the listening RPC socket 0.0.0.0:40699 every 8 connection(s)
[       OK ] Parameters/TestRpc.TestApplicationFeatureFlagUnsupportedServer/SSL_TCP (39 ms)
[ RUN      ] Parameters/TestRpc.TestCancellationAsync/SSL_TCP
I20260925 02:01:29.550027  7214 acceptor_pool.cc:254] collecting diagnostics on the listening RPC socket 0.0.0.0:40721 every 8 connection(s)
I20260925 02:01:29.550235  7215 acceptor_pool.cc:254] collecting diagnostics on the listening RPC socket 0.0.0.0:40721 every 8 connection(s)
I20260925 02:01:29.551263  6781 rpc-test.cc:1716] Connecting to 0.0.0.0:40721
I20260925 02:01:29.569837  6781 test_util.cc:268] Using random seed: 406807053
I20260925 02:01:29.613263  7218 rpc-test-base.h:240] got call: sleep_micros: 500 pattern: 4294967295 num_repetitions: 2097152 sidecar_idx: 0
I20260925 02:01:29.641507  7217 rpc-test-base.h:240] got call: sleep_micros: 500 pattern: 4294967295 num_repetitions: 2097152 sidecar_idx: 0
I20260925 02:01:29.667903  7218 rpc-test-base.h:240] got call: sleep_micros: 500 pattern: 4294967295 num_repetitions: 2097152 sidecar_idx: 0
I20260925 02:01:29.693954  7216 rpc-test-base.h:240] got call: sleep_micros: 500 pattern: 4294967295 num_repetitions: 2097152 sidecar_idx: 0
I20260925 02:01:29.724442  7218 rpc-test-base.h:240] got call: sleep_micros: 500 pattern: 4294967295 num_repetitions: 2097152 sidecar_idx: 0
I20260925 02:01:29.750564  7216 rpc-test-base.h:240] got call: sleep_micros: 500 pattern: 4294967295 num_repetitions: 2097152 sidecar_idx: 0
W20260925 02:01:29.775662  7213 connection.cc:196] Error closing socket: Network error: TlsSocket::Close: Broken pipe
W20260925 02:01:29.777863  7213 connection.cc:441] server connection from 127.0.0.1:33798 torn down before Call kudu.rpc.GenericCalculatorService.SleepWithSidecar from 127.0.0.1:33798 (request call id 7) could send its response
W20260925 02:01:29.784554  7213 connection.cc:441] server connection from 127.0.0.1:33798 torn down before Call kudu.rpc.GenericCalculatorService.SleepWithSidecar from 127.0.0.1:33798 (request call id 8) could send its response
[       OK ] Parameters/TestRpc.TestCancellationAsync/SSL_TCP (254 ms)
[ RUN      ] Parameters/TestRpc.TestPerformanceBySocketType/SSL_TCP
I20260925 02:01:29.811123  7239 acceptor_pool.cc:254] collecting diagnostics on the listening RPC socket 0.0.0.0:42141 every 8 connection(s)
I20260925 02:01:29.811417  7240 acceptor_pool.cc:254] collecting diagnostics on the listening RPC socket 0.0.0.0:42141 every 8 connection(s)
I20260925 02:01:29.812703  6781 rpc-test.cc:1846] Connecting to 0.0.0.0:42141
I20260925 02:01:33.014621  6781 rpc-test.cc:1859] Sending 1024MB via ssl-enabled tcp socket: real 3.177s	user 3.051s	sys 2.159s
I20260925 02:01:36.104079  6781 rpc-test.cc:1859] Sending 1024MB via ssl-enabled tcp socket: real 3.089s	user 2.874s	sys 2.162s
I20260925 02:01:39.259696  6781 rpc-test.cc:1859] Sending 1024MB via ssl-enabled tcp socket: real 3.155s	user 2.971s	sys 2.210s
I20260925 02:01:42.330648  6781 rpc-test.cc:1859] Sending 1024MB via ssl-enabled tcp socket: real 3.071s	user 2.791s	sys 2.205s
I20260925 02:01:45.474314  6781 rpc-test.cc:1859] Sending 1024MB via ssl-enabled tcp socket: real 3.144s	user 2.792s	sys 2.339s
[       OK ] Parameters/TestRpc.TestPerformanceBySocketType/SSL_TCP (15698 ms)
[----------] 20 tests from Parameters/TestRpc (51717 ms total)

[----------] 1 test from Parameters/TestRpcSocketTxRxQueue
[ RUN      ] Parameters/TestRpcSocketTxRxQueue.OverCapacity/0
W20260925 02:01:45.795204  7274 negotiation.cc:337] Failed RPC negotiation. Trace:
0925 02:01:45.503915 (+     0us) reactor.cc:625] Submitting negotiation task for client connection to 0.0.0.0:44049 (local address 127.0.0.1:38196)
0925 02:01:45.504076 (+   161us) negotiation.cc:107] Waiting for socket to connect
0925 02:01:45.504094 (+    18us) client_negotiation.cc:174] Beginning negotiation
0925 02:01:45.504201 (+   107us) client_negotiation.cc:252] Sending NEGOTIATE NegotiatePB request
0925 02:01:45.794159 (+289958us) negotiation.cc:327] Negotiation complete: Network error: Client connection negotiation failed: client connection to 0.0.0.0:44049: BlockingRecv error: recv error from unknown peer: Transport endpoint is not connected (error 107)
Metrics: {"client-negotiator.queue_time_us":34}
W20260925 02:01:45.795213  7265 negotiation.cc:337] Failed RPC negotiation. Trace:
0925 02:01:45.501427 (+     0us) reactor.cc:625] Submitting negotiation task for client connection to 0.0.0.0:44049 (local address 127.0.0.1:38194)
0925 02:01:45.501619 (+   192us) negotiation.cc:107] Waiting for socket to connect
0925 02:01:45.501638 (+    19us) client_negotiation.cc:174] Beginning negotiation
0925 02:01:45.501762 (+   124us) client_negotiation.cc:252] Sending NEGOTIATE NegotiatePB request
0925 02:01:45.794159 (+292397us) negotiation.cc:327] Negotiation complete: Network error: Client connection negotiation failed: client connection to 0.0.0.0:44049: BlockingRecv error: recv error from unknown peer: Transport endpoint is not connected (error 107)
Metrics: {"client-negotiator.queue_time_us":68}
W20260925 02:01:45.796108  7301 negotiation.cc:337] Failed RPC negotiation. Trace:
0925 02:01:45.512495 (+     0us) reactor.cc:625] Submitting negotiation task for client connection to 0.0.0.0:44049 (local address 127.0.0.1:38206)
0925 02:01:45.512684 (+   189us) negotiation.cc:107] Waiting for socket to connect
0925 02:01:45.512702 (+    18us) client_negotiation.cc:174] Beginning negotiation
0925 02:01:45.512804 (+   102us) client_negotiation.cc:252] Sending NEGOTIATE NegotiatePB request
0925 02:01:45.794632 (+281828us) negotiation.cc:327] Negotiation complete: Network error: Client connection negotiation failed: client connection to 0.0.0.0:44049: BlockingRecv error: recv error from unknown peer: Transport endpoint is not connected (error 107)
Metrics: {"client-negotiator.queue_time_us":35}
W20260925 02:01:45.796489  7256 negotiation.cc:337] Failed RPC negotiation. Trace:
0925 02:01:45.498270 (+     0us) reactor.cc:625] Submitting negotiation task for client connection to 0.0.0.0:44049 (local address 127.0.0.1:38192)
0925 02:01:45.498466 (+   196us) negotiation.cc:107] Waiting for socket to connect
0925 02:01:45.498481 (+    15us) client_negotiation.cc:174] Beginning negotiation
0925 02:01:45.498594 (+   113us) client_negotiation.cc:252] Sending NEGOTIATE NegotiatePB request
0925 02:01:45.794159 (+295565us) negotiation.cc:327] Negotiation complete: Network error: Client connection negotiation failed: client connection to 0.0.0.0:44049: BlockingRecv error: recv error from unknown peer: Transport endpoint is not connected (error 107)
Metrics: {"client-negotiator.queue_time_us":61}
W20260925 02:01:45.796458  7283 negotiation.cc:337] Failed RPC negotiation. Trace:
0925 02:01:45.506597 (+     0us) reactor.cc:625] Submitting negotiation task for client connection to 0.0.0.0:44049 (local address 127.0.0.1:38198)
0925 02:01:45.506778 (+   181us) negotiation.cc:107] Waiting for socket to connect
0925 02:01:45.506791 (+    13us) client_negotiation.cc:174] Beginning negotiation
0925 02:01:45.506900 (+   109us) client_negotiation.cc:252] Sending NEGOTIATE NegotiatePB request
0925 02:01:45.794319 (+287419us) negotiation.cc:327] Negotiation complete: Network error: Client connection negotiation failed: client connection to 0.0.0.0:44049: BlockingRecv error: recv error from unknown peer: Transport endpoint is not connected (error 107)
Metrics: {"client-negotiator.queue_time_us":60}
W20260925 02:01:45.796881  7292 negotiation.cc:337] Failed RPC negotiation. Trace:
0925 02:01:45.509383 (+     0us) reactor.cc:625] Submitting negotiation task for client connection to 0.0.0.0:44049 (local address 127.0.0.1:38200)
0925 02:01:45.509635 (+   252us) negotiation.cc:107] Waiting for socket to connect
0925 02:01:45.509690 (+    55us) client_negotiation.cc:174] Beginning negotiation
0925 02:01:45.509795 (+   105us) client_negotiation.cc:252] Sending NEGOTIATE NegotiatePB request
0925 02:01:45.796463 (+286668us) negotiation.cc:327] Negotiation complete: Network error: Client connection negotiation failed: client connection to 0.0.0.0:44049: BlockingRecv error: recv error from unknown peer: Transport endpoint is not connected (error 107)
Metrics: {"client-negotiator.queue_time_us":54}
[       OK ] Parameters/TestRpcSocketTxRxQueue.OverCapacity/0 (1081 ms)
[----------] 1 test from Parameters/TestRpcSocketTxRxQueue (1081 ms total)

[----------] Global test environment tear-down
[==========] 21 tests from 2 test suites ran. (52799 ms total)
[  PASSED  ] 20 tests.
[  FAILED  ] 1 test, listed below:
[  FAILED  ] Parameters/TestRpc.TestCallWithChainCertAndChainCA/SSL_TCP, where GetParam() = (true, false)

 1 FAILED TEST