Parameters/TestRpc.TestCallWithChainCertAndChainCA/SSL_TCP: /data0/somelongdirectorytoavoidrpathissues/src/kudu/src/kudu/rpc/rpc-test.cc:270: Failure
Failed
Bad status: Runtime error: could not verify certificate chain (error with cert: subject=CN = localhost, ST = sadfjas, C = AS, emailAddress = sdflkdsajf, O = lskdfjlsad, OU = sldfkja, issuer=C = AS, ST = ASDfkjdhf, L = lskdjf, O = saldfja, OU = skdjf, CN = localhost, emailAddress = sadjflkadsj): : certificate has expired
Google Test trace:
/data0/somelongdirectorytoavoidrpathissues/src/kudu/src/kudu/rpc/rpc-test.cc:267: Connecting to 0.0.0.0:45349
I20260926 22:13:22.645655 10499 test_util.cc:175] -----------------------------------------------
I20260926 22:13:22.645916 10499 test_util.cc:176] Had fatal failures, leaving test files at /tmp/dist-test-taskis8aUj/test-tmp/rpc-test.5.Parameters_TestRpc.TestCallWithChainCertAndChainCA_SSL_TCP.1790460801246080-10499-0
Note: This is test shard 6 of 8.
[==========] Running 21 tests from 2 test suites.
[----------] Global test environment set-up.
[----------] 20 tests from Parameters/TestRpc
[ RUN ] Parameters/TestRpc.TestMessengerCreateDestroy/SSL_TCP
WARNING: Logging before InitGoogleLogging() is written to STDERR
I20260926 22:13:21.347124 10499 rpc-test.cc:169] started messenger TestCreateDestroy
[ OK ] Parameters/TestRpc.TestMessengerCreateDestroy/SSL_TCP (1215 ms)
[ RUN ] Parameters/TestRpc.TestNegotiationDeadlock/SSL_TCP
I20260926 22:13:22.542776 10521 acceptor_pool.cc:254] collecting diagnostics on the listening RPC socket 0.0.0.0:45879 every 8 connection(s)
I20260926 22:13:22.544335 10522 acceptor_pool.cc:254] collecting diagnostics on the listening RPC socket 0.0.0.0:45879 every 8 connection(s)
[ OK ] Parameters/TestRpc.TestNegotiationDeadlock/SSL_TCP (81 ms)
[ RUN ] Parameters/TestRpc.TestCallWithChainCertAndChainCA/SSL_TCP
I20260926 22:13:22.616191 10537 acceptor_pool.cc:254] collecting diagnostics on the listening RPC socket 0.0.0.0:45349 every 8 connection(s)
I20260926 22:13:22.618520 10538 acceptor_pool.cc:254] collecting diagnostics on the listening RPC socket 0.0.0.0:45349 every 8 connection(s)
/data0/somelongdirectorytoavoidrpathissues/src/kudu/src/kudu/rpc/rpc-test.cc:270: Failure
Failed
Bad status: Runtime error: could not verify certificate chain (error with cert: subject=CN = localhost, ST = sadfjas, C = AS, emailAddress = sdflkdsajf, O = lskdfjlsad, OU = sldfkja, issuer=C = AS, ST = ASDfkjdhf, L = lskdjf, O = saldfja, OU = skdjf, CN = localhost, emailAddress = sadjflkadsj): : certificate has expired
Google Test trace:
/data0/somelongdirectorytoavoidrpathissues/src/kudu/src/kudu/rpc/rpc-test.cc:267: Connecting to 0.0.0.0:45349
I20260926 22:13:22.645655 10499 test_util.cc:175] -----------------------------------------------
I20260926 22:13:22.645916 10499 test_util.cc:176] Had fatal failures, leaving test files at /tmp/dist-test-taskis8aUj/test-tmp/rpc-test.5.Parameters_TestRpc.TestCallWithChainCertAndChainCA_SSL_TCP.1790460801246080-10499-0
[ FAILED ] Parameters/TestRpc.TestCallWithChainCertAndChainCA/SSL_TCP, where GetParam() = (true, false) (49 ms)
[ RUN ] Parameters/TestRpc.TestCallWithPasswordProtectedKey/SSL_TCP
I20260926 22:13:22.679477 10562 acceptor_pool.cc:254] collecting diagnostics on the listening RPC socket 0.0.0.0:46585 every 8 connection(s)
I20260926 22:13:22.680192 10563 acceptor_pool.cc:254] collecting diagnostics on the listening RPC socket 0.0.0.0:46585 every 8 connection(s)
[ OK ] Parameters/TestRpc.TestCallWithPasswordProtectedKey/SSL_TCP (84 ms)
[ RUN ] Parameters/TestRpc.TestCallToBadServer/SSL_TCP
I20260926 22:13:22.759049 10499 rpc-test.cc:394] Status: Network error: Client connection negotiation failed: client connection to 0.0.0.0:0: connect: Connection refused (error 111)
I20260926 22:13:22.760675 10499 rpc-test.cc:394] Status: Network error: Client connection negotiation failed: client connection to 0.0.0.0:0: connect: Connection refused (error 111)
I20260926 22:13:22.762094 10499 rpc-test.cc:394] Status: Network error: Client connection negotiation failed: client connection to 0.0.0.0:0: connect: Connection refused (error 111)
I20260926 22:13:22.763448 10499 rpc-test.cc:394] Status: Network error: Client connection negotiation failed: client connection to 0.0.0.0:0: connect: Connection refused (error 111)
I20260926 22:13:22.764861 10499 rpc-test.cc:394] Status: Network error: Client connection negotiation failed: client connection to 0.0.0.0:0: connect: Connection refused (error 111)
[ OK ] Parameters/TestRpc.TestCallToBadServer/SSL_TCP (36 ms)
[ RUN ] Parameters/TestRpc.TestWrongService/SSL_TCP
I20260926 22:13:22.797436 10597 acceptor_pool.cc:254] collecting diagnostics on the listening RPC socket 0.0.0.0:43427 every 8 connection(s)
I20260926 22:13:22.798280 10598 acceptor_pool.cc:254] collecting diagnostics on the listening RPC socket 0.0.0.0:43427 every 8 connection(s)
I20260926 22:13:22.839587 10594 messenger.cc:345] service WrongServiceName not registered on TestServer
[ OK ] Parameters/TestRpc.TestWrongService/SSL_TCP (79 ms)
[ RUN ] Parameters/TestRpc.TestConnectionKeepalive/SSL_TCP
I20260926 22:13:22.866676 10620 acceptor_pool.cc:254] collecting diagnostics on the listening RPC socket 0.0.0.0:33823 every 8 connection(s)
I20260926 22:13:22.867451 10621 acceptor_pool.cc:254] collecting diagnostics on the listening RPC socket 0.0.0.0:33823 every 8 connection(s)
I20260926 22:13:22.870674 10499 rpc-test.cc:488] Connecting to 0.0.0.0:33823
[ OK ] Parameters/TestRpc.TestConnectionKeepalive/SSL_TCP (1066 ms)
[ RUN ] Parameters/TestRpc.TestClientConnectionMetrics/SSL_TCP
I20260926 22:13:23.937916 10645 acceptor_pool.cc:254] collecting diagnostics on the listening RPC socket 0.0.0.0:41255 every 8 connection(s)
I20260926 22:13:23.938680 10646 acceptor_pool.cc:254] collecting diagnostics on the listening RPC socket 0.0.0.0:41255 every 8 connection(s)
I20260926 22:13:23.942129 10499 rpc-test.cc:569] Connecting to 0.0.0.0:41255
[ OK ] Parameters/TestRpc.TestClientConnectionMetrics/SSL_TCP (119754 ms)
[ RUN ] Parameters/TestRpc.TestCredentialsPolicy/SSL_TCP
I20260926 22:15:23.695559 10680 acceptor_pool.cc:254] collecting diagnostics on the listening RPC socket 0.0.0.0:33981 every 8 connection(s)
I20260926 22:15:23.696357 10681 acceptor_pool.cc:254] collecting diagnostics on the listening RPC socket 0.0.0.0:33981 every 8 connection(s)
I20260926 22:15:23.699679 10499 rpc-test.cc:700] Connecting to 0.0.0.0:33981
[ OK ] Parameters/TestRpc.TestCredentialsPolicy/SSL_TCP (85 ms)
[ RUN ] Parameters/TestRpc.TestCallLongerThanKeepalive/SSL_TCP
I20260926 22:15:23.785890 10705 acceptor_pool.cc:254] collecting diagnostics on the listening RPC socket 0.0.0.0:41091 every 8 connection(s)
I20260926 22:15:23.786660 10706 acceptor_pool.cc:254] collecting diagnostics on the listening RPC socket 0.0.0.0:41091 every 8 connection(s)
I20260926 22:15:23.823263 10709 rpc-test-base.h:222] got call: sleep_micros: 3000000 deferred: true
I20260926 22:15:26.827811 10709 rpcz_store.cc:275] Call kudu.rpc.GenericCalculatorService.Sleep from 127.0.0.1:37084 (request call id 0) took 3004 ms. Trace:
I20260926 22:15:26.828174 10709 rpcz_store.cc:276] 0926 22:15:23.823014 (+ 0us) service_pool.cc:170] Inserting onto call queue
0926 22:15:23.823123 (+ 109us) service_pool.cc:227] Handling call
0926 22:15:26.827755 (+3004632us) inbound_call.cc:173] Queueing success response
Metrics: {}
[ OK ] Parameters/TestRpc.TestCallLongerThanKeepalive/SSL_TCP (3083 ms)
[ RUN ] Parameters/TestRpc.TestRpcSidecar/SSL_TCP
I20260926 22:15:26.874357 10730 acceptor_pool.cc:254] collecting diagnostics on the listening RPC socket 0.0.0.0:44303 every 8 connection(s)
I20260926 22:15:26.875089 10731 acceptor_pool.cc:254] collecting diagnostics on the listening RPC socket 0.0.0.0:44303 every 8 connection(s)
[ OK ] Parameters/TestRpc.TestRpcSidecar/SSL_TCP (556 ms)
[ RUN ] Parameters/TestRpc.TestRpcSidecarLimits/SSL_TCP
I20260926 22:15:45.374302 10757 acceptor_pool.cc:254] collecting diagnostics on the listening RPC socket 0.0.0.0:46011 every 8 connection(s)
I20260926 22:15:45.375203 10758 acceptor_pool.cc:254] collecting diagnostics on the listening RPC socket 0.0.0.0:46011 every 8 connection(s)
W20260926 22:15:45.394556 10499 serialization.cc:72] Serialized kudu.rpc_test.PushStringsRequestPB (2147483654 bytes) is larger than the maximum configured RPC message size (52428800 bytes). Sending anyway, but peer may reject the data.
W20260926 22:15:45.405155 10755 connection.cc:535] server connection from 127.0.0.1:59692 recv error: Network error: RPC frame had a length of 2147483714, but we only support messages up to 52428800 bytes long.
W20260926 22:15:45.405474 10755 connection.cc:158] shutting down server connection from 127.0.0.1:59692 with pending inbound data: 4/2147483714 bytes received; last active 0 ns ago: status Network error: RPC frame had a length of 2147483714, but we only support messages up to 52428800 bytes long.
W20260926 22:15:45.406507 10770 connection.cc:698] client connection to 0.0.0.0:46011 send error: Network error: failed to write to TLS socket: Connection reset by peer
W20260926 22:15:45.407214 10770 connection.cc:196] Error closing socket: Network error: TlsSocket::Close: Success
[ OK ] Parameters/TestRpc.TestRpcSidecarLimits/SSL_TCP (18685 ms)
[ RUN ] Parameters/TestRpc.TestCallTimeoutDoesntAffectNegotiation/SSL_TCP
I20260926 22:15:46.096462 10782 acceptor_pool.cc:254] collecting diagnostics on the listening RPC socket 0.0.0.0:42617 every 8 connection(s)
I20260926 22:15:46.097177 10783 acceptor_pool.cc:254] collecting diagnostics on the listening RPC socket 0.0.0.0:42617 every 8 connection(s)
W20260926 22:15:46.122371 10778 negotiation.cc:266] Injecting 500ms delay in negotiation
I20260926 22:15:46.172068 10499 rpc-test-base.h:595] status: Timed out: connection negotiation to 0.0.0.0:42617 for RPC Sleep timed out after 0.050s (ON_OUTBOUND_QUEUE), seconds elapsed: 0.0507324
[ OK ] Parameters/TestRpc.TestCallTimeoutDoesntAffectNegotiation/SSL_TCP (559 ms)
[ RUN ] Parameters/TestRpc.TestRpcHandlerLatencyMetric/SSL_TCP
I20260926 22:15:46.672993 10807 acceptor_pool.cc:254] collecting diagnostics on the listening RPC socket 0.0.0.0:39351 every 8 connection(s)
I20260926 22:15:46.673774 10808 acceptor_pool.cc:254] collecting diagnostics on the listening RPC socket 0.0.0.0:39351 every 8 connection(s)
I20260926 22:15:46.743065 10499 rpc-test.cc:1236] Sleep() min lat: 21715
I20260926 22:15:46.743294 10499 rpc-test.cc:1237] Sleep() mean lat: 21715
I20260926 22:15:46.743484 10499 rpc-test.cc:1238] Sleep() max lat: 21715
I20260926 22:15:46.743641 10499 rpc-test.cc:1239] Sleep() #calls: 1
[ OK ] Parameters/TestRpc.TestRpcHandlerLatencyMetric/SSL_TCP (110 ms)
[ RUN ] Parameters/TestRpc.TimedOutOnResponseMetricServiceQueue/SSL_TCP
I20260926 22:15:46.772269 10833 acceptor_pool.cc:254] collecting diagnostics on the listening RPC socket 0.0.0.0:46333 every 8 connection(s)
I20260926 22:15:46.773010 10834 acceptor_pool.cc:254] collecting diagnostics on the listening RPC socket 0.0.0.0:46333 every 8 connection(s)
W20260926 22:15:46.843232 10835 rpcz_store.cc:267] Call kudu.rpc_test.CalculatorService.Sleep from 127.0.0.1:48478 (request call id 2) took 20 ms (client timeout 20 ms). Trace:
W20260926 22:15:46.843567 10835 rpcz_store.cc:269] 0926 22:15:46.822656 (+ 0us) service_pool.cc:170] Inserting onto call queue
0926 22:15:46.843091 (+ 20435us) service_pool.cc:214] Skipping call since client already timed out
0926 22:15:46.843181 (+ 90us) inbound_call.cc:173] Queueing failure response
Metrics: {}
W20260926 22:15:46.845978 10830 connection.cc:196] Error closing socket: Network error: TlsSocket::Close: Connection reset by peer
[ OK ] Parameters/TestRpc.TimedOutOnResponseMetricServiceQueue/SSL_TCP (99 ms)
[ RUN ] Parameters/TestRpc.RpcPendingConnectionsMetric/SSL_TCP
I20260926 22:15:46.860625 10856 acceptor_pool.cc:254] collecting diagnostics on the listening RPC socket 0.0.0.0:35747 every 8 connection(s)
I20260926 22:15:46.861368 10857 acceptor_pool.cc:254] collecting diagnostics on the listening RPC socket 0.0.0.0:35747 every 8 connection(s)
W20260926 22:15:46.866986 10852 negotiation.cc:337] Failed RPC negotiation. Trace:
0926 22:15:46.865565 (+ 0us) reactor.cc:625] Submitting negotiation task for server connection from 127.0.0.1:51974 (local address 127.0.0.1:35747)
0926 22:15:46.866002 (+ 437us) server_negotiation.cc:206] Beginning negotiation
0926 22:15:46.866020 (+ 18us) server_negotiation.cc:399] Waiting for connection header
0926 22:15:46.866446 (+ 426us) negotiation.cc:327] Negotiation complete: Network error: Server connection negotiation failed: server connection from 127.0.0.1:51974: BlockingRecv error: recv got EOF from 127.0.0.1:51974 (error 108)
Metrics: {"server-negotiator.queue_time_us":140}
[ OK ] Parameters/TestRpc.RpcPendingConnectionsMetric/SSL_TCP (29 ms)
[ RUN ] Parameters/TestRpc.TestRpcContextClientDeadline/SSL_TCP
I20260926 22:15:46.916271 10872 acceptor_pool.cc:254] collecting diagnostics on the listening RPC socket 0.0.0.0:33707 every 8 connection(s)
I20260926 22:15:46.917029 10873 acceptor_pool.cc:254] collecting diagnostics on the listening RPC socket 0.0.0.0:33707 every 8 connection(s)
[ OK ] Parameters/TestRpc.TestRpcContextClientDeadline/SSL_TCP (115 ms)
[ RUN ] Parameters/TestRpc.TestApplicationFeatureFlagUnsupportedServer/SSL_TCP
I20260926 22:15:47.023948 10897 acceptor_pool.cc:254] collecting diagnostics on the listening RPC socket 0.0.0.0:41959 every 8 connection(s)
I20260926 22:15:47.024684 10898 acceptor_pool.cc:254] collecting diagnostics on the listening RPC socket 0.0.0.0:41959 every 8 connection(s)
[ OK ] Parameters/TestRpc.TestApplicationFeatureFlagUnsupportedServer/SSL_TCP (75 ms)
[ RUN ] Parameters/TestRpc.TestCancellationAsync/SSL_TCP
I20260926 22:15:47.098153 10922 acceptor_pool.cc:254] collecting diagnostics on the listening RPC socket 0.0.0.0:46367 every 8 connection(s)
I20260926 22:15:47.098863 10923 acceptor_pool.cc:254] collecting diagnostics on the listening RPC socket 0.0.0.0:46367 every 8 connection(s)
I20260926 22:15:47.101976 10499 rpc-test.cc:1716] Connecting to 0.0.0.0:46367
I20260926 22:15:47.114370 10499 test_util.cc:268] Using random seed: 750561643
I20260926 22:15:47.346518 10926 rpc-test-base.h:240] got call: sleep_micros: 500 pattern: 4294967295 num_repetitions: 2097152 sidecar_idx: 0
I20260926 22:15:47.511731 10925 rpc-test-base.h:240] got call: sleep_micros: 500 pattern: 4294967295 num_repetitions: 2097152 sidecar_idx: 0
W20260926 22:15:47.618327 10935 outbound_call.cc:322] RPC callback for RPC call kudu.rpc.GenericCalculatorService.SleepWithSidecar -> {remote=0.0.0.0:46367 (localhost), user_credentials={real_user=slave}} blocked reactor thread for 44868.5us
I20260926 22:15:47.701951 10926 rpc-test-base.h:240] got call: sleep_micros: 500 pattern: 4294967295 num_repetitions: 2097152 sidecar_idx: 0
I20260926 22:15:47.890475 10925 rpc-test-base.h:240] got call: sleep_micros: 500 pattern: 4294967295 num_repetitions: 2097152 sidecar_idx: 0
W20260926 22:15:47.990135 10935 outbound_call.cc:322] RPC callback for RPC call kudu.rpc.GenericCalculatorService.SleepWithSidecar -> {remote=0.0.0.0:46367 (localhost), user_credentials={real_user=slave}} blocked reactor thread for 45853.5us
I20260926 22:15:48.078933 10926 rpc-test-base.h:240] got call: sleep_micros: 500 pattern: 4294967295 num_repetitions: 2097152 sidecar_idx: 0
I20260926 22:15:48.262669 10925 rpc-test-base.h:240] got call: sleep_micros: 500 pattern: 4294967295 num_repetitions: 2097152 sidecar_idx: 0
I20260926 22:15:48.451092 10925 rpc-test-base.h:240] got call: sleep_micros: 500 pattern: 4294967295 num_repetitions: 2097152 sidecar_idx: 0
I20260926 22:15:48.638378 10925 rpc-test-base.h:240] got call: sleep_micros: 500 pattern: 4294967295 num_repetitions: 2097152 sidecar_idx: 0
W20260926 22:15:48.794180 10919 connection.cc:196] Error closing socket: Network error: TlsSocket::Close: Broken pipe
W20260926 22:15:48.798241 10919 connection.cc:441] server connection from 127.0.0.1:52678 torn down before Call kudu.rpc.GenericCalculatorService.SleepWithSidecar from 127.0.0.1:52678 (request call id 8) could send its response
[ OK ] Parameters/TestRpc.TestCancellationAsync/SSL_TCP (1736 ms)
[ RUN ] Parameters/TestRpc.TestPerformanceBySocketType/SSL_TCP
I20260926 22:15:48.904646 10947 acceptor_pool.cc:254] collecting diagnostics on the listening RPC socket 0.0.0.0:34125 every 8 connection(s)
I20260926 22:15:48.905345 10948 acceptor_pool.cc:254] collecting diagnostics on the listening RPC socket 0.0.0.0:34125 every 8 connection(s)
I20260926 22:15:48.908550 10499 rpc-test.cc:1846] Connecting to 0.0.0.0:34125
I20260926 22:16:08.494300 10499 rpc-test.cc:1859] Sending 1024MB via ssl-enabled tcp socket: real 19.563s user 16.616s sys 11.256s
I20260926 22:16:27.829980 10499 rpc-test.cc:1859] Sending 1024MB via ssl-enabled tcp socket: real 19.335s user 16.393s sys 10.991s
I20260926 22:16:47.294724 10499 rpc-test.cc:1859] Sending 1024MB via ssl-enabled tcp socket: real 19.464s user 16.380s sys 11.238s
I20260926 22:17:06.793568 10499 rpc-test.cc:1859] Sending 1024MB via ssl-enabled tcp socket: real 19.498s user 16.973s sys 10.722s
I20260926 22:17:26.449862 10499 rpc-test.cc:1859] Sending 1024MB via ssl-enabled tcp socket: real 19.656s user 16.926s sys 10.947s
[ OK ] Parameters/TestRpc.TestPerformanceBySocketType/SSL_TCP (97661 ms)
[----------] 20 tests from Parameters/TestRpc (245171 ms total)
[----------] 1 test from Parameters/TestRpcSocketTxRxQueue
[ RUN ] Parameters/TestRpcSocketTxRxQueue.OverCapacity/0
W20260926 22:17:26.907604 10983 negotiation.cc:337] Failed RPC negotiation. Trace:
0926 22:17:26.487887 (+ 0us) reactor.cc:625] Submitting negotiation task for client connection to 0.0.0.0:45843 (local address 127.0.0.1:49632)
0926 22:17:26.488376 (+ 489us) negotiation.cc:107] Waiting for socket to connect
0926 22:17:26.488406 (+ 30us) client_negotiation.cc:174] Beginning negotiation
0926 22:17:26.488591 (+ 185us) client_negotiation.cc:252] Sending NEGOTIATE NegotiatePB request
0926 22:17:26.906439 (+417848us) negotiation.cc:327] Negotiation complete: Network error: Client connection negotiation failed: client connection to 0.0.0.0:45843: BlockingRecv error: recv error from unknown peer: Transport endpoint is not connected (error 107)
Metrics: {"client-negotiator.queue_time_us":108}
W20260926 22:17:26.907564 10992 negotiation.cc:337] Failed RPC negotiation. Trace:
0926 22:17:26.495337 (+ 0us) reactor.cc:625] Submitting negotiation task for client connection to 0.0.0.0:45843 (local address 127.0.0.1:49636)
0926 22:17:26.496012 (+ 675us) negotiation.cc:107] Waiting for socket to connect
0926 22:17:26.496159 (+ 147us) client_negotiation.cc:174] Beginning negotiation
0926 22:17:26.496462 (+ 303us) client_negotiation.cc:252] Sending NEGOTIATE NegotiatePB request
0926 22:17:26.906439 (+409977us) negotiation.cc:327] Negotiation complete: Network error: Client connection negotiation failed: client connection to 0.0.0.0:45843: BlockingRecv error: recv error from unknown peer: Transport endpoint is not connected (error 107)
Metrics: {"client-negotiator.queue_time_us":161}
W20260926 22:17:26.907893 11001 negotiation.cc:337] Failed RPC negotiation. Trace:
0926 22:17:26.507791 (+ 0us) reactor.cc:625] Submitting negotiation task for client connection to 0.0.0.0:45843 (local address 127.0.0.1:49652)
0926 22:17:26.508379 (+ 588us) negotiation.cc:107] Waiting for socket to connect
0926 22:17:26.508409 (+ 30us) client_negotiation.cc:174] Beginning negotiation
0926 22:17:26.508712 (+ 303us) client_negotiation.cc:252] Sending NEGOTIATE NegotiatePB request
0926 22:17:26.906904 (+398192us) negotiation.cc:327] Negotiation complete: Network error: Client connection negotiation failed: client connection to 0.0.0.0:45843: BlockingRecv error: recv error from unknown peer: Transport endpoint is not connected (error 107)
Metrics: {"client-negotiator.queue_time_us":151}
W20260926 22:17:26.907527 10974 negotiation.cc:337] Failed RPC negotiation. Trace:
0926 22:17:26.480828 (+ 0us) reactor.cc:625] Submitting negotiation task for client connection to 0.0.0.0:45843 (local address 127.0.0.1:49616)
0926 22:17:26.481529 (+ 701us) negotiation.cc:107] Waiting for socket to connect
0926 22:17:26.481580 (+ 51us) client_negotiation.cc:174] Beginning negotiation
0926 22:17:26.482296 (+ 716us) client_negotiation.cc:252] Sending NEGOTIATE NegotiatePB request
0926 22:17:26.906394 (+424098us) negotiation.cc:327] Negotiation complete: Network error: Client connection negotiation failed: client connection to 0.0.0.0:45843: BlockingRecv error: recv error from unknown peer: Transport endpoint is not connected (error 107)
Metrics: {"client-negotiator.queue_time_us":130}
W20260926 22:17:26.909030 11019 negotiation.cc:337] Failed RPC negotiation. Trace:
0926 22:17:26.531726 (+ 0us) reactor.cc:625] Submitting negotiation task for client connection to 0.0.0.0:45843 (local address 127.0.0.1:49678)
0926 22:17:26.532221 (+ 495us) negotiation.cc:107] Waiting for socket to connect
0926 22:17:26.532252 (+ 31us) client_negotiation.cc:174] Beginning negotiation
0926 22:17:26.532438 (+ 186us) client_negotiation.cc:252] Sending NEGOTIATE NegotiatePB request
0926 22:17:26.908070 (+375632us) negotiation.cc:327] Negotiation complete: Network error: Client connection negotiation failed: client connection to 0.0.0.0:45843: BlockingRecv error: recv error from unknown peer: Transport endpoint is not connected (error 107)
Metrics: {"client-negotiator.queue_time_us":143}
W20260926 22:17:26.909660 11010 negotiation.cc:337] Failed RPC negotiation. Trace:
0926 22:17:26.519814 (+ 0us) reactor.cc:625] Submitting negotiation task for client connection to 0.0.0.0:45843 (local address 127.0.0.1:49666)
0926 22:17:26.520393 (+ 579us) negotiation.cc:107] Waiting for socket to connect
0926 22:17:26.520426 (+ 33us) client_negotiation.cc:174] Beginning negotiation
0926 22:17:26.520734 (+ 308us) client_negotiation.cc:252] Sending NEGOTIATE NegotiatePB request
0926 22:17:26.908654 (+387920us) negotiation.cc:327] Negotiation complete: Network error: Client connection negotiation failed: client connection to 0.0.0.0:45843: BlockingRecv error: recv error from unknown peer: Transport endpoint is not connected (error 107)
Metrics: {"client-negotiator.queue_time_us":144}
[ OK ] Parameters/TestRpcSocketTxRxQueue.OverCapacity/0 (1218 ms)
[----------] 1 test from Parameters/TestRpcSocketTxRxQueue (1218 ms total)
[----------] Global test environment tear-down
[==========] 21 tests from 2 test suites ran. (246390 ms total)
[ PASSED ] 20 tests.
[ FAILED ] 1 test, listed below:
[ FAILED ] Parameters/TestRpc.TestCallWithChainCertAndChainCA/SSL_TCP, where GetParam() = (true, false)
1 FAILED TEST