Diagnosed failure
Parameters/TestRpc.TestCallWithChainCertAndChainCA/SSL_UnixSocket: /data0/somelongdirectorytoavoidrpathissues/src/kudu/src/kudu/rpc/rpc-test.cc:270: Failure
Failed
Bad status: Runtime error: could not verify certificate chain (error with cert: subject=CN = localhost, ST = sadfjas, C = AS, emailAddress = sdflkdsajf, O = lskdfjlsad, OU = sldfkja, issuer=C = AS, ST = ASDfkjdhf, L = lskdjf, O = saldfja, OU = skdjf, CN = localhost, emailAddress = sadjflkadsj): : certificate has expired
Google Test trace:
/data0/somelongdirectorytoavoidrpathissues/src/kudu/src/kudu/rpc/rpc-test.cc:267: Connecting to unix:/tmp/dist-test-taskQqVPsR/test-tmp/rpc-test-8aef4f7c4e174910b20f4b263dae5376.sock
I20260926 16:22:13.375377 4502 test_util.cc:175] -----------------------------------------------
I20260926 16:22:13.375622 4502 test_util.cc:176] Had fatal failures, leaving test files at /tmp/dist-test-taskQqVPsR/test-tmp/rpc-test.6.Parameters_TestRpc.TestCallWithChainCertAndChainCA_SSL_UnixSocket.1790439732002945-4502-0
Full log
Note: This is test shard 7 of 8.
[==========] Running 21 tests from 2 test suites.
[----------] Global test environment set-up.
[----------] 20 tests from Parameters/TestRpc
[ RUN ] Parameters/TestRpc.TestMessengerCreateDestroy/SSL_UnixSocket
WARNING: Logging before InitGoogleLogging() is written to STDERR
I20260926 16:22:12.106518 4502 rpc-test.cc:169] started messenger TestCreateDestroy
[ OK ] Parameters/TestRpc.TestMessengerCreateDestroy/SSL_UnixSocket (1172 ms)
[ RUN ] Parameters/TestRpc.TestNegotiationDeadlock/SSL_UnixSocket
I20260926 16:22:13.260740 4524 acceptor_pool.cc:254] collecting diagnostics on the listening RPC socket unix:/tmp/dist-test-taskQqVPsR/test-tmp/rpc-test-1ed34b964a7f4e0ead3272144fd76e6d.sock every 8 connection(s)
I20260926 16:22:13.262360 4525 acceptor_pool.cc:254] collecting diagnostics on the listening RPC socket unix:/tmp/dist-test-taskQqVPsR/test-tmp/rpc-test-1ed34b964a7f4e0ead3272144fd76e6d.sock every 8 connection(s)
[ OK ] Parameters/TestRpc.TestNegotiationDeadlock/SSL_UnixSocket (85 ms)
[ RUN ] Parameters/TestRpc.TestCallWithChainCertAndChainCA/SSL_UnixSocket
I20260926 16:22:13.345527 4540 acceptor_pool.cc:254] collecting diagnostics on the listening RPC socket unix:/tmp/dist-test-taskQqVPsR/test-tmp/rpc-test-8aef4f7c4e174910b20f4b263dae5376.sock every 8 connection(s)
I20260926 16:22:13.348008 4541 acceptor_pool.cc:254] collecting diagnostics on the listening RPC socket unix:/tmp/dist-test-taskQqVPsR/test-tmp/rpc-test-8aef4f7c4e174910b20f4b263dae5376.sock every 8 connection(s)
/data0/somelongdirectorytoavoidrpathissues/src/kudu/src/kudu/rpc/rpc-test.cc:270: Failure
Failed
Bad status: Runtime error: could not verify certificate chain (error with cert: subject=CN = localhost, ST = sadfjas, C = AS, emailAddress = sdflkdsajf, O = lskdfjlsad, OU = sldfkja, issuer=C = AS, ST = ASDfkjdhf, L = lskdjf, O = saldfja, OU = skdjf, CN = localhost, emailAddress = sadjflkadsj): : certificate has expired
Google Test trace:
/data0/somelongdirectorytoavoidrpathissues/src/kudu/src/kudu/rpc/rpc-test.cc:267: Connecting to unix:/tmp/dist-test-taskQqVPsR/test-tmp/rpc-test-8aef4f7c4e174910b20f4b263dae5376.sock
I20260926 16:22:13.375377 4502 test_util.cc:175] -----------------------------------------------
I20260926 16:22:13.375622 4502 test_util.cc:176] Had fatal failures, leaving test files at /tmp/dist-test-taskQqVPsR/test-tmp/rpc-test.6.Parameters_TestRpc.TestCallWithChainCertAndChainCA_SSL_UnixSocket.1790439732002945-4502-0
[ FAILED ] Parameters/TestRpc.TestCallWithChainCertAndChainCA/SSL_UnixSocket, where GetParam() = (true, true) (61 ms)
[ RUN ] Parameters/TestRpc.TestCallWithPasswordProtectedKey/SSL_UnixSocket
I20260926 16:22:13.400105 4565 acceptor_pool.cc:254] collecting diagnostics on the listening RPC socket unix:/tmp/dist-test-taskQqVPsR/test-tmp/rpc-test-0eed18a97f93498c9218a8ab648c2420.sock every 8 connection(s)
I20260926 16:22:13.400875 4566 acceptor_pool.cc:254] collecting diagnostics on the listening RPC socket unix:/tmp/dist-test-taskQqVPsR/test-tmp/rpc-test-0eed18a97f93498c9218a8ab648c2420.sock every 8 connection(s)
W20260926 16:22:13.445144 4562 connection.cc:196] Error closing socket: Network error: TlsSocket::Close: Broken pipe
[ OK ] Parameters/TestRpc.TestCallWithPasswordProtectedKey/SSL_UnixSocket (75 ms)
[ RUN ] Parameters/TestRpc.TestCallToBadServer/SSL_UnixSocket
I20260926 16:22:13.474670 4502 rpc-test.cc:394] Status: Network error: Client connection negotiation failed: client connection to 0.0.0.0:0: connect: Connection refused (error 111)
I20260926 16:22:13.476068 4502 rpc-test.cc:394] Status: Network error: Client connection negotiation failed: client connection to 0.0.0.0:0: connect: Connection refused (error 111)
I20260926 16:22:13.477310 4502 rpc-test.cc:394] Status: Network error: Client connection negotiation failed: client connection to 0.0.0.0:0: connect: Connection refused (error 111)
I20260926 16:22:13.478525 4502 rpc-test.cc:394] Status: Network error: Client connection negotiation failed: client connection to 0.0.0.0:0: connect: Connection refused (error 111)
I20260926 16:22:13.479939 4502 rpc-test.cc:394] Status: Network error: Client connection negotiation failed: client connection to 0.0.0.0:0: connect: Connection refused (error 111)
[ OK ] Parameters/TestRpc.TestCallToBadServer/SSL_UnixSocket (30 ms)
[ RUN ] Parameters/TestRpc.TestWrongService/SSL_UnixSocket
I20260926 16:22:13.502282 4600 acceptor_pool.cc:254] collecting diagnostics on the listening RPC socket unix:/tmp/dist-test-taskQqVPsR/test-tmp/rpc-test-71cf4130ea164479b4f035d0bf344341.sock every 8 connection(s)
I20260926 16:22:13.503159 4601 acceptor_pool.cc:254] collecting diagnostics on the listening RPC socket unix:/tmp/dist-test-taskQqVPsR/test-tmp/rpc-test-71cf4130ea164479b4f035d0bf344341.sock every 8 connection(s)
I20260926 16:22:13.542346 4597 messenger.cc:345] service WrongServiceName not registered on TestServer
W20260926 16:22:13.545226 4597 connection.cc:196] Error closing socket: Network error: TlsSocket::Close: Broken pipe
[ OK ] Parameters/TestRpc.TestWrongService/SSL_UnixSocket (68 ms)
[ RUN ] Parameters/TestRpc.TestConnectionKeepalive/SSL_UnixSocket
I20260926 16:22:13.581668 4623 acceptor_pool.cc:254] collecting diagnostics on the listening RPC socket unix:/tmp/dist-test-taskQqVPsR/test-tmp/rpc-test-a5716f47829b43d6ac13c251225a1fe5.sock every 8 connection(s)
I20260926 16:22:13.582441 4624 acceptor_pool.cc:254] collecting diagnostics on the listening RPC socket unix:/tmp/dist-test-taskQqVPsR/test-tmp/rpc-test-a5716f47829b43d6ac13c251225a1fe5.sock every 8 connection(s)
I20260926 16:22:13.585690 4502 rpc-test.cc:488] Connecting to unix:/tmp/dist-test-taskQqVPsR/test-tmp/rpc-test-a5716f47829b43d6ac13c251225a1fe5.sock
W20260926 16:22:14.154534 4636 connection.cc:196] Error closing socket: Network error: TlsSocket::Close: Broken pipe
[ OK ] Parameters/TestRpc.TestConnectionKeepalive/SSL_UnixSocket (1077 ms)
[ RUN ] Parameters/TestRpc.TestClientConnectionMetrics/SSL_UnixSocket
I20260926 16:22:14.653844 4648 acceptor_pool.cc:254] collecting diagnostics on the listening RPC socket unix:/tmp/dist-test-taskQqVPsR/test-tmp/rpc-test-53a2284040f642a4ba0342401baf3977.sock every 8 connection(s)
I20260926 16:22:14.654603 4649 acceptor_pool.cc:254] collecting diagnostics on the listening RPC socket unix:/tmp/dist-test-taskQqVPsR/test-tmp/rpc-test-53a2284040f642a4ba0342401baf3977.sock every 8 connection(s)
I20260926 16:22:14.658617 4502 rpc-test.cc:569] Connecting to unix:/tmp/dist-test-taskQqVPsR/test-tmp/rpc-test-53a2284040f642a4ba0342401baf3977.sock
W20260926 16:24:30.755697 4645 connection.cc:196] Error closing socket: Network error: TlsSocket::Close: Broken pipe
[ OK ] Parameters/TestRpc.TestClientConnectionMetrics/SSL_UnixSocket (136135 ms)
[ RUN ] Parameters/TestRpc.TestCredentialsPolicy/SSL_UnixSocket
I20260926 16:24:30.788802 4684 acceptor_pool.cc:254] collecting diagnostics on the listening RPC socket unix:/tmp/dist-test-taskQqVPsR/test-tmp/rpc-test-783ba8ed7fd84a3bb1f0100184d89ed1.sock every 8 connection(s)
I20260926 16:24:30.789721 4685 acceptor_pool.cc:254] collecting diagnostics on the listening RPC socket unix:/tmp/dist-test-taskQqVPsR/test-tmp/rpc-test-783ba8ed7fd84a3bb1f0100184d89ed1.sock every 8 connection(s)
I20260926 16:24:30.793320 4502 rpc-test.cc:700] Connecting to unix:/tmp/dist-test-taskQqVPsR/test-tmp/rpc-test-783ba8ed7fd84a3bb1f0100184d89ed1.sock
W20260926 16:24:30.844719 4683 connection.cc:196] Error closing socket: Network error: TlsSocket::Close: Broken pipe
[ OK ] Parameters/TestRpc.TestCredentialsPolicy/SSL_UnixSocket (101 ms)
[ RUN ] Parameters/TestRpc.TestCallLongerThanKeepalive/SSL_UnixSocket
I20260926 16:24:30.892088 4709 acceptor_pool.cc:254] collecting diagnostics on the listening RPC socket unix:/tmp/dist-test-taskQqVPsR/test-tmp/rpc-test-877bfa5c041f4101a8e25d55b7ec798c.sock every 8 connection(s)
I20260926 16:24:30.892834 4710 acceptor_pool.cc:254] collecting diagnostics on the listening RPC socket unix:/tmp/dist-test-taskQqVPsR/test-tmp/rpc-test-877bfa5c041f4101a8e25d55b7ec798c.sock every 8 connection(s)
I20260926 16:24:30.937556 4713 rpc-test-base.h:222] got call: sleep_micros: 3000000 deferred: true
I20260926 16:24:33.942035 4713 rpcz_store.cc:275] Call kudu.rpc.GenericCalculatorService.Sleep from unix:<unnamed> (request call id 0) took 3004 ms. Trace:
I20260926 16:24:33.942452 4713 rpcz_store.cc:276] 0926 16:24:30.937386 (+ 0us) service_pool.cc:170] Inserting onto call queue
0926 16:24:30.937497 (+ 111us) service_pool.cc:227] Handling call
0926 16:24:33.941856 (+3004359us) inbound_call.cc:173] Queueing success response
Metrics: {}
[ OK ] Parameters/TestRpc.TestCallLongerThanKeepalive/SSL_UnixSocket (3089 ms)
[ RUN ] Parameters/TestRpc.TestRpcSidecar/SSL_UnixSocket
I20260926 16:24:33.981874 4735 acceptor_pool.cc:254] collecting diagnostics on the listening RPC socket unix:/tmp/dist-test-taskQqVPsR/test-tmp/rpc-test-9f2c56c7c4254c199caa1f25fb34fe98.sock every 8 connection(s)
I20260926 16:24:33.982722 4736 acceptor_pool.cc:254] collecting diagnostics on the listening RPC socket unix:/tmp/dist-test-taskQqVPsR/test-tmp/rpc-test-9f2c56c7c4254c199caa1f25fb34fe98.sock every 8 connection(s)
W20260926 16:24:34.478320 4732 connection.cc:196] Error closing socket: Network error: TlsSocket::Close: Broken pipe
[ OK ] Parameters/TestRpc.TestRpcSidecar/SSL_UnixSocket (528 ms)
[ RUN ] Parameters/TestRpc.TestRpcSidecarLimits/SSL_UnixSocket
I20260926 16:24:51.287748 4761 acceptor_pool.cc:254] collecting diagnostics on the listening RPC socket unix:/tmp/dist-test-taskQqVPsR/test-tmp/rpc-test-b9deddcd9db540df97725e37f76de861.sock every 8 connection(s)
I20260926 16:24:51.288642 4762 acceptor_pool.cc:254] collecting diagnostics on the listening RPC socket unix:/tmp/dist-test-taskQqVPsR/test-tmp/rpc-test-b9deddcd9db540df97725e37f76de861.sock every 8 connection(s)
W20260926 16:24:51.321570 4502 serialization.cc:72] Serialized kudu.rpc_test.PushStringsRequestPB (2147483654 bytes) is larger than the maximum configured RPC message size (52428800 bytes). Sending anyway, but peer may reject the data.
W20260926 16:24:51.331876 4758 connection.cc:535] server connection from unix:<unnamed> recv error: Network error: RPC frame had a length of 2147483714, but we only support messages up to 52428800 bytes long.
W20260926 16:24:51.332240 4758 connection.cc:158] shutting down server connection from unix:<unnamed> with pending inbound data: 4/2147483714 bytes received; last active 0 ns ago: status Network error: RPC frame had a length of 2147483714, but we only support messages up to 52428800 bytes long.
W20260926 16:24:51.333526 4774 connection.cc:698] client connection to unix:/tmp/dist-test-taskQqVPsR/test-tmp/rpc-test-b9deddcd9db540df97725e37f76de861.sock send error: Network error: failed to write to TLS socket: Broken pipe
W20260926 16:24:51.334044 4774 connection.cc:196] Error closing socket: Network error: TlsSocket::Close: Success
[ OK ] Parameters/TestRpc.TestRpcSidecarLimits/SSL_UnixSocket (17650 ms)
[ RUN ] Parameters/TestRpc.TestCallTimeoutDoesntAffectNegotiation/SSL_UnixSocket
I20260926 16:24:52.178109 4786 acceptor_pool.cc:254] collecting diagnostics on the listening RPC socket unix:/tmp/dist-test-taskQqVPsR/test-tmp/rpc-test-b7e7c30be8f04fd8aadb7172b898d68b.sock every 8 connection(s)
I20260926 16:24:52.178862 4787 acceptor_pool.cc:254] collecting diagnostics on the listening RPC socket unix:/tmp/dist-test-taskQqVPsR/test-tmp/rpc-test-b7e7c30be8f04fd8aadb7172b898d68b.sock every 8 connection(s)
W20260926 16:24:52.216506 4782 negotiation.cc:266] Injecting 500ms delay in negotiation
I20260926 16:24:52.266471 4502 rpc-test-base.h:595] status: Timed out: connection negotiation to unix:/tmp/dist-test-taskQqVPsR/test-tmp/rpc-test-b7e7c30be8f04fd8aadb7172b898d68b.sock for RPC Sleep timed out after 0.050s (ON_OUTBOUND_QUEUE), seconds elapsed: 0.0510857
[ OK ] Parameters/TestRpc.TestCallTimeoutDoesntAffectNegotiation/SSL_UnixSocket (604 ms)
[ RUN ] Parameters/TestRpc.TestRpcHandlerLatencyMetric/SSL_UnixSocket
I20260926 16:24:52.763028 4812 acceptor_pool.cc:254] collecting diagnostics on the listening RPC socket unix:/tmp/dist-test-taskQqVPsR/test-tmp/rpc-test-1ba6c3326a994fd7a5874523686a45c7.sock every 8 connection(s)
I20260926 16:24:52.763821 4813 acceptor_pool.cc:254] collecting diagnostics on the listening RPC socket unix:/tmp/dist-test-taskQqVPsR/test-tmp/rpc-test-1ba6c3326a994fd7a5874523686a45c7.sock every 8 connection(s)
I20260926 16:24:52.820564 4502 rpc-test.cc:1236] Sleep() min lat: 21601
I20260926 16:24:52.820782 4502 rpc-test.cc:1237] Sleep() mean lat: 21601
I20260926 16:24:52.820931 4502 rpc-test.cc:1238] Sleep() max lat: 21601
I20260926 16:24:52.821039 4502 rpc-test.cc:1239] Sleep() #calls: 1
[ OK ] Parameters/TestRpc.TestRpcHandlerLatencyMetric/SSL_UnixSocket (91 ms)
[ RUN ] Parameters/TestRpc.TimedOutOnResponseMetricServiceQueue/SSL_UnixSocket
I20260926 16:24:52.856678 4838 acceptor_pool.cc:254] collecting diagnostics on the listening RPC socket unix:/tmp/dist-test-taskQqVPsR/test-tmp/rpc-test-24a7c6d39ab84ad4859845d3b7be660c.sock every 8 connection(s)
I20260926 16:24:52.857424 4839 acceptor_pool.cc:254] collecting diagnostics on the listening RPC socket unix:/tmp/dist-test-taskQqVPsR/test-tmp/rpc-test-24a7c6d39ab84ad4859845d3b7be660c.sock every 8 connection(s)
W20260926 16:24:52.925524 4840 rpcz_store.cc:267] Call kudu.rpc_test.CalculatorService.Sleep from unix:<unnamed> (request call id 2) took 20 ms (client timeout 20 ms). Trace:
W20260926 16:24:52.925931 4840 rpcz_store.cc:269] 0926 16:24:52.904958 (+ 0us) service_pool.cc:170] Inserting onto call queue
0926 16:24:52.925289 (+ 20331us) service_pool.cc:214] Skipping call since client already timed out
0926 16:24:52.925389 (+ 100us) inbound_call.cc:173] Queueing failure response
Metrics: {}
W20260926 16:24:52.928287 4835 connection.cc:196] Error closing socket: Network error: TlsSocket::Close: Broken pipe
[ OK ] Parameters/TestRpc.TimedOutOnResponseMetricServiceQueue/SSL_UnixSocket (102 ms)
[ RUN ] Parameters/TestRpc.RpcPendingConnectionsMetric/SSL_UnixSocket
I20260926 16:24:52.943908 4861 acceptor_pool.cc:254] collecting diagnostics on the listening RPC socket 0.0.0.0:33649 every 8 connection(s)
I20260926 16:24:52.944661 4862 acceptor_pool.cc:254] collecting diagnostics on the listening RPC socket 0.0.0.0:33649 every 8 connection(s)
W20260926 16:24:52.949891 4857 negotiation.cc:337] Failed RPC negotiation. Trace:
0926 16:24:52.948678 (+ 0us) reactor.cc:625] Submitting negotiation task for server connection from 127.0.0.1:32894 (local address 127.0.0.1:33649)
0926 16:24:52.949066 (+ 388us) server_negotiation.cc:206] Beginning negotiation
0926 16:24:52.949083 (+ 17us) server_negotiation.cc:399] Waiting for connection header
0926 16:24:52.949316 (+ 233us) negotiation.cc:327] Negotiation complete: Network error: Server connection negotiation failed: server connection from 127.0.0.1:32894: BlockingRecv error: recv got EOF from 127.0.0.1:32894 (error 108)
Metrics: {"server-negotiator.queue_time_us":96}
[ OK ] Parameters/TestRpc.RpcPendingConnectionsMetric/SSL_UnixSocket (30 ms)
[ RUN ] Parameters/TestRpc.TestRpcContextClientDeadline/SSL_UnixSocket
I20260926 16:24:52.984658 4877 acceptor_pool.cc:254] collecting diagnostics on the listening RPC socket unix:/tmp/dist-test-taskQqVPsR/test-tmp/rpc-test-2573f2b3ca73425580b4ffd4505684dc.sock every 8 connection(s)
I20260926 16:24:52.985404 4878 acceptor_pool.cc:254] collecting diagnostics on the listening RPC socket unix:/tmp/dist-test-taskQqVPsR/test-tmp/rpc-test-2573f2b3ca73425580b4ffd4505684dc.sock every 8 connection(s)
[ OK ] Parameters/TestRpc.TestRpcContextClientDeadline/SSL_UnixSocket (83 ms)
[ RUN ] Parameters/TestRpc.TestApplicationFeatureFlagUnsupportedServer/SSL_UnixSocket
I20260926 16:24:53.078923 4902 acceptor_pool.cc:254] collecting diagnostics on the listening RPC socket unix:/tmp/dist-test-taskQqVPsR/test-tmp/rpc-test-9e58b3bfa78345cd9d3b2dd6c4338b07.sock every 8 connection(s)
I20260926 16:24:53.079681 4903 acceptor_pool.cc:254] collecting diagnostics on the listening RPC socket unix:/tmp/dist-test-taskQqVPsR/test-tmp/rpc-test-9e58b3bfa78345cd9d3b2dd6c4338b07.sock every 8 connection(s)
[ OK ] Parameters/TestRpc.TestApplicationFeatureFlagUnsupportedServer/SSL_UnixSocket (69 ms)
[ RUN ] Parameters/TestRpc.TestCancellationAsync/SSL_UnixSocket
I20260926 16:24:53.134717 4927 acceptor_pool.cc:254] collecting diagnostics on the listening RPC socket unix:/tmp/dist-test-taskQqVPsR/test-tmp/rpc-test-b06b0ba70866442a96861f4d579b8b84.sock every 8 connection(s)
I20260926 16:24:53.135473 4928 acceptor_pool.cc:254] collecting diagnostics on the listening RPC socket unix:/tmp/dist-test-taskQqVPsR/test-tmp/rpc-test-b06b0ba70866442a96861f4d579b8b84.sock every 8 connection(s)
I20260926 16:24:53.138563 4502 rpc-test.cc:1716] Connecting to unix:/tmp/dist-test-taskQqVPsR/test-tmp/rpc-test-b06b0ba70866442a96861f4d579b8b84.sock
I20260926 16:24:53.156402 4502 test_util.cc:268] Using random seed: 1171440157
I20260926 16:24:53.375069 4931 rpc-test-base.h:240] got call: sleep_micros: 500 pattern: 4294967295 num_repetitions: 2097152 sidecar_idx: 0
I20260926 16:24:53.593621 4931 rpc-test-base.h:240] got call: sleep_micros: 500 pattern: 4294967295 num_repetitions: 2097152 sidecar_idx: 0
I20260926 16:24:53.802827 4931 rpc-test-base.h:240] got call: sleep_micros: 500 pattern: 4294967295 num_repetitions: 2097152 sidecar_idx: 0
I20260926 16:24:53.997432 4930 rpc-test-base.h:240] got call: sleep_micros: 500 pattern: 4294967295 num_repetitions: 2097152 sidecar_idx: 0
I20260926 16:24:54.229101 4931 rpc-test-base.h:240] got call: sleep_micros: 500 pattern: 4294967295 num_repetitions: 2097152 sidecar_idx: 0
I20260926 16:24:54.461836 4931 rpc-test-base.h:240] got call: sleep_micros: 500 pattern: 4294967295 num_repetitions: 2097152 sidecar_idx: 0
I20260926 16:24:54.656316 4930 rpc-test-base.h:240] got call: sleep_micros: 500 pattern: 4294967295 num_repetitions: 2097152 sidecar_idx: 0
I20260926 16:24:54.875301 4930 rpc-test-base.h:240] got call: sleep_micros: 500 pattern: 4294967295 num_repetitions: 2097152 sidecar_idx: 0
I20260926 16:24:55.080528 4930 rpc-test-base.h:240] got call: sleep_micros: 500 pattern: 4294967295 num_repetitions: 2097152 sidecar_idx: 0
W20260926 16:24:55.095402 4924 connection.cc:196] Error closing socket: Network error: TlsSocket::Close: Broken pipe
W20260926 16:24:55.214840 4924 connection.cc:441] server connection from unix:<unnamed> torn down before Call kudu.rpc.GenericCalculatorService.SleepWithSidecar from unix:<unnamed> (request call id 9) could send its response
[ OK ] Parameters/TestRpc.TestCancellationAsync/SSL_UnixSocket (2107 ms)
[ RUN ] Parameters/TestRpc.TestPerformanceBySocketType/SSL_UnixSocket
I20260926 16:24:55.313778 4952 acceptor_pool.cc:254] collecting diagnostics on the listening RPC socket unix:/tmp/dist-test-taskQqVPsR/test-tmp/rpc-test-635a617ed4e94cb3997d3775ff0e6883.sock every 8 connection(s)
I20260926 16:24:55.314543 4953 acceptor_pool.cc:254] collecting diagnostics on the listening RPC socket unix:/tmp/dist-test-taskQqVPsR/test-tmp/rpc-test-635a617ed4e94cb3997d3775ff0e6883.sock every 8 connection(s)
I20260926 16:24:55.317683 4502 rpc-test.cc:1846] Connecting to unix:/tmp/dist-test-taskQqVPsR/test-tmp/rpc-test-635a617ed4e94cb3997d3775ff0e6883.sock
I20260926 16:25:16.953678 4502 rpc-test.cc:1859] Sending 1024MB via ssl-enabled unix socket: real 21.616s user 19.321s sys 13.029s
I20260926 16:25:38.607740 4502 rpc-test.cc:1859] Sending 1024MB via ssl-enabled unix socket: real 21.654s user 19.346s sys 13.039s
I20260926 16:25:59.714114 4502 rpc-test.cc:1859] Sending 1024MB via ssl-enabled unix socket: real 21.106s user 18.633s sys 12.755s
I20260926 16:26:21.096550 4502 rpc-test.cc:1859] Sending 1024MB via ssl-enabled unix socket: real 21.382s user 18.894s sys 12.976s
I20260926 16:26:42.145387 4502 rpc-test.cc:1859] Sending 1024MB via ssl-enabled unix socket: real 21.048s user 18.517s sys 12.754s
W20260926 16:26:42.151860 4949 connection.cc:196] Error closing socket: Network error: TlsSocket::Close: Broken pipe
[ OK ] Parameters/TestRpc.TestPerformanceBySocketType/SSL_UnixSocket (106938 ms)
[----------] 20 tests from Parameters/TestRpc (270107 ms total)
[----------] 1 test from Parameters/TestRpcSocketTxRxQueue
[ RUN ] Parameters/TestRpcSocketTxRxQueue.AcceptorRxQueueSizeMetric/0
I20260926 16:26:42.179152 4987 acceptor_pool.cc:254] collecting diagnostics on the listening RPC socket 0.0.0.0:41573 every 1 connection(s)
I20260926 16:26:42.180100 4988 acceptor_pool.cc:254] collecting diagnostics on the listening RPC socket 0.0.0.0:41573 every 1 connection(s)
W20260926 16:26:42.185845 4983 negotiation.cc:337] Failed RPC negotiation. Trace:
0926 16:26:42.184238 (+ 0us) reactor.cc:625] Submitting negotiation task for server connection from 127.0.0.1:35392 (local address 127.0.0.1:41573)
0926 16:26:42.184754 (+ 516us) server_negotiation.cc:206] Beginning negotiation
0926 16:26:42.184778 (+ 24us) server_negotiation.cc:399] Waiting for connection header
0926 16:26:42.185004 (+ 226us) negotiation.cc:327] Negotiation complete: Network error: Server connection negotiation failed: server connection from 127.0.0.1:35392: BlockingRecv error: recv got EOF from 127.0.0.1:35392 (error 108)
Metrics: {"server-negotiator.queue_time_us":138}
[ OK ] Parameters/TestRpcSocketTxRxQueue.AcceptorRxQueueSizeMetric/0 (30 ms)
[----------] 1 test from Parameters/TestRpcSocketTxRxQueue (30 ms total)
[----------] Global test environment tear-down
[==========] 21 tests from 2 test suites ran. (270138 ms total)
[ PASSED ] 20 tests.
[ FAILED ] 1 test, listed below:
[ FAILED ] Parameters/TestRpc.TestCallWithChainCertAndChainCA/SSL_UnixSocket, where GetParam() = (true, true)
1 FAILED TEST