Diagnosed failure

Parameters/TestRpc.TestCallWithChainCertAndChainCA/SSL_UnixSocket: /data0/somelongdirectorytoavoidrpathissues/src/kudu/src/kudu/rpc/rpc-test.cc:270: Failure
Failed
Bad status: Runtime error: could not verify certificate chain (error with cert: subject=CN = localhost, ST = sadfjas, C = AS, emailAddress = sdflkdsajf, O = lskdfjlsad, OU = sldfkja, issuer=C = AS, ST = ASDfkjdhf, L = lskdjf, O = saldfja, OU = skdjf, CN = localhost, emailAddress = sadjflkadsj): : certificate has expired
Google Test trace:
/data0/somelongdirectorytoavoidrpathissues/src/kudu/src/kudu/rpc/rpc-test.cc:267: Connecting to unix:/tmp/dist-test-task2o9j5j/test-tmp/rpc-test-887b669656e6430abc7ee3c8527d41b8.sock
I20260924 15:59:22.307857 29761 test_util.cc:175] -----------------------------------------------
I20260924 15:59:22.307966 29761 test_util.cc:176] Had fatal failures, leaving test files at /tmp/dist-test-task2o9j5j/test-tmp/rpc-test.6.Parameters_TestRpc.TestCallWithChainCertAndChainCA_SSL_UnixSocket.1790265562140323-29761-0

Full log

Note: This is test shard 7 of 8.
[==========] Running 21 tests from 2 test suites.
[----------] Global test environment set-up.
[----------] 20 tests from Parameters/TestRpc
[ RUN      ] Parameters/TestRpc.TestMessengerCreateDestroy/SSL_UnixSocket
WARNING: Logging before InitGoogleLogging() is written to STDERR
I20260924 15:59:22.222431 29761 rpc-test.cc:169] started messenger TestCreateDestroy
[       OK ] Parameters/TestRpc.TestMessengerCreateDestroy/SSL_UnixSocket (42 ms)
[ RUN      ] Parameters/TestRpc.TestNegotiationDeadlock/SSL_UnixSocket
I20260924 15:59:22.237191 29781 acceptor_pool.cc:254] collecting diagnostics on the listening RPC socket unix:/tmp/dist-test-task2o9j5j/test-tmp/rpc-test-c79f5dd37c6549aeb34eaae78ae87174.sock every 8 connection(s)
I20260924 15:59:22.237568 29782 acceptor_pool.cc:254] collecting diagnostics on the listening RPC socket unix:/tmp/dist-test-task2o9j5j/test-tmp/rpc-test-c79f5dd37c6549aeb34eaae78ae87174.sock every 8 connection(s)
[       OK ] Parameters/TestRpc.TestNegotiationDeadlock/SSL_UnixSocket (36 ms)
[ RUN      ] Parameters/TestRpc.TestCallWithChainCertAndChainCA/SSL_UnixSocket
I20260924 15:59:22.295303 29797 acceptor_pool.cc:254] collecting diagnostics on the listening RPC socket unix:/tmp/dist-test-task2o9j5j/test-tmp/rpc-test-887b669656e6430abc7ee3c8527d41b8.sock every 8 connection(s)
I20260924 15:59:22.295675 29798 acceptor_pool.cc:254] collecting diagnostics on the listening RPC socket unix:/tmp/dist-test-task2o9j5j/test-tmp/rpc-test-887b669656e6430abc7ee3c8527d41b8.sock every 8 connection(s)
/data0/somelongdirectorytoavoidrpathissues/src/kudu/src/kudu/rpc/rpc-test.cc:270: Failure
Failed
Bad status: Runtime error: could not verify certificate chain (error with cert: subject=CN = localhost, ST = sadfjas, C = AS, emailAddress = sdflkdsajf, O = lskdfjlsad, OU = sldfkja, issuer=C = AS, ST = ASDfkjdhf, L = lskdjf, O = saldfja, OU = skdjf, CN = localhost, emailAddress = sadjflkadsj): : certificate has expired
Google Test trace:
/data0/somelongdirectorytoavoidrpathissues/src/kudu/src/kudu/rpc/rpc-test.cc:267: Connecting to unix:/tmp/dist-test-task2o9j5j/test-tmp/rpc-test-887b669656e6430abc7ee3c8527d41b8.sock
I20260924 15:59:22.307857 29761 test_util.cc:175] -----------------------------------------------
I20260924 15:59:22.307966 29761 test_util.cc:176] Had fatal failures, leaving test files at /tmp/dist-test-task2o9j5j/test-tmp/rpc-test.6.Parameters_TestRpc.TestCallWithChainCertAndChainCA_SSL_UnixSocket.1790265562140323-29761-0
[  FAILED  ] Parameters/TestRpc.TestCallWithChainCertAndChainCA/SSL_UnixSocket, where GetParam() = (true, true) (45 ms)
[ RUN      ] Parameters/TestRpc.TestCallWithPasswordProtectedKey/SSL_UnixSocket
I20260924 15:59:22.342561 29823 acceptor_pool.cc:254] collecting diagnostics on the listening RPC socket unix:/tmp/dist-test-task2o9j5j/test-tmp/rpc-test-ca2a9cd7e8fe428c8150bf6c1daa73b6.sock every 8 connection(s)
I20260924 15:59:22.342783 29824 acceptor_pool.cc:254] collecting diagnostics on the listening RPC socket unix:/tmp/dist-test-task2o9j5j/test-tmp/rpc-test-ca2a9cd7e8fe428c8150bf6c1daa73b6.sock every 8 connection(s)
W20260924 15:59:22.374140 29820 connection.cc:196] Error closing socket: Network error: TlsSocket::Close: Broken pipe
[       OK ] Parameters/TestRpc.TestCallWithPasswordProtectedKey/SSL_UnixSocket (70 ms)
[ RUN      ] Parameters/TestRpc.TestCallToBadServer/SSL_UnixSocket
I20260924 15:59:22.400636 29761 rpc-test.cc:394] Status: Network error: Client connection negotiation failed: client connection to 0.0.0.0:0: connect: Connection refused (error 111)
I20260924 15:59:22.401407 29761 rpc-test.cc:394] Status: Network error: Client connection negotiation failed: client connection to 0.0.0.0:0: connect: Connection refused (error 111)
I20260924 15:59:22.402170 29761 rpc-test.cc:394] Status: Network error: Client connection negotiation failed: client connection to 0.0.0.0:0: connect: Connection refused (error 111)
I20260924 15:59:22.402751 29761 rpc-test.cc:394] Status: Network error: Client connection negotiation failed: client connection to 0.0.0.0:0: connect: Connection refused (error 111)
I20260924 15:59:22.403332 29761 rpc-test.cc:394] Status: Network error: Client connection negotiation failed: client connection to 0.0.0.0:0: connect: Connection refused (error 111)
[       OK ] Parameters/TestRpc.TestCallToBadServer/SSL_UnixSocket (27 ms)
[ RUN      ] Parameters/TestRpc.TestWrongService/SSL_UnixSocket
I20260924 15:59:22.419997 29860 acceptor_pool.cc:254] collecting diagnostics on the listening RPC socket unix:/tmp/dist-test-task2o9j5j/test-tmp/rpc-test-870ac4f44c204d3e83346c81a45506fe.sock every 8 connection(s)
I20260924 15:59:22.420372 29861 acceptor_pool.cc:254] collecting diagnostics on the listening RPC socket unix:/tmp/dist-test-task2o9j5j/test-tmp/rpc-test-870ac4f44c204d3e83346c81a45506fe.sock every 8 connection(s)
I20260924 15:59:22.489223 29857 messenger.cc:345] service WrongServiceName not registered on TestServer
[       OK ] Parameters/TestRpc.TestWrongService/SSL_UnixSocket (88 ms)
[ RUN      ] Parameters/TestRpc.TestConnectionKeepalive/SSL_UnixSocket
I20260924 15:59:22.529157 29883 acceptor_pool.cc:254] collecting diagnostics on the listening RPC socket unix:/tmp/dist-test-task2o9j5j/test-tmp/rpc-test-63b248e2a1ae4d80b9d9d3d1a435180d.sock every 8 connection(s)
I20260924 15:59:22.529428 29884 acceptor_pool.cc:254] collecting diagnostics on the listening RPC socket unix:/tmp/dist-test-task2o9j5j/test-tmp/rpc-test-63b248e2a1ae4d80b9d9d3d1a435180d.sock every 8 connection(s)
I20260924 15:59:22.530233 29761 rpc-test.cc:488] Connecting to unix:/tmp/dist-test-task2o9j5j/test-tmp/rpc-test-63b248e2a1ae4d80b9d9d3d1a435180d.sock
W20260924 15:59:22.996143 29896 connection.cc:196] Error closing socket: Network error: TlsSocket::Close: Broken pipe
[       OK ] Parameters/TestRpc.TestConnectionKeepalive/SSL_UnixSocket (1069 ms)
[ RUN      ] Parameters/TestRpc.TestClientConnectionMetrics/SSL_UnixSocket
I20260924 15:59:23.574054 29908 acceptor_pool.cc:254] collecting diagnostics on the listening RPC socket unix:/tmp/dist-test-task2o9j5j/test-tmp/rpc-test-261f7afce95b4811a92c191a0c688b23.sock every 8 connection(s)
I20260924 15:59:23.574357 29909 acceptor_pool.cc:254] collecting diagnostics on the listening RPC socket unix:/tmp/dist-test-task2o9j5j/test-tmp/rpc-test-261f7afce95b4811a92c191a0c688b23.sock every 8 connection(s)
I20260924 15:59:23.575186 29761 rpc-test.cc:569] Connecting to unix:/tmp/dist-test-task2o9j5j/test-tmp/rpc-test-261f7afce95b4811a92c191a0c688b23.sock
W20260924 15:59:44.997296 29905 connection.cc:196] Error closing socket: Network error: TlsSocket::Close: Broken pipe
[       OK ] Parameters/TestRpc.TestClientConnectionMetrics/SSL_UnixSocket (21440 ms)
[ RUN      ] Parameters/TestRpc.TestCredentialsPolicy/SSL_UnixSocket
I20260924 15:59:45.026908 29931 acceptor_pool.cc:254] collecting diagnostics on the listening RPC socket unix:/tmp/dist-test-task2o9j5j/test-tmp/rpc-test-14a488e4ce9f4387a511d4ef425c0de5.sock every 8 connection(s)
I20260924 15:59:45.027148 29932 acceptor_pool.cc:254] collecting diagnostics on the listening RPC socket unix:/tmp/dist-test-task2o9j5j/test-tmp/rpc-test-14a488e4ce9f4387a511d4ef425c0de5.sock every 8 connection(s)
I20260924 15:59:45.028370 29761 rpc-test.cc:700] Connecting to unix:/tmp/dist-test-task2o9j5j/test-tmp/rpc-test-14a488e4ce9f4387a511d4ef425c0de5.sock
W20260924 15:59:45.049453 29930 connection.cc:196] Error closing socket: Network error: TlsSocket::Close: Broken pipe
W20260924 15:59:45.057674 29930 connection.cc:196] Error closing socket: Network error: TlsSocket::Close: Broken pipe
[       OK ] Parameters/TestRpc.TestCredentialsPolicy/SSL_UnixSocket (57 ms)
[ RUN      ] Parameters/TestRpc.TestCallLongerThanKeepalive/SSL_UnixSocket
I20260924 15:59:45.080092 29958 acceptor_pool.cc:254] collecting diagnostics on the listening RPC socket unix:/tmp/dist-test-task2o9j5j/test-tmp/rpc-test-2c0d4888230a45a58ab0d347a26a292f.sock every 8 connection(s)
I20260924 15:59:45.080313 29959 acceptor_pool.cc:254] collecting diagnostics on the listening RPC socket unix:/tmp/dist-test-task2o9j5j/test-tmp/rpc-test-2c0d4888230a45a58ab0d347a26a292f.sock every 8 connection(s)
I20260924 15:59:45.103214 29962 rpc-test-base.h:222] got call: sleep_micros: 3000000 deferred: true
I20260924 15:59:48.105024 29962 rpcz_store.cc:275] Call kudu.rpc.GenericCalculatorService.Sleep from unix:<unnamed> (request call id 0) took 3001 ms. Trace:
I20260924 15:59:48.105190 29962 rpcz_store.cc:276] 0924 15:59:45.103080 (+     0us) service_pool.cc:170] Inserting onto call queue
0924 15:59:45.103163 (+    83us) service_pool.cc:227] Handling call
0924 15:59:48.104977 (+3001814us) inbound_call.cc:173] Queueing success response
Metrics: {}
[       OK ] Parameters/TestRpc.TestCallLongerThanKeepalive/SSL_UnixSocket (3050 ms)
[ RUN      ] Parameters/TestRpc.TestRpcSidecar/SSL_UnixSocket
I20260924 15:59:48.123560 29984 acceptor_pool.cc:254] collecting diagnostics on the listening RPC socket unix:/tmp/dist-test-task2o9j5j/test-tmp/rpc-test-5a5ea864bd4d4043839c6739c00d2b4c.sock every 8 connection(s)
I20260924 15:59:48.123811 29985 acceptor_pool.cc:254] collecting diagnostics on the listening RPC socket unix:/tmp/dist-test-task2o9j5j/test-tmp/rpc-test-5a5ea864bd4d4043839c6739c00d2b4c.sock every 8 connection(s)
W20260924 15:59:48.227123 29981 connection.cc:196] Error closing socket: Network error: TlsSocket::Close: Broken pipe
[       OK ] Parameters/TestRpc.TestRpcSidecar/SSL_UnixSocket (119 ms)
[ RUN      ] Parameters/TestRpc.TestRpcSidecarLimits/SSL_UnixSocket
I20260924 15:59:51.688076 30009 acceptor_pool.cc:254] collecting diagnostics on the listening RPC socket unix:/tmp/dist-test-task2o9j5j/test-tmp/rpc-test-9b5d9e75bed74f72a45d1c2a0bf33907.sock every 8 connection(s)
I20260924 15:59:51.688378 30010 acceptor_pool.cc:254] collecting diagnostics on the listening RPC socket unix:/tmp/dist-test-task2o9j5j/test-tmp/rpc-test-9b5d9e75bed74f72a45d1c2a0bf33907.sock every 8 connection(s)
W20260924 15:59:51.702406 29761 serialization.cc:72] Serialized kudu.rpc_test.PushStringsRequestPB (2147483654 bytes) is larger than the maximum configured RPC message size (52428800 bytes). Sending anyway, but peer may reject the data.
W20260924 15:59:51.709199 30006 connection.cc:535] server connection from unix:<unnamed> recv error: Network error: RPC frame had a length of 2147483714, but we only support messages up to 52428800 bytes long.
W20260924 15:59:51.709354 30006 connection.cc:158] shutting down server connection from unix:<unnamed> with pending inbound data: 4/2147483714 bytes received; last active 0 ns ago: status Network error: RPC frame had a length of 2147483714, but we only support messages up to 52428800 bytes long.
W20260924 15:59:51.709843 30022 connection.cc:196] Error closing socket: Network error: TlsSocket::Close: Broken pipe
I20260924 15:59:51.729357 30034 acceptor_pool.cc:254] collecting diagnostics on the listening RPC socket unix:/tmp/dist-test-task2o9j5j/test-tmp/rpc-test-9b5d9e75bed74f72a45d1c2a0bf33907.sock every 8 connection(s)
I20260924 15:59:51.729539 30035 acceptor_pool.cc:254] collecting diagnostics on the listening RPC socket unix:/tmp/dist-test-task2o9j5j/test-tmp/rpc-test-9b5d9e75bed74f72a45d1c2a0bf33907.sock every 8 connection(s)
W20260924 16:00:06.475329 30031 connection.cc:577] server connection from unix:<unnamed>: received bad data: 'Corruption: Invalid packet: message had a length of 2147483710, but we only support messages up to 2147483647 bytes
'
W20260924 16:00:06.476030 30047 connection.cc:196] Error closing socket: Network error: TlsSocket::Close: Broken pipe
[       OK ] Parameters/TestRpc.TestRpcSidecarLimits/SSL_UnixSocket (18749 ms)
[ RUN      ] Parameters/TestRpc.TestCallTimeoutDoesntAffectNegotiation/SSL_UnixSocket
I20260924 16:00:06.996920 30059 acceptor_pool.cc:254] collecting diagnostics on the listening RPC socket unix:/tmp/dist-test-task2o9j5j/test-tmp/rpc-test-ccb5c60b4d5d446b8919d590b17945da.sock every 8 connection(s)
I20260924 16:00:06.997133 30060 acceptor_pool.cc:254] collecting diagnostics on the listening RPC socket unix:/tmp/dist-test-task2o9j5j/test-tmp/rpc-test-ccb5c60b4d5d446b8919d590b17945da.sock every 8 connection(s)
W20260924 16:00:07.012907 30055 negotiation.cc:266] Injecting 500ms delay in negotiation
I20260924 16:00:07.063272 29761 rpc-test-base.h:595] status: Timed out: connection negotiation to unix:/tmp/dist-test-task2o9j5j/test-tmp/rpc-test-ccb5c60b4d5d446b8919d590b17945da.sock for RPC Sleep timed out after 0.050s (ON_OUTBOUND_QUEUE), seconds elapsed: 0.0511791
[       OK ] Parameters/TestRpc.TestCallTimeoutDoesntAffectNegotiation/SSL_UnixSocket (545 ms)
[ RUN      ] Parameters/TestRpc.TestRpcHandlerLatencyMetric/SSL_UnixSocket
I20260924 16:00:07.547246 30085 acceptor_pool.cc:254] collecting diagnostics on the listening RPC socket unix:/tmp/dist-test-task2o9j5j/test-tmp/rpc-test-9efd37ca22094063a335fd83925434b7.sock every 8 connection(s)
I20260924 16:00:07.547508 30086 acceptor_pool.cc:254] collecting diagnostics on the listening RPC socket unix:/tmp/dist-test-task2o9j5j/test-tmp/rpc-test-9efd37ca22094063a335fd83925434b7.sock every 8 connection(s)
I20260924 16:00:07.605257 29761 rpc-test.cc:1236] Sleep() min lat: 20715
I20260924 16:00:07.605363 29761 rpc-test.cc:1237] Sleep() mean lat: 20715
I20260924 16:00:07.605408 29761 rpc-test.cc:1238] Sleep() max lat: 20715
I20260924 16:00:07.605425 29761 rpc-test.cc:1239] Sleep() #calls: 1
W20260924 16:00:07.606758 30082 connection.cc:196] Error closing socket: Network error: TlsSocket::Close: Broken pipe
[       OK ] Parameters/TestRpc.TestRpcHandlerLatencyMetric/SSL_UnixSocket (84 ms)
[ RUN      ] Parameters/TestRpc.TimedOutOnResponseMetricServiceQueue/SSL_UnixSocket
I20260924 16:00:07.622349 30112 acceptor_pool.cc:254] collecting diagnostics on the listening RPC socket unix:/tmp/dist-test-task2o9j5j/test-tmp/rpc-test-406a03c4a34c470894c2dd74bc9b3a8f.sock every 8 connection(s)
I20260924 16:00:07.622563 30113 acceptor_pool.cc:254] collecting diagnostics on the listening RPC socket unix:/tmp/dist-test-task2o9j5j/test-tmp/rpc-test-406a03c4a34c470894c2dd74bc9b3a8f.sock every 8 connection(s)
W20260924 16:00:07.692763 30114 rpcz_store.cc:267] Call kudu.rpc_test.CalculatorService.Sleep from unix:<unnamed> (request call id 2) took 20 ms (client timeout 20 ms). Trace:
W20260924 16:00:07.692907 30114 rpcz_store.cc:269] 0924 16:00:07.672220 (+     0us) service_pool.cc:170] Inserting onto call queue
0924 16:00:07.692633 (+ 20413us) service_pool.cc:214] Skipping call since client already timed out
0924 16:00:07.692738 (+   105us) inbound_call.cc:173] Queueing failure response
Metrics: {}
W20260924 16:00:07.694213 30109 connection.cc:196] Error closing socket: Network error: TlsSocket::Close: Broken pipe
[       OK ] Parameters/TestRpc.TimedOutOnResponseMetricServiceQueue/SSL_UnixSocket (87 ms)
[ RUN      ] Parameters/TestRpc.RpcPendingConnectionsMetric/SSL_UnixSocket
I20260924 16:00:07.702607 30136 acceptor_pool.cc:254] collecting diagnostics on the listening RPC socket 0.0.0.0:39111 every 8 connection(s)
I20260924 16:00:07.702881 30137 acceptor_pool.cc:254] collecting diagnostics on the listening RPC socket 0.0.0.0:39111 every 8 connection(s)
W20260924 16:00:07.705103 30132 negotiation.cc:337] Failed RPC negotiation. Trace:
0924 16:00:07.704395 (+     0us) reactor.cc:625] Submitting negotiation task for server connection from 127.0.0.1:50030 (local address 127.0.0.1:39111)
0924 16:00:07.704563 (+   168us) server_negotiation.cc:206] Beginning negotiation
0924 16:00:07.704567 (+     4us) server_negotiation.cc:399] Waiting for connection header
0924 16:00:07.704742 (+   175us) negotiation.cc:327] Negotiation complete: Network error: Server connection negotiation failed: server connection from 127.0.0.1:50030: BlockingRecv error: recv got EOF from 127.0.0.1:50030 (error 108)
Metrics: {"server-negotiator.queue_time_us":46}
[       OK ] Parameters/TestRpc.RpcPendingConnectionsMetric/SSL_UnixSocket (20 ms)
[ RUN      ] Parameters/TestRpc.TestRpcContextClientDeadline/SSL_UnixSocket
I20260924 16:00:07.735301 30152 acceptor_pool.cc:254] collecting diagnostics on the listening RPC socket unix:/tmp/dist-test-task2o9j5j/test-tmp/rpc-test-9bfdf95c5e574b18b1db748ba592a771.sock every 8 connection(s)
I20260924 16:00:07.735502 30153 acceptor_pool.cc:254] collecting diagnostics on the listening RPC socket unix:/tmp/dist-test-task2o9j5j/test-tmp/rpc-test-9bfdf95c5e574b18b1db748ba592a771.sock every 8 connection(s)
W20260924 16:00:07.783311 30149 connection.cc:196] Error closing socket: Network error: TlsSocket::Close: Broken pipe
[       OK ] Parameters/TestRpc.TestRpcContextClientDeadline/SSL_UnixSocket (68 ms)
[ RUN      ] Parameters/TestRpc.TestApplicationFeatureFlagUnsupportedServer/SSL_UnixSocket
I20260924 16:00:07.802533 30177 acceptor_pool.cc:254] collecting diagnostics on the listening RPC socket unix:/tmp/dist-test-task2o9j5j/test-tmp/rpc-test-24fd375fdee24f9895bcd0caf76c2a0d.sock every 8 connection(s)
I20260924 16:00:07.802745 30178 acceptor_pool.cc:254] collecting diagnostics on the listening RPC socket unix:/tmp/dist-test-task2o9j5j/test-tmp/rpc-test-24fd375fdee24f9895bcd0caf76c2a0d.sock every 8 connection(s)
[       OK ] Parameters/TestRpc.TestApplicationFeatureFlagUnsupportedServer/SSL_UnixSocket (51 ms)
[ RUN      ] Parameters/TestRpc.TestCancellationAsync/SSL_UnixSocket
I20260924 16:00:07.869767 30202 acceptor_pool.cc:254] collecting diagnostics on the listening RPC socket unix:/tmp/dist-test-task2o9j5j/test-tmp/rpc-test-eea29028af9849cb91f76ae624975878.sock every 8 connection(s)
I20260924 16:00:07.870021 30203 acceptor_pool.cc:254] collecting diagnostics on the listening RPC socket unix:/tmp/dist-test-task2o9j5j/test-tmp/rpc-test-eea29028af9849cb91f76ae624975878.sock every 8 connection(s)
I20260924 16:00:07.871212 29761 rpc-test.cc:1716] Connecting to unix:/tmp/dist-test-task2o9j5j/test-tmp/rpc-test-eea29028af9849cb91f76ae624975878.sock
I20260924 16:00:07.903810 29761 test_util.cc:268] Using random seed: -1315120597
I20260924 16:00:07.940961 30206 rpc-test-base.h:240] got call: sleep_micros: 500 pattern: 4294967295 num_repetitions: 2097152 sidecar_idx: 0
I20260924 16:00:07.967758 30205 rpc-test-base.h:240] got call: sleep_micros: 500 pattern: 4294967295 num_repetitions: 2097152 sidecar_idx: 0
I20260924 16:00:07.996706 30206 rpc-test-base.h:240] got call: sleep_micros: 500 pattern: 4294967295 num_repetitions: 2097152 sidecar_idx: 0
I20260924 16:00:08.028767 30205 rpc-test-base.h:240] got call: sleep_micros: 500 pattern: 4294967295 num_repetitions: 2097152 sidecar_idx: 0
I20260924 16:00:08.059401 30206 rpc-test-base.h:240] got call: sleep_micros: 500 pattern: 4294967295 num_repetitions: 2097152 sidecar_idx: 0
I20260924 16:00:08.090126 30205 rpc-test-base.h:240] got call: sleep_micros: 500 pattern: 4294967295 num_repetitions: 2097152 sidecar_idx: 0
I20260924 16:00:08.121205 30206 rpc-test-base.h:240] got call: sleep_micros: 500 pattern: 4294967295 num_repetitions: 2097152 sidecar_idx: 0
I20260924 16:00:08.152807 30205 rpc-test-base.h:240] got call: sleep_micros: 500 pattern: 4294967295 num_repetitions: 2097152 sidecar_idx: 0
W20260924 16:00:08.155109 30199 connection.cc:196] Error closing socket: Network error: TlsSocket::Close: Broken pipe
W20260924 16:00:08.179754 30199 connection.cc:441] server connection from unix:<unnamed> torn down before Call kudu.rpc.GenericCalculatorService.SleepWithSidecar from unix:<unnamed> (request call id 8) could send its response
W20260924 16:00:08.197929 30199 connection.cc:441] server connection from unix:<unnamed> torn down before Call kudu.rpc.GenericCalculatorService.SleepWithSidecar from unix:<unnamed> (request call id 9) could send its response
[       OK ] Parameters/TestRpc.TestCancellationAsync/SSL_UnixSocket (362 ms)
[ RUN      ] Parameters/TestRpc.TestPerformanceBySocketType/SSL_UnixSocket
I20260924 16:00:08.220745 30228 acceptor_pool.cc:254] collecting diagnostics on the listening RPC socket unix:/tmp/dist-test-task2o9j5j/test-tmp/rpc-test-e48289d98fce4fc8872bd706d0e1d60b.sock every 8 connection(s)
I20260924 16:00:08.220953 30229 acceptor_pool.cc:254] collecting diagnostics on the listening RPC socket unix:/tmp/dist-test-task2o9j5j/test-tmp/rpc-test-e48289d98fce4fc8872bd706d0e1d60b.sock every 8 connection(s)
I20260924 16:00:08.221830 29761 rpc-test.cc:1846] Connecting to unix:/tmp/dist-test-task2o9j5j/test-tmp/rpc-test-e48289d98fce4fc8872bd706d0e1d60b.sock
I20260924 16:00:11.692315 29761 rpc-test.cc:1859] Sending 1024MB via ssl-enabled unix socket: real 3.453s	user 3.434s	sys 2.337s
I20260924 16:00:15.193313 29761 rpc-test.cc:1859] Sending 1024MB via ssl-enabled unix socket: real 3.501s	user 3.479s	sys 2.355s
I20260924 16:00:18.763633 29761 rpc-test.cc:1859] Sending 1024MB via ssl-enabled unix socket: real 3.570s	user 3.512s	sys 2.445s
I20260924 16:00:22.117363 29761 rpc-test.cc:1859] Sending 1024MB via ssl-enabled unix socket: real 3.354s	user 3.344s	sys 2.254s
I20260924 16:00:25.450981 29761 rpc-test.cc:1859] Sending 1024MB via ssl-enabled unix socket: real 3.333s	user 3.179s	sys 2.426s
W20260924 16:00:25.453104 30225 connection.cc:196] Error closing socket: Network error: TlsSocket::Close: Broken pipe
[       OK ] Parameters/TestRpc.TestPerformanceBySocketType/SSL_UnixSocket (17256 ms)
[----------] 20 tests from Parameters/TestRpc (63276 ms total)

[----------] 1 test from Parameters/TestRpcSocketTxRxQueue
[ RUN      ] Parameters/TestRpcSocketTxRxQueue.AcceptorRxQueueSizeMetric/0
I20260924 16:00:25.468052 30254 acceptor_pool.cc:254] collecting diagnostics on the listening RPC socket 0.0.0.0:44165 every 1 connection(s)
I20260924 16:00:25.468271 30255 acceptor_pool.cc:254] collecting diagnostics on the listening RPC socket 0.0.0.0:44165 every 1 connection(s)
W20260924 16:00:25.469966 30250 negotiation.cc:337] Failed RPC negotiation. Trace:
0924 16:00:25.469550 (+     0us) reactor.cc:625] Submitting negotiation task for server connection from 127.0.0.1:55186 (local address 127.0.0.1:44165)
0924 16:00:25.469708 (+   158us) server_negotiation.cc:206] Beginning negotiation
0924 16:00:25.469712 (+     4us) server_negotiation.cc:399] Waiting for connection header
0924 16:00:25.469841 (+   129us) negotiation.cc:327] Negotiation complete: Network error: Server connection negotiation failed: server connection from 127.0.0.1:55186: BlockingRecv error: recv got EOF from 127.0.0.1:55186 (error 108)
Metrics: {"server-negotiator.queue_time_us":50}
[       OK ] Parameters/TestRpcSocketTxRxQueue.AcceptorRxQueueSizeMetric/0 (14 ms)
[----------] 1 test from Parameters/TestRpcSocketTxRxQueue (14 ms total)

[----------] Global test environment tear-down
[==========] 21 tests from 2 test suites ran. (63291 ms total)
[  PASSED  ] 20 tests.
[  FAILED  ] 1 test, listed below:
[  FAILED  ] Parameters/TestRpc.TestCallWithChainCertAndChainCA/SSL_UnixSocket, where GetParam() = (true, true)

 1 FAILED TEST